EE Transaction Type,Dependent Transaction Type,Effective Date,EE Signature,EE Signature Date,Control,Suffix,Account,Plan Number,Plan Name,Claim Office,Network ID Number,Customer Code,EE SSN,Dependent SSN,Dependent Relationship,Last Name,First Name,Middle Initial,DOB,Gender,Ethnicity,PCP/PCD,PCP/PCD Current Patient,Provider Cap Office Number,COB,Dep Student Indicator,Dep OOA Indicator,EE Prior Coverage Indicator,EE Late Entrant,EE Language Indicator,Hire Date,Earnings,Earnings Frequency,Beneficiary (Last Name First Name MI),Beneficiary Relationship,Continuation of Coverage Expiration Date,Continuation of Coverage Event Date,Continuation of Coverage Length of Coverage,Work Location Zip Code,Street Address Line 1,Street Address Line 2,City,State,Zip Code,Home Phone Number,Work Phone Number,Accept Code,Evidence Code,EE Email Address,Communication Disability Code,EE Alternate ID,Dep Alternate ID,Old Control,Old Suffix,Old Account,New Control,New Suffix,New Account,
Not captured,Not captured,04/04/2020,Not captured,Not captured,863949,020,00072,ARS-02-0055664,Beacon America,Not captured,Not captured,Not captured,,,,Sunkam Narayana Iyengar,Ramanujam,,09/30/1954,male,Not captured,Not captured,Not captured,Not captured,Not captured,Not captured,Not captured,Not captured,Not captured,Not captured,Not captured,Not captured,Not captured,,,Not captured,Not captured,Not captured,Not captured,1125 Queensbridge way,,San Jose,CA,95120,,,Not captured,Not captured,rohit.kgp@gmail.com,Not captured,802047936,,Not captured,Not captured,Not captured,Not captured,Not captured,Not captured,
Not captured,Not captured,04/04/2020,Not captured,Not captured,863949,020,00072,ARS-01-0055663,Beacon International,Not captured,Not captured,Not captured,,,,Hurdle,Abraham,L,04/17/1982,male,Not captured,Not captured,Not captured,Not captured,Not captured,Not captured,Not captured,Not captured,Not captured,Not captured,Not captured,Not captured,Not captured,,,Not captured,Not captured,Not captured,Not captured,1949 Eutaw Place,,Baltimore,Maryland,21217,,,Not captured,Not captured,ABRAHAMHURDLE@GMAIL.COM,Not captured,802047935,,Not captured,Not captured,Not captured,Not captured,Not captured,Not captured,
Not captured,Not captured,04/03/2020,Not captured,Not captured,863949,020,00072,ARS-02-0055661,Beacon America,Not captured,Not captured,Not captured,Passport(PC557018),,,Shema Ndagijimana,Axel ,,04/08/1999,male,Not captured,Not captured,Not captured,Not captured,Not captured,Not captured,Not captured,Not captured,Not captured,Not captured,Not captured,Not captured,Not captured,,,Not captured,Not captured,Not captured,Not captured,524 angliana ave,,Lexington,Kentucky,40508,8593338755,,Not captured,Not captured,axelshema7@gmail.com,Not captured,802047933,,Not captured,Not captured,Not captured,Not captured,Not captured,Not captured,
Not captured,Not captured,04/01/2020,Not captured,Not captured,863949,020,00072,ARS-03-0055654,Essential America,Not captured,Not captured,Not captured,Passport(642559850),,,Guild,Eric,Timothy,04/27/1972,male,Not captured,Not captured,Not captured,Not captured,Not captured,Not captured,Not captured,Not captured,Not captured,Not captured,Not captured,Not captured,Not captured,,,Not captured,Not captured,Not captured,Not captured,P.O. Box 1371,,Mwanza,Mwanza,,255754809234,,Not captured,Not captured,eric.guild@gmail.com,Not captured,802047916,,Not captured,Not captured,Not captured,Not captured,Not captured,Not captured,
Not captured,Not captured,04/01/2020,Not captured,Not captured,863949,020,00072,ARS-03-0055654,Essential America,Not captured,Not captured,Not captured,,Passport(488521513),Spouse,Guild,Susan,Elaine,08/29/1974,female,Not captured,Not captured,Not captured,Not captured,Not captured,Not captured,Not captured,Not captured,Not captured,Not captured,Not captured,Not captured,Not captured,,,Not captured,Not captured,Not captured,Not captured,P.O. Box 1371,,Mwanza,Mwanza,,255754809234,,Not captured,Not captured,eric.guild@gmail.com,Not captured,,802047917,Not captured,Not captured,Not captured,Not captured,Not captured,Not captured,
Not captured,Not captured,04/01/2020,Not captured,Not captured,863949,020,00072,ARS-03-0055654,Essential America,Not captured,Not captured,Not captured,,Passport(642559851),Dependant,Guild,Matthew,Adrian,07/24/2000,male,Not captured,Not captured,Not captured,Not captured,Not captured,Not captured,Not captured,Not captured,Not captured,Not captured,Not captured,Not captured,Not captured,,,Not captured,Not captured,Not captured,Not captured,P.O. Box 1371,,Mwanza,Mwanza,,255754809234,,Not captured,Not captured,eric.guild@gmail.com,Not captured,,802047918,Not captured,Not captured,Not captured,Not captured,Not captured,Not captured,
Not captured,Not captured,04/01/2020,Not captured,Not captured,863949,020,00072,ARS-03-0055654,Essential America,Not captured,Not captured,Not captured,,Passport(561126214),Dependant,Guild,Anna,Victoria,09/24/2002,female,Not captured,Not captured,Not captured,Not captured,Not captured,Not captured,Not captured,Not captured,Not captured,Not captured,Not captured,Not captured,Not captured,,,Not captured,Not captured,Not captured,Not captured,P.O. Box 1371,,Mwanza,Mwanza,,255754809234,,Not captured,Not captured,eric.guild@gmail.com,Not captured,,802047919,Not captured,Not captured,Not captured,Not captured,Not captured,Not captured,
Not captured,Not captured,04/01/2020,Not captured,Not captured,863949,020,00072,ARS-03-0055654,Essential America,Not captured,Not captured,Not captured,,Passport(567073871),Dependant,Guild,Rebecca,Elaine,05/12/2003,female,Not captured,Not captured,Not captured,Not captured,Not captured,Not captured,Not captured,Not captured,Not captured,Not captured,Not captured,Not captured,Not captured,,,Not captured,Not captured,Not captured,Not captured,P.O. Box 1371,,Mwanza,Mwanza,,255754809234,,Not captured,Not captured,eric.guild@gmail.com,Not captured,,802047920,Not captured,Not captured,Not captured,Not captured,Not captured,Not captured,
Not captured,Not captured,04/01/2020,Not captured,Not captured,863949,020,00072,ARS-03-0055654,Essential America,Not captured,Not captured,Not captured,,Passport(567073872),Dependant,Guild,Elisabeth,Joelle,10/19/2010,female,Not captured,Not captured,Not captured,Not captured,Not captured,Not captured,Not captured,Not captured,Not captured,Not captured,Not captured,Not captured,Not captured,,,Not captured,Not captured,Not captured,Not captured,P.O. Box 1371,,Mwanza,Mwanza,,255754809234,,Not captured,Not captured,eric.guild@gmail.com,Not captured,,802047921,Not captured,Not captured,Not captured,Not captured,Not captured,Not captured,
Not captured,Not captured,04/02/2020,Not captured,Not captured,863949,020,00072,ARS-01-0055656,Beacon International,Not captured,Not captured,Not captured,Passport(492402200),,,Malgren,Erik,,12/28/1988,male,Not captured,Not captured,Not captured,Not captured,Not captured,Not captured,Not captured,Not captured,Not captured,Not captured,Not captured,Not captured,Not captured,Eric Malgren,Father,Not captured,Not captured,Not captured,Not captured,325 Badger Drive,,Baraboo,Wisconsin,53913,+79650465264,,Not captured,Not captured,malgrenerik@gmail.com,Not captured,802047923,,Not captured,Not captured,Not captured,Not captured,Not captured,Not captured,
Not captured,Not captured,04/01/2020,Not captured,Not captured,863949,020,00072,ARS-01-0055655,Beacon International,Not captured,Not captured,Not captured,,,,Duncan,Michelle,J,10/01/1964,female,Not captured,Not captured,Not captured,Not captured,Not captured,Not captured,Not captured,Not captured,Not captured,Not captured,Not captured,Not captured,Not captured,,,Not captured,Not captured,Not captured,Not captured,6275 University Dr NW,,Huntsville,Alabama,35806,2563619799,,Not captured,Not captured,mduncan.belize@gmail.com,Not captured,802047922,,Not captured,Not captured,Not captured,Not captured,Not captured,Not captured,
Not captured,Not captured,04/01/2020,Not captured,Not captured,863949,020,00072,ARS-01-0055653,Beacon International,Not captured,Not captured,Not captured,Passport(128802339),,,HENRIQUEZ HIDALGO,ARMANDO JESUS,,11/06/1959,male,Not captured,Not captured,Not captured,Not captured,Not captured,Not captured,Not captured,Not captured,Not captured,Not captured,Not captured,Not captured,Not captured,CARLA RUSSO,SPOUSE,Not captured,Not captured,Not captured,Not captured,11549 NW 62ND TER,,DORAL,Florida,33178,+17868328519,,Not captured,Not captured,armando.hh@gmail.com,Not captured,802047915,,Not captured,Not captured,Not captured,Not captured,Not captured,Not captured,
Not captured,Not captured,04/01/2020,Not captured,Not captured,863949,020,00072,ARS-03-0055640,Essential America,Not captured,Not captured,Not captured,Passport(BE4206854),,,Iljazi,Servi ,,10/26/2001,male,Not captured,Not captured,Not captured,Not captured,Not captured,Not captured,Not captured,Not captured,Not captured,Not captured,Not captured,Not captured,Not captured,,,Not captured,Not captured,Not captured,Not captured,319 Barrow St 2B,,Jersey City,New Jersey,07302,9174507828,,Not captured,Not captured,mimosa.90@hotmail.it,Not captured,802047893,,Not captured,Not captured,Not captured,Not captured,Not captured,Not captured,
Not captured,Not captured,03/30/2020,Not captured,Not captured,863949,020,00072,ARS-03-0055324,Essential America,Not captured,Not captured,Not captured,Passport(542349946),,,Haden,Sheri,Lynn,12/18/1968,female,Not captured,Not captured,Not captured,Not captured,Not captured,Not captured,Not captured,Not captured,Not captured,Not captured,Not captured,Not captured,Not captured,,,Not captured,Not captured,Not captured,Not captured,6163 off Airport Rd,,Livingstone,,,+260960504356,,Not captured,Not captured,joseph.g.haden@gmail.com,Not captured,802046980,,Not captured,Not captured,Not captured,Not captured,Not captured,Not captured,
Not captured,Not captured,03/30/2020,Not captured,Not captured,863949,020,00072,ARS-04-0055614,Enhanced America,Not captured,Not captured,Not captured,Passport(hp295443),,,Bowie,Brandon,,05/21/1994,male,Not captured,Not captured,Not captured,Not captured,Not captured,Not captured,Not captured,Not captured,Not captured,Not captured,Not captured,Not captured,Not captured,,,Not captured,Not captured,Not captured,Not captured,Residence 141 Four Seasons Resorts and Residences,,barnes bay west end,,,6025247621,,Not captured,Not captured,brandon.j.bowie@gmail.com,Not captured,802047867,,Not captured,Not captured,Not captured,Not captured,Not captured,Not captured,
Not captured,Not captured,03/29/2020,Not captured,Not captured,863949,020,00072,ARS-02-0055644,Beacon America,Not captured,Not captured,Not captured,,,,Venegas Lugo,Laura,C,04/23/1993,female,Not captured,Not captured,Not captured,Not captured,Not captured,Not captured,Not captured,Not captured,Not captured,Not captured,Not captured,Not captured,Not captured,,,Not captured,Not captured,Not captured,Not captured,Calle 8 #3-27,,Cota,,Cundinamarca,,,Not captured,Not captured,benroseth@gmail.com,Not captured,802047898,,Not captured,Not captured,Not captured,Not captured,Not captured,Not captured,
Not captured,Not captured,04/03/2020,Not captured,Not captured,863949,020,00072,ARS-02-0055642,Beacon America,Not captured,Not captured,Not captured,Passport(YA4878217),,,Salati,Claudia,,04/12/1950,female,Not captured,Not captured,Not captured,Not captured,Not captured,Not captured,Not captured,Not captured,Not captured,Not captured,Not captured,Not captured,Not captured,,,Not captured,Not captured,Not captured,Not captured,Via per Neviano 30/B,,Traversetolo,Parma,43029,0521842383,,Not captured,Not captured,msclaudia@hotmail.it,Not captured,802047896,,Not captured,Not captured,Not captured,Not captured,Not captured,Not captured,
Not captured,Not captured,03/31/2020,Not captured,Not captured,863949,020,00072,ARS-03-0055634,Essential America,Not captured,Not captured,Not captured,Passport(CSM5G5LLR),,,Tulle,Manuela,,04/06/1963,female,Not captured,Not captured,Not captured,Not captured,Not captured,Not captured,Not captured,Not captured,Not captured,Not captured,Not captured,Not captured,Not captured,,,Not captured,Not captured,Not captured,Not captured,Koenigsholz 2,,Weilrod,Hessen,61276,49-0151-5570-2014,,Not captured,Not captured,juneslinger@gmail.com,Not captured,802047887,,Not captured,Not captured,Not captured,Not captured,Not captured,Not captured,
Not captured,Not captured,04/01/2020,Not captured,Not captured,863949,020,00072,ARS-03-0055581,Essential America,Not captured,Not captured,Not captured,Passport(L6542067),,,VEDIRE,ROHIT,,02/26/1994,male,Not captured,Not captured,Not captured,Not captured,Not captured,Not captured,Not captured,Not captured,Not captured,Not captured,Not captured,Not captured,Not captured,,,Not captured,Not captured,Not captured,Not captured,2-1-290/1/301,,hyderabad,Andhra Pradesh,500044,9178535115,,Not captured,Not captured,vedirerohit@gmail.com,Not captured,802047825,,Not captured,Not captured,Not captured,Not captured,Not captured,Not captured,
Not captured,Not captured,04/01/2020,Not captured,Not captured,863949,020,00072,ARS-01-0055598,Beacon International,Not captured,Not captured,Not captured,Passport(585362755),,,Torres,Judah,,09/12/1999,male,Not captured,Not captured,Not captured,Not captured,Not captured,Not captured,Not captured,Not captured,Not captured,Not captured,Not captured,Not captured,Not captured,Ruth Torres,mother,Not captured,Not captured,Not captured,Not captured,23 Crofton Rd,,Oswego,Illinois,60543,630 945 0026,,Not captured,Not captured,rtorres@teachbeyond.org,Not captured,802047849,,Not captured,Not captured,Not captured,Not captured,Not captured,Not captured,
Not captured,Not captured,04/04/2020,Not captured,Not captured,863949,020,00072,ARS-01-0055450,Beacon International,Not captured,Not captured,Not captured,Passport(098286193),,,Chacon,Maria,Alejandra,11/11/1993,female,Not captured,Not captured,Not captured,Not captured,Not captured,Not captured,Not captured,Not captured,Not captured,Not captured,Not captured,Not captured,Not captured,Soraya Elena Rondon,madre,Not captured,Not captured,Not captured,Not captured,av. sabana larga numero 30 plaza la union suite 209,,santo domingo este,santo domingo este,11504,+18496070282,+18095959916,Not captured,Not captured,marialejandrachacon81@gmail.com,Not captured,802047478,,Not captured,Not captured,Not captured,Not captured,Not captured,Not captured,
Not captured,Not captured,04/02/2020,Not captured,Not captured,863949,020,00072,ARS-01-0054888,Beacon International,Not captured,Not captured,Not captured,,,,Jones,Nicola,,11/05/1983,female,Not captured,Not captured,Not captured,Not captured,Not captured,Not captured,Not captured,Not captured,Not captured,Not captured,Not captured,Not captured,Not captured,,,Not captured,Not captured,Not captured,Not captured,506 Sukoon Tower,,Dubai,,0000,,,Not captured,Not captured,nikijones1105@gmail.com,Not captured,802045330,,Not captured,Not captured,Not captured,Not captured,Not captured,Not captured,
Not captured,Not captured,11/09/2020,Not captured,Not captured,863949,020,00072,BG001030-23-464c1b11,International Assurance,Not captured,Not captured,Not captured,-,-,,Miller,Matthew,J,10/04/1964,male,Not captured,Not captured,Not captured,Not captured,Not captured,Not captured,Not captured,Not captured,Not captured,Not captured,Not captured,Not captured,Not captured,,,Not captured,Not captured,Not captured,Not captured,576 Broadway,,La Center,Kentucky,42056,270-217-8380,,Not captured,Not captured,kentuckycrew@hotmail.com,Not captured,802047914,,Not captured,Not captured,Not captured,Not captured,Not captured,Not captured,
Not captured,Not captured,11/09/2020,Not captured,Not captured,863949,020,00072,BG001030-23-f1a56009,International Assurance,Not captured,Not captured,Not captured,-,-,,Miller,Darlene,,02/17/1965,male,Not captured,Not captured,Not captured,Not captured,Not captured,Not captured,Not captured,Not captured,Not captured,Not captured,Not captured,Not captured,Not captured,,,Not captured,Not captured,Not captured,Not captured,576 Broadway,,La Center,Kentucky,42056,270-709-4741,,Not captured,Not captured,darlenemiller@cfbc.tv,Not captured,802047913,,Not captured,Not captured,Not captured,Not captured,Not captured,Not captured