EE Transaction Type,Dependent Transaction Type,Effective Date,EE Signature,EE Signature Date,Control,Suffix,Account,Plan Number,Plan Name,Claim Office,Network ID Number,Customer Code,EE SSN,Dependent SSN,Dependent Relationship,Last Name,First Name,Middle Initial,DOB,Gender,Ethnicity,PCP/PCD,PCP/PCD Current Patient,Provider Cap Office Number,COB,Dep Student Indicator,Dep OOA Indicator,EE Prior Coverage Indicator,EE Late Entrant,EE Language Indicator,Hire Date,Earnings,Earnings Frequency,Beneficiary (Last Name First Name MI),Beneficiary Relationship,Continuation of Coverage Expiration Date,Continuation of Coverage Event Date,Continuation of Coverage Length of Coverage,Work Location Zip Code,Street Address Line 1,Street Address Line 2,City,State,Zip Code,Home Phone Number,Work Phone Number,Accept Code,Evidence Code,EE Email Address,Communication Disability Code,EE Alternate ID,Dep Alternate ID,Old Control,Old Suffix,Old Account,New Control,New Suffix,New Account,
Not captured,Not captured,04/24/2020,Not captured,Not captured,863949,020,00072,ARS-03-0055712,Essential America,Not captured,Not captured,Not captured,Passport(00000000000),,,Temple,Isaac,Owen,02/13/2020,male,Not captured,Not captured,Not captured,Not captured,Not captured,Not captured,Not captured,Not captured,Not captured,Not captured,Not captured,Not captured,Not captured,,,Not captured,Not captured,Not captured,Not captured,905 E Meadowlark Dr,,Springfield,Missouri,65810,4178395282,,Not captured,Not captured,templeesq@sbcglobal.net,Not captured,802048000,,Not captured,Not captured,Not captured,Not captured,Not captured,Not captured,
Not captured,Not captured,04/24/2020,Not captured,Not captured,863949,020,00072,ARS-02-0055718,Beacon America,Not captured,Not captured,Not captured,Passport(Z5171471),,,Jagani,Vinodkumar Govindbhai,,12/01/1961,male,Not captured,Not captured,Not captured,Not captured,Not captured,Not captured,Not captured,Not captured,Not captured,Not captured,Not captured,Not captured,Not captured,Viraj Jagani,,Not captured,Not captured,Not captured,Not captured,17 Ravidarshan Soc,,Ankleshwar,GJ,393002,+1-2022907556,,Not captured,Not captured,virajjagani@gmail.com,Not captured,802048006,,Not captured,Not captured,Not captured,Not captured,Not captured,Not captured,
Not captured,Not captured,04/23/2020,Not captured,Not captured,863949,020,00072,ARS-02-0055717,Beacon America,Not captured,Not captured,Not captured,,,,CHILUPURU,KALAVATHI,,09/09/1965,female,Not captured,Not captured,Not captured,Not captured,Not captured,Not captured,Not captured,Not captured,Not captured,Not captured,Not captured,Not captured,Not captured,Sravanthi Chilupuru,Spouse,Not captured,Not captured,Not captured,Not captured,15-17/30/1 VENKATADRI NAGAR,,HYDERABAD,TS,500047,+1-5105986547,,Not captured,Not captured,chilupuru.sravanthi@gmail.com,Not captured,802048005,,Not captured,Not captured,Not captured,Not captured,Not captured,Not captured,
Not captured,Not captured,04/23/2020,Not captured,Not captured,863949,020,00072,ARS-02-0055716,Beacon America,Not captured,Not captured,Not captured,Passport(M6840475),,,CHILUPURU,VIJAYA KUMAR,,09/06/1959,male,Not captured,Not captured,Not captured,Not captured,Not captured,Not captured,Not captured,Not captured,Not captured,Not captured,Not captured,Not captured,Not captured,Sravanthi Chilupuru,,Not captured,Not captured,Not captured,Not captured,15-17/30/1 VENKATADRI NAGAR,,HYDERABAD,TS,500047,+1-5105986547,,Not captured,Not captured,chilupuru.sravanthi@gmail.com,Not captured,802048004,,Not captured,Not captured,Not captured,Not captured,Not captured,Not captured,
Not captured,Not captured,04/22/2020,Not captured,Not captured,863949,020,00072,ARS-02-0055715,Beacon America,Not captured,Not captured,Not captured,,,,Jain,Sunita,,01/28/1964,female,Not captured,Not captured,Not captured,Not captured,Not captured,Not captured,Not captured,Not captured,Not captured,Not captured,Not captured,Not captured,Not captured,fnu anuj jain,Spouse,Not captured,Not captured,Not captured,Not captured,23 daya nagar,,Agra,UP,282001,+1-9723306427,,Not captured,Not captured,anujjain.1989@gmail.com,Not captured,802048003,,Not captured,Not captured,Not captured,Not captured,Not captured,Not captured,
Not captured,Not captured,04/22/2020,Not captured,Not captured,863949,020,00072,ARS-02-0055714,Beacon America,Not captured,Not captured,Not captured,Passport(M0343857),,,Jain,Dilip kumar,,12/25/1961,male,Not captured,Not captured,Not captured,Not captured,Not captured,Not captured,Not captured,Not captured,Not captured,Not captured,Not captured,Not captured,Not captured,fnu anuj jain,,Not captured,Not captured,Not captured,Not captured,23 daya nagar,,Agra,UP,282001,+1-9723306427,,Not captured,Not captured,anujjain.1989@gmail.com,Not captured,802048002,,Not captured,Not captured,Not captured,Not captured,Not captured,Not captured,
Not captured,Not captured,04/21/2020,Not captured,Not captured,863949,020,00072,ARS-02-0055709,Beacon America,Not captured,Not captured,Not captured,Passport(PU2064342),,,McCabe,Ronan Edward,,07/14/1988,male,Not captured,Not captured,Not captured,Not captured,Not captured,Not captured,Not captured,Not captured,Not captured,Not captured,Not captured,Not captured,Not captured,Hannah McCabe,,Not captured,Not captured,Not captured,Not captured,Ballyboe,,Convoy,Donegal,F93 X3K2,+1-8572640930,,Not captured,Not captured,ronan_mccabe@protonmail.com,Not captured,802047996,,Not captured,Not captured,Not captured,Not captured,Not captured,Not captured,
Not captured,Not captured,04/20/2020,Not captured,Not captured,863949,020,00072,ARS-02-0055706,Beacon America,Not captured,Not captured,Not captured,,,,Deatherage,Diana,T,12/05/2000,female,Not captured,Not captured,Not captured,Not captured,Not captured,Not captured,Not captured,Not captured,Not captured,Not captured,Not captured,Not captured,Not captured,,,Not captured,Not captured,Not captured,Not captured,4471,,Fresno,California,93705,,,Not captured,Not captured,herndontowing@hotmail.com,Not captured,802047993,,Not captured,Not captured,Not captured,Not captured,Not captured,Not captured,
Not captured,Not captured,04/20/2020,Not captured,Not captured,863949,020,00072,ARS-01-0055705,Beacon International,Not captured,Not captured,Not captured,,,,Munoz,Elias,M,04/30/1980,male,Not captured,Not captured,Not captured,Not captured,Not captured,Not captured,Not captured,Not captured,Not captured,Not captured,Not captured,Not captured,Not captured,Elias M Munoz,Father,Not captured,Not captured,Not captured,Not captured,7225 NW 25th St,,Miami,Florida,33122,7866024187,,Not captured,Not captured,eliahwood@gmail.com,Not captured,802047992,,Not captured,Not captured,Not captured,Not captured,Not captured,Not captured,
Not captured,Not captured,04/20/2020,Not captured,Not captured,863949,020,00072,ARS-02-0055704,Beacon America,Not captured,Not captured,Not captured,Passport(BM0948542),,,Begum,Afroza,,12/31/1963,female,Not captured,Not captured,Not captured,Not captured,Not captured,Not captured,Not captured,Not captured,Not captured,Not captured,Not captured,Not captured,Not captured,Anmol Haque,,Not captured,Not captured,Not captured,Not captured,1 New Baily Road,,Dhaka,Dhaka,1217,+1-5407506070,,Not captured,Not captured,tahsin1990@gmail.com,Not captured,802047991,,Not captured,Not captured,Not captured,Not captured,Not captured,Not captured,
Not captured,Not captured,04/20/2020,Not captured,Not captured,863949,020,00072,OVI-28-0055703,OverseasCare Visitors Insurance Plan,Not captured,Not captured,Not captured,Passport(K01884755),,,Song,Qinglin,,11/20/1952,male,Not captured,Not captured,Not captured,Not captured,Not captured,Not captured,Not captured,Not captured,Not captured,Not captured,Not captured,Not captured,Not captured,Xing Liu,Daughter,Not captured,Not captured,Not captured,Not captured,512 W BARRY AVE APT 210,,Chicago,Illinois,60657,8478686751,,Not captured,Not captured,biqin.dong@gmail.com,Not captured,802047990,,Not captured,Not captured,Not captured,Not captured,Not captured,Not captured,
Not captured,Not captured,04/17/2020,Not captured,Not captured,863949,020,00072,ARS-01-0055699,Beacon International,Not captured,Not captured,Not captured,,,,Brencher,Niklaus,,01/31/1988,male,Not captured,Not captured,Not captured,Not captured,Not captured,Not captured,Not captured,Not captured,Not captured,Not captured,Not captured,Not captured,Not captured,,,Not captured,Not captured,Not captured,Not captured,3402 Avenue J,,Brooklyn,New York,11210,,,Not captured,Not captured,n75296@gmail.com,Not captured,802047983,,Not captured,Not captured,Not captured,Not captured,Not captured,Not captured,
Not captured,Not captured,04/16/2020,Not captured,Not captured,863949,020,00072,ARS-01-0055697,Beacon International,Not captured,Not captured,Not captured,,,,Roberts,Darren,,09/30/1982,male,Not captured,Not captured,Not captured,Not captured,Not captured,Not captured,Not captured,Not captured,Not captured,Not captured,Not captured,Not captured,Not captured,,,Not captured,Not captured,Not captured,Not captured,64 Knight Avenue,,Chorley,,PR7 7HW,,,Not captured,Not captured,beverly-k@hotmail.co.uk,Not captured,802047980,,Not captured,Not captured,Not captured,Not captured,Not captured,Not captured,
Not captured,Not captured,04/16/2020,Not captured,Not captured,863949,020,00072,ARS-01-0055696,Beacon International,Not captured,Not captured,Not captured,,,,Roberts,Beverly,,03/01/1994,female,Not captured,Not captured,Not captured,Not captured,Not captured,Not captured,Not captured,Not captured,Not captured,Not captured,Not captured,Not captured,Not captured,,,Not captured,Not captured,Not captured,Not captured,64 Knight Avenue,,Chorley,,PR7 7HW,,,Not captured,Not captured,beverly-k@hotmail.co.uk,Not captured,802047979,,Not captured,Not captured,Not captured,Not captured,Not captured,Not captured,
Not captured,Not captured,04/18/2020,Not captured,Not captured,863949,020,00072,ARS-02-0055695,Beacon America,Not captured,Not captured,Not captured,,,,Rattray,Margaret ,J,04/08/1950,female,Not captured,Not captured,Not captured,Not captured,Not captured,Not captured,Not captured,Not captured,Not captured,Not captured,Not captured,Not captured,Not captured,David Scott Rattray,Son,Not captured,Not captured,Not captured,Not captured,#278-113,,Penticton,British Columbia,V2A5L1,604-200-0776,,Not captured,Not captured,grattray@telus.net,Not captured,802047978,,Not captured,Not captured,Not captured,Not captured,Not captured,Not captured,
Not captured,Not captured,04/18/2020,Not captured,Not captured,863949,020,00072,ARS-02-0055694,Beacon America,Not captured,Not captured,Not captured,Passport(HP478649),,,Rattray,Gerald,L,02/13/1948,male,Not captured,Not captured,Not captured,Not captured,Not captured,Not captured,Not captured,Not captured,Not captured,Not captured,Not captured,Not captured,Not captured,David Scott Rattray,Son,Not captured,Not captured,Not captured,Not captured,#278-113,,Penticton,British Columbia,V2A5L1,604-200-0776,,Not captured,Not captured,grattray@telus.net,Not captured,802047977,,Not captured,Not captured,Not captured,Not captured,Not captured,Not captured,
Not captured,Not captured,04/14/2020,Not captured,Not captured,863949,020,00072,ARS-02-0055691,Beacon America,Not captured,Not captured,Not captured,,,,van Woerden,Ernst-Jan,,01/06/1983,male,Not captured,Not captured,Not captured,Not captured,Not captured,Not captured,Not captured,Not captured,Not captured,Not captured,Not captured,Not captured,Not captured,,,Not captured,Not captured,Not captured,Not captured,Lianbao Apartments Xingfu Yicun Xili Bldg 7 Apt 3C,,Beijing,,100027,,,Not captured,Not captured,e.vanwoerden@gmail.com,Not captured,802047974,,Not captured,Not captured,Not captured,Not captured,Not captured,Not captured,
Not captured,Not captured,04/14/2020,Not captured,Not captured,863949,020,00072,ARS-02-0055690,Beacon America,Not captured,Not captured,Not captured,,,,CHOU,CLAIRE,,08/23/2003,female,Not captured,Not captured,Not captured,Not captured,Not captured,Not captured,Not captured,Not captured,Not captured,Not captured,Not captured,Not captured,Not captured,,,Not captured,Not captured,Not captured,Not captured,3 DEER HOLLOW,,IRVINE,,92620,,,Not captured,Not captured,cheng.ww1@gmail.com,Not captured,802047973,,Not captured,Not captured,Not captured,Not captured,Not captured,Not captured,
Not captured,Not captured,04/18/2020,Not captured,Not captured,863949,020,00072,ARS-02-0055683,Beacon America,Not captured,Not captured,Not captured,Passport(FT639305),,,DE SOUZA POVOA,ALVARINDA,,04/06/1952,female,Not captured,Not captured,Not captured,Not captured,Not captured,Not captured,Not captured,Not captured,Not captured,Not captured,Not captured,Not captured,Not captured,EDUARDO LUIS DE SOUZA POVOA,SON,Not captured,Not captured,Not captured,Not captured,12954 sw 133 terrace,,miami,FL,33186,7862815412,,Not captured,Not captured,eduardopersonaltr@hotmail.com,Not captured,802047965,,Not captured,Not captured,Not captured,Not captured,Not captured,Not captured,
Not captured,Not captured,04/10/2020,Not captured,Not captured,863949,020,00072,ARS-02-0055682,Beacon America,Not captured,Not captured,Not captured,,,,Thompson,Lexi,,09/20/2006,female,Not captured,Not captured,Not captured,Not captured,Not captured,Not captured,Not captured,Not captured,Not captured,Not captured,Not captured,Not captured,Not captured,,,Not captured,Not captured,Not captured,Not captured,4542 Blue Major Dr,,Windemere,Florida,34786,0000000000,,Not captured,Not captured,kellythompson07@yahoo.com,Not captured,802047964,,Not captured,Not captured,Not captured,Not captured,Not captured,Not captured,
Not captured,Not captured,04/10/2020,Not captured,Not captured,863949,020,00072,ARS-02-0055681,Beacon America,Not captured,Not captured,Not captured,,,,Thompson,Holly,,10/31/2003,female,Not captured,Not captured,Not captured,Not captured,Not captured,Not captured,Not captured,Not captured,Not captured,Not captured,Not captured,Not captured,Not captured,,,Not captured,Not captured,Not captured,Not captured,4542 Blue Major Dr,,Windemere,Florida,34786,0000000000,,Not captured,Not captured,kellythompson07@yahoo.com,Not captured,802047963,,Not captured,Not captured,Not captured,Not captured,Not captured,Not captured,
Not captured,Not captured,04/10/2020,Not captured,Not captured,863949,020,00072,ARS-02-0055680,Beacon America,Not captured,Not captured,Not captured,,,,Thompson,Andrew,,11/22/1975,male,Not captured,Not captured,Not captured,Not captured,Not captured,Not captured,Not captured,Not captured,Not captured,Not captured,Not captured,Not captured,Not captured,,,Not captured,Not captured,Not captured,Not captured,4542 Blue Major Dr,,Windemere,Florida,34786,0000000000,,Not captured,Not captured,kellythompson07@yahoo.com,Not captured,802047962,,Not captured,Not captured,Not captured,Not captured,Not captured,Not captured,
Not captured,Not captured,04/10/2020,Not captured,Not captured,863949,020,00072,ARS-02-0055679,Beacon America,Not captured,Not captured,Not captured,Passport(578203465),,,Thompson,Kelly,,02/22/1978,female,Not captured,Not captured,Not captured,Not captured,Not captured,Not captured,Not captured,Not captured,Not captured,Not captured,Not captured,Not captured,Not captured,,,Not captured,Not captured,Not captured,Not captured,4542 Blue Major Dr,,Windemere,Florida,34786,0000000000,,Not captured,Not captured,kellythompson07@yahoo.com,Not captured,802047961,,Not captured,Not captured,Not captured,Not captured,Not captured,Not captured,
Not captured,Not captured,04/12/2020,Not captured,Not captured,863949,020,00072,ARS-02-0055678,Beacon America,Not captured,Not captured,Not captured,Passport(547253522),,,Whaley,Alice,E,05/24/1998,female,Not captured,Not captured,Not captured,Not captured,Not captured,Not captured,Not captured,Not captured,Not captured,Not captured,Not captured,Not captured,Not captured,Belinda Braithwaite,Mother,Not captured,Not captured,Not captured,Not captured,Anser Gallows Farm,,Saffron Walden,England,CB10 2NU,00447837623547,,Not captured,Not captured,whaleyalice@gmail.com,Not captured,802047960,,Not captured,Not captured,Not captured,Not captured,Not captured,Not captured,
Not captured,Not captured,04/16/2020,Not captured,Not captured,863949,020,00072,ARS-04-0055674,Enhanced America,Not captured,Not captured,Not captured,Passport(000),,,Carpenter,Ian,Tuyishime,03/16/2020,male,Not captured,Not captured,Not captured,Not captured,Not captured,Not captured,Not captured,Not captured,Not captured,Not captured,Not captured,Not captured,Not captured,,,Not captured,Not captured,Not captured,Not captured,1919 N Floyd,,Wichita,Kansas,67212,3168330516,,Not captured,Not captured,bradchelseacarpenter@gmail.com,Not captured,802047952,,Not captured,Not captured,Not captured,Not captured,Not captured,Not captured,
Not captured,Not captured,04/07/2020,Not captured,Not captured,863949,020,00072,ARS-03-0055668,Essential America,Not captured,Not captured,Not captured,Passport(P03756458),,,Edris,Tagwa,,10/16/1991,female,Not captured,Not captured,Not captured,Not captured,Not captured,Not captured,Not captured,Not captured,Not captured,Not captured,Not captured,Not captured,Not captured,,,Not captured,Not captured,Not captured,Not captured,6014 NE 112th Ave,,Portland,Oregon,97220,4259536427,,Not captured,Not captured,ellateagan@gmail.com,Not captured,802047941,,Not captured,Not captured,Not captured,Not captured,Not captured,Not captured,
Not captured,Not captured,04/07/2020,Not captured,Not captured,863949,020,00072,ARS-03-0055668,Essential America,Not captured,Not captured,Not captured,,Passport(P06358802),Dependant,Saeed,Howaida,,03/23/2019,female,Not captured,Not captured,Not captured,Not captured,Not captured,Not captured,Not captured,Not captured,Not captured,Not captured,Not captured,Not captured,Not captured,,,Not captured,Not captured,Not captured,Not captured,6014 NE 112th Ave,,Portland,Oregon,97220,4259536427,,Not captured,Not captured,ellateagan@gmail.com,Not captured,,802047942,Not captured,Not captured,Not captured,Not captured,Not captured,Not captured,
Not captured,Not captured,04/07/2020,Not captured,Not captured,863949,020,00072,ARS-03-0055670,Essential America,Not captured,Not captured,Not captured,Passport(PP4049299),,,Charles,Anne,Love,04/01/1988,female,Not captured,Not captured,Not captured,Not captured,Not captured,Not captured,Not captured,Not captured,Not captured,Not captured,Not captured,Not captured,Not captured,,,Not captured,Not captured,Not captured,Not captured,19866 E 40th Place,,Denver,Colorado,80249,303-261-2116,,Not captured,Not captured,jeano4luto@yahoo.com,Not captured,802047945,,Not captured,Not captured,Not captured,Not captured,Not captured,Not captured,
Not captured,Not captured,04/07/2020,Not captured,Not captured,863949,020,00072,ARS-03-0055670,Essential America,Not captured,Not captured,Not captured,,Driving License(062850774),Spouse,Charles,Jean,Edouard,03/05/1990,male,Not captured,Not captured,Not captured,Not captured,Not captured,Not captured,Not captured,Not captured,Not captured,Not captured,Not captured,Not captured,Not captured,,,Not captured,Not captured,Not captured,Not captured,19866 E 40th Place,,Denver,Colorado,80249,303-261-2116,,Not captured,Not captured,jeano4luto@yahoo.com,Not captured,,802047946,Not captured,Not captured,Not captured,Not captured,Not captured,Not captured,
Not captured,Not captured,04/07/2020,Not captured,Not captured,863949,020,00072,ARS-01-0055671,Beacon International,Not captured,Not captured,Not captured,,,,Ward,Micah Nathaniel,,11/01/1983,male,Not captured,Not captured,Not captured,Not captured,Not captured,Not captured,Not captured,Not captured,Not captured,Not captured,Not captured,Not captured,Not captured,Claudia Ward,mother,Not captured,Not captured,Not captured,Not captured,P.O. Box 7652,,Moore,Oklahoma,73153,4054132191,,Not captured,Not captured,cswconst@sbcglobal.net,Not captured,802047949,,Not captured,Not captured,Not captured,Not captured,Not captured,Not captured,
Not captured,Not captured,04/06/2020,Not captured,Not captured,863949,020,00072,ARS-05-0055369,Clear America,Not captured,Not captured,Not captured,Passport(134686057),,,BARRIOS,JULIO,ANGEL,04/15/1990,male,Not captured,Not captured,Not captured,Not captured,Not captured,Not captured,Not captured,Not captured,Not captured,Not captured,Not captured,Not captured,Not captured,,,Not captured,Not captured,Not captured,Not captured,AV. MADRID URB. EL PARQUE RES. PARQUE BARQUISIMETO TORRE B APTO 23B,,BAEQUISIMETO,Lara,3001,+584145032671,,Not captured,Not captured,ANTILLANOP@HOTMAIL.COM,Not captured,802047157,,Not captured,Not captured,Not captured,Not captured,Not captured,Not captured,
Not captured,Not captured,04/06/2020,Not captured,Not captured,863949,020,00072,ARS-05-0055368,Clear America,Not captured,Not captured,Not captured,Passport(104143757),,,BARRIOS,PEDRO,TOMMY,01/22/1958,male,Not captured,Not captured,Not captured,Not captured,Not captured,Not captured,Not captured,Not captured,Not captured,Not captured,Not captured,Not captured,Not captured,,,Not captured,Not captured,Not captured,Not captured,AV. MADRID URB. EL PARQUE RES. PARQUE BARQUISIMETO TORRE B APTO 23B,,BARQUISIMETO,Lara,3001,+584145032671,,Not captured,Not captured,ANTILLANOP@HOTMAIL.COM,Not captured,802047155,,Not captured,Not captured,Not captured,Not captured,Not captured,Not captured,
Not captured,Not captured,04/06/2020,Not captured,Not captured,863949,020,00072,ARS-05-0055368,Clear America,Not captured,Not captured,Not captured,,Passport(103891499),Spouse,GONZALEZ DE BARRIOS,ARACELIS,RAMONA,11/08/1966,female,Not captured,Not captured,Not captured,Not captured,Not captured,Not captured,Not captured,Not captured,Not captured,Not captured,Not captured,Not captured,Not captured,,,Not captured,Not captured,Not captured,Not captured,AV. MADRID URB. EL PARQUE RES. PARQUE BARQUISIMETO TORRE B APTO 23B,,BARQUISIMETO,Lara,3001,+584145032671,,Not captured,Not captured,ANTILLANOP@HOTMAIL.COM,Not captured,,802047156,Not captured,Not captured,Not captured,Not captured,Not captured,Not captured,
Not captured,Not captured,04/07/2020,Not captured,Not captured,863949,020,00072,ARS-02-0055665,Beacon America,Not captured,Not captured,Not captured,,,,Savoie,Katherine,,03/21/1990,female,Not captured,Not captured,Not captured,Not captured,Not captured,Not captured,Not captured,Not captured,Not captured,Not captured,Not captured,Not captured,Not captured,,,Not captured,Not captured,Not captured,Not captured,32 Moonstone Lane,,Whitehorse,British Columbia,Y1A 5Z9,,,Not captured,Not captured,xiokikauka@gmail.com,Not captured,802047937,,Not captured,Not captured,Not captured,Not captured,Not captured,Not captured,
Not captured,Not captured,04/08/2020,Not captured,Not captured,863949,020,00072,ARS-02-0055647,Beacon America,Not captured,Not captured,Not captured,Passport(bh3573874),,,kocsis,gabor,,08/06/1969,male,Not captured,Not captured,Not captured,Not captured,Not captured,Not captured,Not captured,Not captured,Not captured,Not captured,Not captured,Not captured,Not captured,gabor kocsis jr,son,Not captured,Not captured,Not captured,Not captured,2 s end ave,,NEW YORK,NY,102,9173598568,9177249966,Not captured,Not captured,gaborspainting@hotmail.com,Not captured,802047901,,Not captured,Not captured,Not captured,Not captured,Not captured,Not captured,