EE Transaction Type,Dependent Transaction Type,Effective Date,EE Signature,EE Signature Date,Control,Suffix,Account,Plan Number,Plan Name,Claim Office,Network ID Number,Customer Code,EE SSN,Dependent SSN,Dependent Relationship,Last Name,First Name,Middle Initial,DOB,Gender,Ethnicity,PCP/PCD,PCP/PCD Current Patient,Provider Cap Office Number,COB,Dep Student Indicator,Dep OOA Indicator,EE Prior Coverage Indicator,EE Late Entrant,EE Language Indicator,Hire Date,Earnings,Earnings Frequency,Beneficiary (Last Name First Name MI),Beneficiary Relationship,Continuation of Coverage Expiration Date,Continuation of Coverage Event Date,Continuation of Coverage Length of Coverage,Work Location Zip Code,Street Address Line 1,Street Address Line 2,City,State,Zip Code,Home Phone Number,Work Phone Number,Accept Code,Evidence Code,EE Email Address,Communication Disability Code,EE Alternate ID,Dep Alternate ID,Old Control,Old Suffix,Old Account,New Control,New Suffix,New Account,
Not captured,Not captured,04/17/2020,Not captured,Not captured,863949,020,00072,ARS-01-0055699,Beacon International,Not captured,Not captured,Not captured,,,,Brencher,Niklaus,,01/31/1988,male,Not captured,Not captured,Not captured,Not captured,Not captured,Not captured,Not captured,Not captured,Not captured,Not captured,Not captured,Not captured,Not captured,,,Not captured,Not captured,Not captured,Not captured,3402 Avenue J,,Brooklyn,New York,11210,,,Not captured,Not captured,n75296@gmail.com,Not captured,802047983,,Not captured,Not captured,Not captured,Not captured,Not captured,Not captured,
Not captured,Not captured,04/16/2020,Not captured,Not captured,863949,020,00072,ARS-01-0055697,Beacon International,Not captured,Not captured,Not captured,,,,Roberts,Darren,,09/30/1982,male,Not captured,Not captured,Not captured,Not captured,Not captured,Not captured,Not captured,Not captured,Not captured,Not captured,Not captured,Not captured,Not captured,,,Not captured,Not captured,Not captured,Not captured,64 Knight Avenue,,Chorley,,PR7 7HW,,,Not captured,Not captured,beverly-k@hotmail.co.uk,Not captured,802047980,,Not captured,Not captured,Not captured,Not captured,Not captured,Not captured,
Not captured,Not captured,04/16/2020,Not captured,Not captured,863949,020,00072,ARS-01-0055696,Beacon International,Not captured,Not captured,Not captured,,,,Roberts,Beverly,,03/01/1994,female,Not captured,Not captured,Not captured,Not captured,Not captured,Not captured,Not captured,Not captured,Not captured,Not captured,Not captured,Not captured,Not captured,,,Not captured,Not captured,Not captured,Not captured,64 Knight Avenue,,Chorley,,PR7 7HW,,,Not captured,Not captured,beverly-k@hotmail.co.uk,Not captured,802047979,,Not captured,Not captured,Not captured,Not captured,Not captured,Not captured,
Not captured,Not captured,04/18/2020,Not captured,Not captured,863949,020,00072,ARS-02-0055695,Beacon America,Not captured,Not captured,Not captured,,,,Rattray,Margaret ,J,04/08/1950,female,Not captured,Not captured,Not captured,Not captured,Not captured,Not captured,Not captured,Not captured,Not captured,Not captured,Not captured,Not captured,Not captured,David Scott Rattray,Son,Not captured,Not captured,Not captured,Not captured,#278-113,,Penticton,British Columbia,V2A5L1,604-200-0776,,Not captured,Not captured,grattray@telus.net,Not captured,802047978,,Not captured,Not captured,Not captured,Not captured,Not captured,Not captured,
Not captured,Not captured,04/18/2020,Not captured,Not captured,863949,020,00072,ARS-02-0055694,Beacon America,Not captured,Not captured,Not captured,Passport(HP478649),,,Rattray,Gerald,L,02/13/1948,male,Not captured,Not captured,Not captured,Not captured,Not captured,Not captured,Not captured,Not captured,Not captured,Not captured,Not captured,Not captured,Not captured,David Scott Rattray,Son,Not captured,Not captured,Not captured,Not captured,#278-113,,Penticton,British Columbia,V2A5L1,604-200-0776,,Not captured,Not captured,grattray@telus.net,Not captured,802047977,,Not captured,Not captured,Not captured,Not captured,Not captured,Not captured,
Not captured,Not captured,04/14/2020,Not captured,Not captured,863949,020,00072,ARS-02-0055691,Beacon America,Not captured,Not captured,Not captured,,,,van Woerden,Ernst-Jan,,01/06/1983,male,Not captured,Not captured,Not captured,Not captured,Not captured,Not captured,Not captured,Not captured,Not captured,Not captured,Not captured,Not captured,Not captured,,,Not captured,Not captured,Not captured,Not captured,Lianbao Apartments Xingfu Yicun Xili Bldg 7 Apt 3C,,Beijing,,100027,,,Not captured,Not captured,e.vanwoerden@gmail.com,Not captured,802047974,,Not captured,Not captured,Not captured,Not captured,Not captured,Not captured,
Not captured,Not captured,04/14/2020,Not captured,Not captured,863949,020,00072,ARS-02-0055690,Beacon America,Not captured,Not captured,Not captured,,,,CHOU,CLAIRE,,08/23/2003,female,Not captured,Not captured,Not captured,Not captured,Not captured,Not captured,Not captured,Not captured,Not captured,Not captured,Not captured,Not captured,Not captured,,,Not captured,Not captured,Not captured,Not captured,3 DEER HOLLOW,,IRVINE,,92620,,,Not captured,Not captured,cheng.ww1@gmail.com,Not captured,802047973,,Not captured,Not captured,Not captured,Not captured,Not captured,Not captured,
Not captured,Not captured,04/18/2020,Not captured,Not captured,863949,020,00072,ARS-02-0055683,Beacon America,Not captured,Not captured,Not captured,Passport(FT639305),,,DE SOUZA POVOA,ALVARINDA,,04/06/1952,female,Not captured,Not captured,Not captured,Not captured,Not captured,Not captured,Not captured,Not captured,Not captured,Not captured,Not captured,Not captured,Not captured,EDUARDO LUIS DE SOUZA POVOA,SON,Not captured,Not captured,Not captured,Not captured,12954 sw 133 terrace,,miami,FL,33186,7862815412,,Not captured,Not captured,eduardopersonaltr@hotmail.com,Not captured,802047965,,Not captured,Not captured,Not captured,Not captured,Not captured,Not captured,
Not captured,Not captured,04/10/2020,Not captured,Not captured,863949,020,00072,ARS-02-0055682,Beacon America,Not captured,Not captured,Not captured,,,,Thompson,Lexi,,09/20/2006,female,Not captured,Not captured,Not captured,Not captured,Not captured,Not captured,Not captured,Not captured,Not captured,Not captured,Not captured,Not captured,Not captured,,,Not captured,Not captured,Not captured,Not captured,4542 Blue Major Dr,,Windemere,Florida,34786,0000000000,,Not captured,Not captured,kellythompson07@yahoo.com,Not captured,802047964,,Not captured,Not captured,Not captured,Not captured,Not captured,Not captured,
Not captured,Not captured,04/10/2020,Not captured,Not captured,863949,020,00072,ARS-02-0055681,Beacon America,Not captured,Not captured,Not captured,,,,Thompson,Holly,,10/31/2003,female,Not captured,Not captured,Not captured,Not captured,Not captured,Not captured,Not captured,Not captured,Not captured,Not captured,Not captured,Not captured,Not captured,,,Not captured,Not captured,Not captured,Not captured,4542 Blue Major Dr,,Windemere,Florida,34786,0000000000,,Not captured,Not captured,kellythompson07@yahoo.com,Not captured,802047963,,Not captured,Not captured,Not captured,Not captured,Not captured,Not captured,
Not captured,Not captured,04/10/2020,Not captured,Not captured,863949,020,00072,ARS-02-0055680,Beacon America,Not captured,Not captured,Not captured,,,,Thompson,Andrew,,11/22/1975,male,Not captured,Not captured,Not captured,Not captured,Not captured,Not captured,Not captured,Not captured,Not captured,Not captured,Not captured,Not captured,Not captured,,,Not captured,Not captured,Not captured,Not captured,4542 Blue Major Dr,,Windemere,Florida,34786,0000000000,,Not captured,Not captured,kellythompson07@yahoo.com,Not captured,802047962,,Not captured,Not captured,Not captured,Not captured,Not captured,Not captured,
Not captured,Not captured,04/10/2020,Not captured,Not captured,863949,020,00072,ARS-02-0055679,Beacon America,Not captured,Not captured,Not captured,Passport(578203465),,,Thompson,Kelly,,02/22/1978,female,Not captured,Not captured,Not captured,Not captured,Not captured,Not captured,Not captured,Not captured,Not captured,Not captured,Not captured,Not captured,Not captured,,,Not captured,Not captured,Not captured,Not captured,4542 Blue Major Dr,,Windemere,Florida,34786,0000000000,,Not captured,Not captured,kellythompson07@yahoo.com,Not captured,802047961,,Not captured,Not captured,Not captured,Not captured,Not captured,Not captured,
Not captured,Not captured,04/12/2020,Not captured,Not captured,863949,020,00072,ARS-02-0055678,Beacon America,Not captured,Not captured,Not captured,Passport(547253522),,,Whaley,Alice,E,05/24/1998,female,Not captured,Not captured,Not captured,Not captured,Not captured,Not captured,Not captured,Not captured,Not captured,Not captured,Not captured,Not captured,Not captured,Belinda Braithwaite,Mother,Not captured,Not captured,Not captured,Not captured,Anser Gallows Farm,,Saffron Walden,England,CB10 2NU,00447837623547,,Not captured,Not captured,whaleyalice@gmail.com,Not captured,802047960,,Not captured,Not captured,Not captured,Not captured,Not captured,Not captured,
Not captured,Not captured,04/16/2020,Not captured,Not captured,863949,020,00072,ARS-04-0055674,Enhanced America,Not captured,Not captured,Not captured,Passport(000),,,Carpenter,Ian,Tuyishime,03/16/2020,male,Not captured,Not captured,Not captured,Not captured,Not captured,Not captured,Not captured,Not captured,Not captured,Not captured,Not captured,Not captured,Not captured,,,Not captured,Not captured,Not captured,Not captured,1919 N Floyd,,Wichita,Kansas,67212,3168330516,,Not captured,Not captured,bradchelseacarpenter@gmail.com,Not captured,802047952,,Not captured,Not captured,Not captured,Not captured,Not captured,Not captured,
Not captured,Not captured,04/07/2020,Not captured,Not captured,863949,020,00072,ARS-03-0055668,Essential America,Not captured,Not captured,Not captured,Passport(P03756458),,,Edris,Tagwa,,10/16/1991,female,Not captured,Not captured,Not captured,Not captured,Not captured,Not captured,Not captured,Not captured,Not captured,Not captured,Not captured,Not captured,Not captured,,,Not captured,Not captured,Not captured,Not captured,6014 NE 112th Ave,,Portland,Oregon,97220,4259536427,,Not captured,Not captured,ellateagan@gmail.com,Not captured,802047941,,Not captured,Not captured,Not captured,Not captured,Not captured,Not captured,
Not captured,Not captured,04/07/2020,Not captured,Not captured,863949,020,00072,ARS-03-0055668,Essential America,Not captured,Not captured,Not captured,,Passport(P06358802),Dependant,Saeed,Howaida,,03/23/2019,female,Not captured,Not captured,Not captured,Not captured,Not captured,Not captured,Not captured,Not captured,Not captured,Not captured,Not captured,Not captured,Not captured,,,Not captured,Not captured,Not captured,Not captured,6014 NE 112th Ave,,Portland,Oregon,97220,4259536427,,Not captured,Not captured,ellateagan@gmail.com,Not captured,,802047942,Not captured,Not captured,Not captured,Not captured,Not captured,Not captured,
Not captured,Not captured,04/07/2020,Not captured,Not captured,863949,020,00072,ARS-03-0055670,Essential America,Not captured,Not captured,Not captured,Passport(PP4049299),,,Charles,Anne,Love,04/01/1988,female,Not captured,Not captured,Not captured,Not captured,Not captured,Not captured,Not captured,Not captured,Not captured,Not captured,Not captured,Not captured,Not captured,,,Not captured,Not captured,Not captured,Not captured,19866 E 40th Place,,Denver,Colorado,80249,303-261-2116,,Not captured,Not captured,jeano4luto@yahoo.com,Not captured,802047945,,Not captured,Not captured,Not captured,Not captured,Not captured,Not captured,
Not captured,Not captured,04/07/2020,Not captured,Not captured,863949,020,00072,ARS-03-0055670,Essential America,Not captured,Not captured,Not captured,,Driving License(062850774),Spouse,Charles,Jean,Edouard,03/05/1990,male,Not captured,Not captured,Not captured,Not captured,Not captured,Not captured,Not captured,Not captured,Not captured,Not captured,Not captured,Not captured,Not captured,,,Not captured,Not captured,Not captured,Not captured,19866 E 40th Place,,Denver,Colorado,80249,303-261-2116,,Not captured,Not captured,jeano4luto@yahoo.com,Not captured,,802047946,Not captured,Not captured,Not captured,Not captured,Not captured,Not captured,
Not captured,Not captured,04/07/2020,Not captured,Not captured,863949,020,00072,ARS-01-0055671,Beacon International,Not captured,Not captured,Not captured,,,,Ward,Micah Nathaniel,,11/01/1983,male,Not captured,Not captured,Not captured,Not captured,Not captured,Not captured,Not captured,Not captured,Not captured,Not captured,Not captured,Not captured,Not captured,Claudia Ward,mother,Not captured,Not captured,Not captured,Not captured,P.O. Box 7652,,Moore,Oklahoma,73153,4054132191,,Not captured,Not captured,cswconst@sbcglobal.net,Not captured,802047949,,Not captured,Not captured,Not captured,Not captured,Not captured,Not captured,
Not captured,Not captured,04/06/2020,Not captured,Not captured,863949,020,00072,ARS-05-0055369,Clear America,Not captured,Not captured,Not captured,Passport(134686057),,,BARRIOS,JULIO,ANGEL,04/15/1990,male,Not captured,Not captured,Not captured,Not captured,Not captured,Not captured,Not captured,Not captured,Not captured,Not captured,Not captured,Not captured,Not captured,,,Not captured,Not captured,Not captured,Not captured,AV. MADRID URB. EL PARQUE RES. PARQUE BARQUISIMETO TORRE B APTO 23B,,BAEQUISIMETO,Lara,3001,+584145032671,,Not captured,Not captured,ANTILLANOP@HOTMAIL.COM,Not captured,802047157,,Not captured,Not captured,Not captured,Not captured,Not captured,Not captured,
Not captured,Not captured,04/06/2020,Not captured,Not captured,863949,020,00072,ARS-05-0055368,Clear America,Not captured,Not captured,Not captured,Passport(104143757),,,BARRIOS,PEDRO,TOMMY,01/22/1958,male,Not captured,Not captured,Not captured,Not captured,Not captured,Not captured,Not captured,Not captured,Not captured,Not captured,Not captured,Not captured,Not captured,,,Not captured,Not captured,Not captured,Not captured,AV. MADRID URB. EL PARQUE RES. PARQUE BARQUISIMETO TORRE B APTO 23B,,BARQUISIMETO,Lara,3001,+584145032671,,Not captured,Not captured,ANTILLANOP@HOTMAIL.COM,Not captured,802047155,,Not captured,Not captured,Not captured,Not captured,Not captured,Not captured,
Not captured,Not captured,04/06/2020,Not captured,Not captured,863949,020,00072,ARS-05-0055368,Clear America,Not captured,Not captured,Not captured,,Passport(103891499),Spouse,GONZALEZ DE BARRIOS,ARACELIS,RAMONA,11/08/1966,female,Not captured,Not captured,Not captured,Not captured,Not captured,Not captured,Not captured,Not captured,Not captured,Not captured,Not captured,Not captured,Not captured,,,Not captured,Not captured,Not captured,Not captured,AV. MADRID URB. EL PARQUE RES. PARQUE BARQUISIMETO TORRE B APTO 23B,,BARQUISIMETO,Lara,3001,+584145032671,,Not captured,Not captured,ANTILLANOP@HOTMAIL.COM,Not captured,,802047156,Not captured,Not captured,Not captured,Not captured,Not captured,Not captured,
Not captured,Not captured,04/07/2020,Not captured,Not captured,863949,020,00072,ARS-02-0055665,Beacon America,Not captured,Not captured,Not captured,,,,Savoie,Katherine,,03/21/1990,female,Not captured,Not captured,Not captured,Not captured,Not captured,Not captured,Not captured,Not captured,Not captured,Not captured,Not captured,Not captured,Not captured,,,Not captured,Not captured,Not captured,Not captured,32 Moonstone Lane,,Whitehorse,British Columbia,Y1A 5Z9,,,Not captured,Not captured,xiokikauka@gmail.com,Not captured,802047937,,Not captured,Not captured,Not captured,Not captured,Not captured,Not captured,
Not captured,Not captured,04/08/2020,Not captured,Not captured,863949,020,00072,ARS-02-0055647,Beacon America,Not captured,Not captured,Not captured,Passport(bh3573874),,,kocsis,gabor,,08/06/1969,male,Not captured,Not captured,Not captured,Not captured,Not captured,Not captured,Not captured,Not captured,Not captured,Not captured,Not captured,Not captured,Not captured,gabor kocsis jr,son,Not captured,Not captured,Not captured,Not captured,2 s end ave,,NEW YORK,NY,102,9173598568,9177249966,Not captured,Not captured,gaborspainting@hotmail.com,Not captured,802047901,,Not captured,Not captured,Not captured,Not captured,Not captured,Not captured,
Not captured,Not captured,04/10/2020,Not captured,Not captured,863949,020,00072,ARS-03-0055617,Essential America,Not captured,Not captured,Not captured,Passport(GF979557),,,Patel,Chittranjan,,08/15/1969,male,Not captured,Not captured,Not captured,Not captured,Not captured,Not captured,Not captured,Not captured,Not captured,Not captured,Not captured,Not captured,Not captured,,,Not captured,Not captured,Not captured,Not captured,141 Shadywood Lane,,Elk Grove Village,Illinois,60007,847-385-4231,,Not captured,Not captured,chitu.patel@hotmail.com,Not captured,802047870,,Not captured,Not captured,Not captured,Not captured,Not captured,Not captured,
Not captured,Not captured,04/16/2020,Not captured,Not captured,863949,020,00072,ARS-01-0055561,Beacon International,Not captured,Not captured,Not captured,,,,Karlen,Peter,,02/22/1949,male,Not captured,Not captured,Not captured,Not captured,Not captured,Not captured,Not captured,Not captured,Not captured,Not captured,Not captured,Not captured,Not captured,Lynette Thwaites,Spouse,Not captured,Not captured,Not captured,Not captured,7979 Ivanhoe Ave,,La Jolla,California,92037,8583737646,,Not captured,Not captured,karlenpc@me.com,Not captured,802047805,,Not captured,Not captured,Not captured,Not captured,Not captured,Not captured,
Not captured,Not captured,04/11/2020,Not captured,Not captured,863949,020,00072,ARS-01-0055409,Beacon International,Not captured,Not captured,Not captured,Passport(644986280),,,Williams,Lauren,R,12/03/2002,female,Not captured,Not captured,Not captured,Not captured,Not captured,Not captured,Not captured,Not captured,Not captured,Not captured,Not captured,Not captured,Not captured,Justin Williams,Father,Not captured,Not captured,Not captured,Not captured,27467 St. Andrews Lane,,Valley Center,California,92082,7608073930,,Not captured,Not captured,jwilliams@theprosourcegroup.com,Not captured,802047338,,Not captured,Not captured,Not captured,Not captured,Not captured,Not captured,
Not captured,Not captured,04/18/2020,Not captured,Not captured,863949,020,00072,ARS-01-0055268,Beacon International,Not captured,Not captured,Not captured,,,,Junco,Kaysie,L,09/12/1991,female,Not captured,Not captured,Not captured,Not captured,Not captured,Not captured,Not captured,Not captured,Not captured,Not captured,Not captured,Not captured,Not captured,,,Not captured,Not captured,Not captured,Not captured,513 Bellgrove Dr,,Hope Mills,North Carolina,28348,,,Not captured,Not captured,kckarate2005@yahoo.com,Not captured,802046748,,Not captured,Not captured,Not captured,Not captured,Not captured,Not captured,
Not captured,Not captured,04/18/2020,Not captured,Not captured,863949,020,00072,ARS-01-0055267,Beacon International,Not captured,Not captured,Not captured,,,,Miller,Jordan,,05/10/1988,male,Not captured,Not captured,Not captured,Not captured,Not captured,Not captured,Not captured,Not captured,Not captured,Not captured,Not captured,Not captured,Not captured,,,Not captured,Not captured,Not captured,Not captured,513 Bellgrove Dr,,Hope Mills,North Carolina,28348,,,Not captured,Not captured,kckarate2005@yahoo.com,Not captured,802046747,,Not captured,Not captured,Not captured,Not captured,Not captured,Not captured,
Not captured,Not captured,04/07/2020,Not captured,Not captured,863949,020,00072,ARS-02-0055122,Beacon America,Not captured,Not captured,Not captured,,,,Baxter,Kathleen,C,02/15/1952,female,Not captured,Not captured,Not captured,Not captured,Not captured,Not captured,Not captured,Not captured,Not captured,Not captured,Not captured,Not captured,Not captured,,,Not captured,Not captured,Not captured,Not captured,201 Las Palomas Street,,Rincon,,00677,,,Not captured,Not captured,bbaxter44@gmail.com,Not captured,802046004,,Not captured,Not captured,Not captured,Not captured,Not captured,Not captured,
Not captured,Not captured,04/07/2020,Not captured,Not captured,863949,020,00072,ARS-02-0055121,Beacon America,Not captured,Not captured,Not captured,,,,Baxter,Bruce,R,05/08/1952,male,Not captured,Not captured,Not captured,Not captured,Not captured,Not captured,Not captured,Not captured,Not captured,Not captured,Not captured,Not captured,Not captured,,,Not captured,Not captured,Not captured,Not captured,201 Las Palomas Street,,Rincon,,00677,,,Not captured,Not captured,bbaxter44@gmail.com,Not captured,802046003,,Not captured,Not captured,Not captured,Not captured,Not captured,Not captured,
Not captured,Not captured,04/07/2020,Not captured,Not captured,863949,020,00072,ARS-02-0055067,Beacon America,Not captured,Not captured,Not captured,,,,Camacho Diaz,Gabriela,Dorotea,09/09/1975,female,Not captured,Not captured,Not captured,Not captured,Not captured,Not captured,Not captured,Not captured,Not captured,Not captured,Not captured,Not captured,Not captured,,,Not captured,Not captured,Not captured,Not captured,American Embassy Mexico City,,Mexico DF,Mexico,06500,015550802990,,Not captured,Not captured,AlmazanE@state.gov,Not captured,802045923,,Not captured,Not captured,Not captured,Not captured,Not captured,Not captured,
Not captured,Not captured,04/10/2020,Not captured,Not captured,863949,020,00072,ARS-01-0054692,Beacon International,Not captured,Not captured,Not captured,,,,Cruz,John Charles,,10/28/1991,male,Not captured,Not captured,Not captured,Not captured,Not captured,Not captured,Not captured,Not captured,Not captured,Not captured,Not captured,Not captured,Not captured,,,Not captured,Not captured,Not captured,Not captured,1044 QUINCY AVENUE,,BRONX,New York,10465,,,Not captured,Not captured,kayefelle15@gmail.com,Not captured,802044923,,Not captured,Not captured,Not captured,Not captured,Not captured,Not captured,
Not captured,Not captured,04/10/2020,Not captured,Not captured,863949,020,00072,ARS-01-0054691,Beacon International,Not captured,Not captured,Not captured,,,,Labrador,Krysllin Faith,,07/19/1989,female,Not captured,Not captured,Not captured,Not captured,Not captured,Not captured,Not captured,Not captured,Not captured,Not captured,Not captured,Not captured,Not captured,,,Not captured,Not captured,Not captured,Not captured,1044 QUINCY AVENUE,,BRONX,New York,10465,,,Not captured,Not captured,kayefelle15@gmail.com,Not captured,802044922,,Not captured,Not captured,Not captured,Not captured,Not captured,Not captured,
Not captured,Not captured,04/06/2020,Not captured,Not captured,863949,020,00072,ARS-01-0054555,Beacon International,Not captured,Not captured,Not captured,,,,Poblador,Alessandra,,06/22/1993,female,Not captured,Not captured,Not captured,Not captured,Not captured,Not captured,Not captured,Not captured,Not captured,Not captured,Not captured,Not captured,Not captured,,,Not captured,Not captured,Not captured,Not captured,213 Butler Street,,New York,New York,11217,3478203585,,Not captured,Not captured,ale.poblador@gmail.com,Not captured,802044738,,Not captured,Not captured,Not captured,Not captured,Not captured,Not captured,
Not captured,Not captured,04/06/2020,Not captured,Not captured,863949,020,00072,ARS-01-0054494,Beacon International,Not captured,Not captured,Not captured,Passport(EB302074),,,housluvi,messanh,,09/12/1989,male,Not captured,Not captured,Not captured,Not captured,Not captured,Not captured,Not captured,Not captured,Not captured,Not captured,Not captured,Not captured,Not captured,messanh,messanh,Not captured,Not captured,Not captured,Not captured,111 Lafayette Rd apt#523,,Syracuse,New York,13205,3158781510,,Not captured,Not captured,housluvimessanh@gmail.com,Not captured,802044586,,Not captured,Not captured,Not captured,Not captured,Not captured,Not captured,