EE Transaction Type,Dependent Transaction Type,Effective Date,EE Signature,EE Signature Date,Control,Suffix,Account,Plan Number,Plan Name,Claim Office,Network ID Number,Customer Code,EE SSN,Dependent SSN,Dependent Relationship,Last Name,First Name,Middle Initial,DOB,Gender,Ethnicity,PCP/PCD,PCP/PCD Current Patient,Provider Cap Office Number,COB,Dep Student Indicator,Dep OOA Indicator,EE Prior Coverage Indicator,EE Late Entrant,EE Language Indicator,Hire Date,Earnings,Earnings Frequency,Beneficiary (Last Name First Name MI),Beneficiary Relationship,Continuation of Coverage Expiration Date,Continuation of Coverage Event Date,Continuation of Coverage Length of Coverage,Work Location Zip Code,Street Address Line 1,Street Address Line 2,City,State,Zip Code,Home Phone Number,Work Phone Number,Accept Code,Evidence Code,EE Email Address,Communication Disability Code,EE Alternate ID,Dep Alternate ID,Old Control,Old Suffix,Old Account,New Control,New Suffix,New Account,
Not captured,Not captured,04/10/2020,Not captured,Not captured,863949,020,00072,ARS-02-0055682,Beacon America,Not captured,Not captured,Not captured,,,,Thompson,Lexi,,09/20/2006,female,Not captured,Not captured,Not captured,Not captured,Not captured,Not captured,Not captured,Not captured,Not captured,Not captured,Not captured,Not captured,Not captured,,,Not captured,Not captured,Not captured,Not captured,4542 Blue Major Dr,,Windemere,Florida,34786,0000000000,,Not captured,Not captured,kellythompson07@yahoo.com,Not captured,802047964,,Not captured,Not captured,Not captured,Not captured,Not captured,Not captured,
Not captured,Not captured,04/10/2020,Not captured,Not captured,863949,020,00072,ARS-02-0055681,Beacon America,Not captured,Not captured,Not captured,,,,Thompson,Holly,,10/31/2003,female,Not captured,Not captured,Not captured,Not captured,Not captured,Not captured,Not captured,Not captured,Not captured,Not captured,Not captured,Not captured,Not captured,,,Not captured,Not captured,Not captured,Not captured,4542 Blue Major Dr,,Windemere,Florida,34786,0000000000,,Not captured,Not captured,kellythompson07@yahoo.com,Not captured,802047963,,Not captured,Not captured,Not captured,Not captured,Not captured,Not captured,
Not captured,Not captured,04/10/2020,Not captured,Not captured,863949,020,00072,ARS-02-0055680,Beacon America,Not captured,Not captured,Not captured,,,,Thompson,Andrew,,11/22/1975,male,Not captured,Not captured,Not captured,Not captured,Not captured,Not captured,Not captured,Not captured,Not captured,Not captured,Not captured,Not captured,Not captured,,,Not captured,Not captured,Not captured,Not captured,4542 Blue Major Dr,,Windemere,Florida,34786,0000000000,,Not captured,Not captured,kellythompson07@yahoo.com,Not captured,802047962,,Not captured,Not captured,Not captured,Not captured,Not captured,Not captured,
Not captured,Not captured,04/10/2020,Not captured,Not captured,863949,020,00072,ARS-02-0055679,Beacon America,Not captured,Not captured,Not captured,Passport(578203465),,,Thompson,Kelly,,02/22/1978,female,Not captured,Not captured,Not captured,Not captured,Not captured,Not captured,Not captured,Not captured,Not captured,Not captured,Not captured,Not captured,Not captured,,,Not captured,Not captured,Not captured,Not captured,4542 Blue Major Dr,,Windemere,Florida,34786,0000000000,,Not captured,Not captured,kellythompson07@yahoo.com,Not captured,802047961,,Not captured,Not captured,Not captured,Not captured,Not captured,Not captured,
Not captured,Not captured,04/07/2020,Not captured,Not captured,863949,020,00072,ARS-03-0055668,Essential America,Not captured,Not captured,Not captured,Passport(P03756458),,,Edris,Tagwa,,10/16/1991,female,Not captured,Not captured,Not captured,Not captured,Not captured,Not captured,Not captured,Not captured,Not captured,Not captured,Not captured,Not captured,Not captured,,,Not captured,Not captured,Not captured,Not captured,6014 NE 112th Ave,,Portland,Oregon,97220,4259536427,,Not captured,Not captured,ellateagan@gmail.com,Not captured,802047941,,Not captured,Not captured,Not captured,Not captured,Not captured,Not captured,
Not captured,Not captured,04/07/2020,Not captured,Not captured,863949,020,00072,ARS-03-0055668,Essential America,Not captured,Not captured,Not captured,,Passport(P06358802),Dependant,Saeed,Howaida,,03/23/2019,female,Not captured,Not captured,Not captured,Not captured,Not captured,Not captured,Not captured,Not captured,Not captured,Not captured,Not captured,Not captured,Not captured,,,Not captured,Not captured,Not captured,Not captured,6014 NE 112th Ave,,Portland,Oregon,97220,4259536427,,Not captured,Not captured,ellateagan@gmail.com,Not captured,,802047942,Not captured,Not captured,Not captured,Not captured,Not captured,Not captured,
Not captured,Not captured,04/07/2020,Not captured,Not captured,863949,020,00072,ARS-03-0055670,Essential America,Not captured,Not captured,Not captured,Passport(PP4049299),,,Charles,Anne,Love,04/01/1988,female,Not captured,Not captured,Not captured,Not captured,Not captured,Not captured,Not captured,Not captured,Not captured,Not captured,Not captured,Not captured,Not captured,,,Not captured,Not captured,Not captured,Not captured,19866 E 40th Place,,Denver,Colorado,80249,303-261-2116,,Not captured,Not captured,jeano4luto@yahoo.com,Not captured,802047945,,Not captured,Not captured,Not captured,Not captured,Not captured,Not captured,
Not captured,Not captured,04/07/2020,Not captured,Not captured,863949,020,00072,ARS-03-0055670,Essential America,Not captured,Not captured,Not captured,,Driving License(062850774),Spouse,Charles,Jean,Edouard,03/05/1990,male,Not captured,Not captured,Not captured,Not captured,Not captured,Not captured,Not captured,Not captured,Not captured,Not captured,Not captured,Not captured,Not captured,,,Not captured,Not captured,Not captured,Not captured,19866 E 40th Place,,Denver,Colorado,80249,303-261-2116,,Not captured,Not captured,jeano4luto@yahoo.com,Not captured,,802047946,Not captured,Not captured,Not captured,Not captured,Not captured,Not captured,
Not captured,Not captured,04/07/2020,Not captured,Not captured,863949,020,00072,ARS-01-0055671,Beacon International,Not captured,Not captured,Not captured,,,,Ward,Micah Nathaniel,,11/01/1983,male,Not captured,Not captured,Not captured,Not captured,Not captured,Not captured,Not captured,Not captured,Not captured,Not captured,Not captured,Not captured,Not captured,Claudia Ward,mother,Not captured,Not captured,Not captured,Not captured,P.O. Box 7652,,Moore,Oklahoma,73153,4054132191,,Not captured,Not captured,cswconst@sbcglobal.net,Not captured,802047949,,Not captured,Not captured,Not captured,Not captured,Not captured,Not captured,
Not captured,Not captured,04/06/2020,Not captured,Not captured,863949,020,00072,ARS-05-0055369,Clear America,Not captured,Not captured,Not captured,Passport(134686057),,,BARRIOS,JULIO,ANGEL,04/15/1990,male,Not captured,Not captured,Not captured,Not captured,Not captured,Not captured,Not captured,Not captured,Not captured,Not captured,Not captured,Not captured,Not captured,,,Not captured,Not captured,Not captured,Not captured,AV. MADRID URB. EL PARQUE RES. PARQUE BARQUISIMETO TORRE B APTO 23B,,BAEQUISIMETO,Lara,3001,+584145032671,,Not captured,Not captured,ANTILLANOP@HOTMAIL.COM,Not captured,802047157,,Not captured,Not captured,Not captured,Not captured,Not captured,Not captured,
Not captured,Not captured,04/06/2020,Not captured,Not captured,863949,020,00072,ARS-05-0055368,Clear America,Not captured,Not captured,Not captured,Passport(104143757),,,BARRIOS,PEDRO,TOMMY,01/22/1958,male,Not captured,Not captured,Not captured,Not captured,Not captured,Not captured,Not captured,Not captured,Not captured,Not captured,Not captured,Not captured,Not captured,,,Not captured,Not captured,Not captured,Not captured,AV. MADRID URB. EL PARQUE RES. PARQUE BARQUISIMETO TORRE B APTO 23B,,BARQUISIMETO,Lara,3001,+584145032671,,Not captured,Not captured,ANTILLANOP@HOTMAIL.COM,Not captured,802047155,,Not captured,Not captured,Not captured,Not captured,Not captured,Not captured,
Not captured,Not captured,04/06/2020,Not captured,Not captured,863949,020,00072,ARS-05-0055368,Clear America,Not captured,Not captured,Not captured,,Passport(103891499),Spouse,GONZALEZ DE BARRIOS,ARACELIS,RAMONA,11/08/1966,female,Not captured,Not captured,Not captured,Not captured,Not captured,Not captured,Not captured,Not captured,Not captured,Not captured,Not captured,Not captured,Not captured,,,Not captured,Not captured,Not captured,Not captured,AV. MADRID URB. EL PARQUE RES. PARQUE BARQUISIMETO TORRE B APTO 23B,,BARQUISIMETO,Lara,3001,+584145032671,,Not captured,Not captured,ANTILLANOP@HOTMAIL.COM,Not captured,,802047156,Not captured,Not captured,Not captured,Not captured,Not captured,Not captured,
Not captured,Not captured,04/07/2020,Not captured,Not captured,863949,020,00072,ARS-02-0055665,Beacon America,Not captured,Not captured,Not captured,,,,Savoie,Katherine,,03/21/1990,female,Not captured,Not captured,Not captured,Not captured,Not captured,Not captured,Not captured,Not captured,Not captured,Not captured,Not captured,Not captured,Not captured,,,Not captured,Not captured,Not captured,Not captured,32 Moonstone Lane,,Whitehorse,British Columbia,Y1A 5Z9,,,Not captured,Not captured,xiokikauka@gmail.com,Not captured,802047937,,Not captured,Not captured,Not captured,Not captured,Not captured,Not captured,
Not captured,Not captured,04/08/2020,Not captured,Not captured,863949,020,00072,ARS-02-0055647,Beacon America,Not captured,Not captured,Not captured,Passport(bh3573874),,,kocsis,gabor,,08/06/1969,male,Not captured,Not captured,Not captured,Not captured,Not captured,Not captured,Not captured,Not captured,Not captured,Not captured,Not captured,Not captured,Not captured,gabor kocsis jr,son,Not captured,Not captured,Not captured,Not captured,2 s end ave,,NEW YORK,NY,102,9173598568,9177249966,Not captured,Not captured,gaborspainting@hotmail.com,Not captured,802047901,,Not captured,Not captured,Not captured,Not captured,Not captured,Not captured,
Not captured,Not captured,04/10/2020,Not captured,Not captured,863949,020,00072,ARS-03-0055617,Essential America,Not captured,Not captured,Not captured,Passport(GF979557),,,Patel,Chittranjan,,08/15/1969,male,Not captured,Not captured,Not captured,Not captured,Not captured,Not captured,Not captured,Not captured,Not captured,Not captured,Not captured,Not captured,Not captured,,,Not captured,Not captured,Not captured,Not captured,141 Shadywood Lane,,Elk Grove Village,Illinois,60007,847-385-4231,,Not captured,Not captured,chitu.patel@hotmail.com,Not captured,802047870,,Not captured,Not captured,Not captured,Not captured,Not captured,Not captured,
Not captured,Not captured,04/11/2020,Not captured,Not captured,863949,020,00072,ARS-01-0055409,Beacon International,Not captured,Not captured,Not captured,Passport(644986280),,,Williams,Lauren,R,12/03/2002,female,Not captured,Not captured,Not captured,Not captured,Not captured,Not captured,Not captured,Not captured,Not captured,Not captured,Not captured,Not captured,Not captured,Justin Williams,Father,Not captured,Not captured,Not captured,Not captured,27467 St. Andrews Lane,,Valley Center,California,92082,7608073930,,Not captured,Not captured,jwilliams@theprosourcegroup.com,Not captured,802047338,,Not captured,Not captured,Not captured,Not captured,Not captured,Not captured,
Not captured,Not captured,04/07/2020,Not captured,Not captured,863949,020,00072,ARS-02-0055122,Beacon America,Not captured,Not captured,Not captured,,,,Baxter,Kathleen,C,02/15/1952,female,Not captured,Not captured,Not captured,Not captured,Not captured,Not captured,Not captured,Not captured,Not captured,Not captured,Not captured,Not captured,Not captured,,,Not captured,Not captured,Not captured,Not captured,201 Las Palomas Street,,Rincon,,00677,,,Not captured,Not captured,bbaxter44@gmail.com,Not captured,802046004,,Not captured,Not captured,Not captured,Not captured,Not captured,Not captured,
Not captured,Not captured,04/07/2020,Not captured,Not captured,863949,020,00072,ARS-02-0055121,Beacon America,Not captured,Not captured,Not captured,,,,Baxter,Bruce,R,05/08/1952,male,Not captured,Not captured,Not captured,Not captured,Not captured,Not captured,Not captured,Not captured,Not captured,Not captured,Not captured,Not captured,Not captured,,,Not captured,Not captured,Not captured,Not captured,201 Las Palomas Street,,Rincon,,00677,,,Not captured,Not captured,bbaxter44@gmail.com,Not captured,802046003,,Not captured,Not captured,Not captured,Not captured,Not captured,Not captured,
Not captured,Not captured,04/07/2020,Not captured,Not captured,863949,020,00072,ARS-02-0055067,Beacon America,Not captured,Not captured,Not captured,,,,Camacho Diaz,Gabriela,Dorotea,09/09/1975,female,Not captured,Not captured,Not captured,Not captured,Not captured,Not captured,Not captured,Not captured,Not captured,Not captured,Not captured,Not captured,Not captured,,,Not captured,Not captured,Not captured,Not captured,American Embassy Mexico City,,Mexico DF,Mexico,06500,015550802990,,Not captured,Not captured,AlmazanE@state.gov,Not captured,802045923,,Not captured,Not captured,Not captured,Not captured,Not captured,Not captured,
Not captured,Not captured,04/10/2020,Not captured,Not captured,863949,020,00072,ARS-01-0054692,Beacon International,Not captured,Not captured,Not captured,,,,Cruz,John Charles,,10/28/1991,male,Not captured,Not captured,Not captured,Not captured,Not captured,Not captured,Not captured,Not captured,Not captured,Not captured,Not captured,Not captured,Not captured,,,Not captured,Not captured,Not captured,Not captured,1044 QUINCY AVENUE,,BRONX,New York,10465,,,Not captured,Not captured,kayefelle15@gmail.com,Not captured,802044923,,Not captured,Not captured,Not captured,Not captured,Not captured,Not captured,
Not captured,Not captured,04/10/2020,Not captured,Not captured,863949,020,00072,ARS-01-0054691,Beacon International,Not captured,Not captured,Not captured,,,,Labrador,Krysllin Faith,,07/19/1989,female,Not captured,Not captured,Not captured,Not captured,Not captured,Not captured,Not captured,Not captured,Not captured,Not captured,Not captured,Not captured,Not captured,,,Not captured,Not captured,Not captured,Not captured,1044 QUINCY AVENUE,,BRONX,New York,10465,,,Not captured,Not captured,kayefelle15@gmail.com,Not captured,802044922,,Not captured,Not captured,Not captured,Not captured,Not captured,Not captured,
Not captured,Not captured,04/06/2020,Not captured,Not captured,863949,020,00072,ARS-01-0054555,Beacon International,Not captured,Not captured,Not captured,,,,Poblador,Alessandra,,06/22/1993,female,Not captured,Not captured,Not captured,Not captured,Not captured,Not captured,Not captured,Not captured,Not captured,Not captured,Not captured,Not captured,Not captured,,,Not captured,Not captured,Not captured,Not captured,213 Butler Street,,New York,New York,11217,3478203585,,Not captured,Not captured,ale.poblador@gmail.com,Not captured,802044738,,Not captured,Not captured,Not captured,Not captured,Not captured,Not captured,
Not captured,Not captured,04/06/2020,Not captured,Not captured,863949,020,00072,ARS-01-0054494,Beacon International,Not captured,Not captured,Not captured,Passport(EB302074),,,housluvi,messanh,,09/12/1989,male,Not captured,Not captured,Not captured,Not captured,Not captured,Not captured,Not captured,Not captured,Not captured,Not captured,Not captured,Not captured,Not captured,messanh,messanh,Not captured,Not captured,Not captured,Not captured,111 Lafayette Rd apt#523,,Syracuse,New York,13205,3158781510,,Not captured,Not captured,housluvimessanh@gmail.com,Not captured,802044586,,Not captured,Not captured,Not captured,Not captured,Not captured,Not captured,
Not captured,Not captured,04/06/2020,Not captured,Not captured,863949,020,00072,ARS-02-0053918,Beacon America,Not captured,Not captured,Not captured,,,,FAYTROUNI,FARAH,,07/09/1990,female,Not captured,Not captured,Not captured,Not captured,Not captured,Not captured,Not captured,Not captured,Not captured,Not captured,Not captured,Not captured,Not captured,,,Not captured,Not captured,Not captured,Not captured,4649 OSLER STREET,,Vancouver,British Columbia,V6H2Y3,7789398026,,Not captured,Not captured,farah.faytrouni@cw.bc.ca,Not captured,701943246,,Not captured,Not captured,Not captured,Not captured,Not captured,Not captured,
Not captured,Not captured,04/07/2020,Not captured,Not captured,863949,020,00072,ARS-02-0053845,Beacon America,Not captured,Not captured,Not captured,,,,Gonzalez Archila,Zolimar,S,07/23/1992,female,Not captured,Not captured,Not captured,Not captured,Not captured,Not captured,Not captured,Not captured,Not captured,Not captured,Not captured,Not captured,Not captured,Zoila Archila,Esposa,Not captured,Not captured,Not captured,Not captured,8180 Geneva CT,,Doral,Florida,33166,7869914754,+584144389169,Not captured,Not captured,zolimargonzalez.zg@gmail.com,Not captured,701943068,,Not captured,Not captured,Not captured,Not captured,Not captured,Not captured,
Not captured,Not captured,11/09/2020,Not captured,Not captured,863949,020,00072,BG001030-23-ecec2d8a,International Assurance,Not captured,Not captured,Not captured,-,-,,Davidson,Kelsey,A,11/26/2000,female,Not captured,Not captured,Not captured,Not captured,Not captured,Not captured,Not captured,Not captured,Not captured,Not captured,Not captured,Not captured,Not captured,,,Not captured,Not captured,Not captured,Not captured,1434 Hickory Rd,,Hickory,Kentucky,42051,(270)356-6809,,Not captured,Not captured,kelseydavidson00@icloud.com,Not captured,802047959,,Not captured,Not captured,Not captured,Not captured,Not captured,Not captured,
Not captured,Not captured,11/09/2020,Not captured,Not captured,863949,020,00072,BG001030-23-79e20993,International Assurance,Not captured,Not captured,Not captured,-,-,,winters,gavin,r,09/27/2010,male,Not captured,Not captured,Not captured,Not captured,Not captured,Not captured,Not captured,Not captured,Not captured,Not captured,Not captured,Not captured,Not captured,,,Not captured,Not captured,Not captured,Not captured,12365 highway 60 west,,kevil,Kentucky,42053,618-645-0053,,Not captured,Not captured,hrw5272@gmail.com,Not captured,802047948,,Not captured,Not captured,Not captured,Not captured,Not captured,Not captured,
Not captured,Not captured,06/01/2020,Not captured,Not captured,863949,020,00072,BG001030-23-96e6e3ad,International Assurance,Not captured,Not captured,Not captured,-,-,,winters,houston,r,09/08/1989,male,Not captured,Not captured,Not captured,Not captured,Not captured,Not captured,Not captured,Not captured,Not captured,Not captured,Not captured,Not captured,Not captured,,,Not captured,Not captured,Not captured,Not captured,12365 highway 60 west,,kevil,Kentucky,42053,618-645-0053,,Not captured,Not captured,hrw5272@gmail.com,Not captured,802047947,,Not captured,Not captured,Not captured,Not captured,Not captured,Not captured