EE Transaction Type,Dependent Transaction Type,Effective Date,EE Signature,EE Signature Date,Control,Suffix,Account,Plan Number,Plan Name,Claim Office,Network ID Number,Customer Code,EE SSN,Dependent SSN,Dependent Relationship,Last Name,First Name,Middle Initial,DOB,Gender,Ethnicity,PCP/PCD,PCP/PCD Current Patient,Provider Cap Office Number,COB,Dep Student Indicator,Dep OOA Indicator,EE Prior Coverage Indicator,EE Late Entrant,EE Language Indicator,Hire Date,Earnings,Earnings Frequency,Beneficiary (Last Name First Name MI),Beneficiary Relationship,Continuation of Coverage Expiration Date,Continuation of Coverage Event Date,Continuation of Coverage Length of Coverage,Work Location Zip Code,Street Address Line 1,Street Address Line 2,City,State,Zip Code,Home Phone Number,Work Phone Number,Accept Code,Evidence Code,EE Email Address,Communication Disability Code,EE Alternate ID,Dep Alternate ID,Old Control,Old Suffix,Old Account,New Control,New Suffix,New Account,
Not captured,Not captured,03/20/2020,Not captured,Not captured,863949,020,00072,ARS-03-0055602,Essential America,Not captured,Not captured,Not captured,Passport(D10133939),,,Yedla,Rathish ,Reddy,01/28/1992,male,Not captured,Not captured,Not captured,Not captured,Not captured,Not captured,Not captured,Not captured,Not captured,Not captured,Not captured,Not captured,Not captured,,,Not captured,Not captured,Not captured,Not captured,6-103/1 Anksapur,,Nizamabad,Andhra Pradesh,503311,919848448888,,Not captured,Not captured,rathishreddy55@gmail.com,Not captured,802047853,,Not captured,Not captured,Not captured,Not captured,Not captured,Not captured,
Not captured,Not captured,03/19/2020,Not captured,Not captured,863949,020,00072,ARS-03-0055594,Essential America,Not captured,Not captured,Not captured,Passport(11111),,,Srivastava,Madhuresh,,01/10/1988,male,Not captured,Not captured,Not captured,Not captured,Not captured,Not captured,Not captured,Not captured,Not captured,Not captured,Not captured,Not captured,Not captured,,,Not captured,Not captured,Not captured,Not captured,D1/47 Greenfields JVLR,,Mumbai,Maharashtra,400093,321-310-2184,,Not captured,Not captured,madhuresh.srivastav@gmail.com,Not captured,802047840,,Not captured,Not captured,Not captured,Not captured,Not captured,Not captured,
Not captured,Not captured,03/21/2020,Not captured,Not captured,863949,020,00072,ARS-01-0055605,Beacon International,Not captured,Not captured,Not captured,,,,McClay,Kaysie,,11/22/2011,female,Not captured,Not captured,Not captured,Not captured,Not captured,Not captured,Not captured,Not captured,Not captured,Not captured,Not captured,Not captured,Not captured,,,Not captured,Not captured,Not captured,Not captured,11 bruce grove,,Peterborough,England,pe7 0nl,07599128476,,Not captured,Not captured,amy-harrison1991@hotmail.com,Not captured,802047856,,Not captured,Not captured,Not captured,Not captured,Not captured,Not captured,
Not captured,Not captured,03/19/2020,Not captured,Not captured,863949,020,00072,ARS-02-0055603,Beacon America,Not captured,Not captured,Not captured,Passport(EE8886395),,,YAO,WENHONG,,07/09/1970,female,Not captured,Not captured,Not captured,Not captured,Not captured,Not captured,Not captured,Not captured,Not captured,Not captured,Not captured,Not captured,Not captured,,,Not captured,Not captured,Not captured,Not captured,1045 Trinity Dr,,Menlo Park,California,94025,6505152218,,Not captured,Not captured,wangkeda228@gmail.com,Not captured,802047854,,Not captured,Not captured,Not captured,Not captured,Not captured,Not captured,
Not captured,Not captured,03/19/2020,Not captured,Not captured,863949,020,00072,ARS-02-0055601,Beacon America,Not captured,Not captured,Not captured,,,,Oeveraas,Nathaniel,,12/25/2008,male,Not captured,Not captured,Not captured,Not captured,Not captured,Not captured,Not captured,Not captured,Not captured,Not captured,Not captured,Not captured,Not captured,,,Not captured,Not captured,Not captured,Not captured,2359 SW 102nd AVE,,Miramar,,33025,3057265854,,Not captured,Not captured,yazoveras@gmail.com,Not captured,802047852,,Not captured,Not captured,Not captured,Not captured,Not captured,Not captured,
Not captured,Not captured,03/19/2020,Not captured,Not captured,863949,020,00072,ARS-02-0055600,Beacon America,Not captured,Not captured,Not captured,Passport(32765345),,,Oeveraas,Yasjmine ,,02/12/1976,female,Not captured,Not captured,Not captured,Not captured,Not captured,Not captured,Not captured,Not captured,Not captured,Not captured,Not captured,Not captured,Not captured,,,Not captured,Not captured,Not captured,Not captured,2359 SW 102nd AVE,,Miramar,,33025,3057265854,,Not captured,Not captured,yazoveras@gmail.com,Not captured,802047851,,Not captured,Not captured,Not captured,Not captured,Not captured,Not captured,
Not captured,Not captured,03/19/2020,Not captured,Not captured,863949,020,00072,ARS-02-0055599,Beacon America,Not captured,Not captured,Not captured,Passport(147189679),,,CONTRERAS ROA,FRANCY ARACELLI,,11/23/1993,female,Not captured,Not captured,Not captured,Not captured,Not captured,Not captured,Not captured,Not captured,Not captured,Not captured,Not captured,Not captured,Not captured,IRAIMA ARACELLI ROA,MADRE,Not captured,Not captured,Not captured,Not captured,URB.TERRAZAS DE PARAMILLO CASA #3 LA CUEVA DEL OSO,,SAN CRISTOBAL,Tachira,5001,584147068724,584147068724,Not captured,Not captured,FRANCYARACELI@GMAIL.COM,Not captured,802047850,,Not captured,Not captured,Not captured,Not captured,Not captured,Not captured,
Not captured,Not captured,03/18/2020,Not captured,Not captured,863949,020,00072,ARS-02-0055595,Beacon America,Not captured,Not captured,Not captured,Passport(EA5280898),,,WANG,KEDA,,02/28/1970,male,Not captured,Not captured,Not captured,Not captured,Not captured,Not captured,Not captured,Not captured,Not captured,Not captured,Not captured,Not captured,Not captured,,,Not captured,Not captured,Not captured,Not captured,1045 Trinity Dr,,Menlo Park,California,94025 ,6505152218,,Not captured,Not captured,wangkeda228@gmail.com,Not captured,802047842,,Not captured,Not captured,Not captured,Not captured,Not captured,Not captured,
Not captured,Not captured,03/19/2020,Not captured,Not captured,863949,020,00072,ARS-02-0055593,Beacon America,Not captured,Not captured,Not captured,,,,Goldmunzer,Chaya ,,10/28/1961,female,Not captured,Not captured,Not captured,Not captured,Not captured,Not captured,Not captured,Not captured,Not captured,Not captured,Not captured,Not captured,Not captured,,,Not captured,Not captured,Not captured,Not captured,5 Chanina Schiff Street,,Jerusalem,Yerushalayim,90027,8453541393,,Not captured,Not captured,5484027@gmail.com,Not captured,802047839,,Not captured,Not captured,Not captured,Not captured,Not captured,Not captured,
Not captured,Not captured,03/19/2020,Not captured,Not captured,863949,020,00072,ARS-02-0055592,Beacon America,Not captured,Not captured,Not captured,,,,Goldmunzer,Aron ,,10/23/1961,male,Not captured,Not captured,Not captured,Not captured,Not captured,Not captured,Not captured,Not captured,Not captured,Not captured,Not captured,Not captured,Not captured,,,Not captured,Not captured,Not captured,Not captured,5 Chanina Schiff Street,,Jerusalem,Yerushalayim,90027,8453541393,,Not captured,Not captured,5484027@gmail.com,Not captured,802047838,,Not captured,Not captured,Not captured,Not captured,Not captured,Not captured,
Not captured,Not captured,03/18/2020,Not captured,Not captured,863949,020,00072,ARS-03-0055583,Essential America,Not captured,Not captured,Not captured,Passport(Z3127819),,,Nallamilli,Manikanta,S.,04/20/1994,male,Not captured,Not captured,Not captured,Not captured,Not captured,Not captured,Not captured,Not captured,Not captured,Not captured,Not captured,Not captured,Not captured,,,Not captured,Not captured,Not captured,Not captured,1-211 DRK Nagar,,East Godavari,Andhra Pradesh,533344,2039163730,,Not captured,Not captured,manisurya321@gmail.com,Not captured,802047827,,Not captured,Not captured,Not captured,Not captured,Not captured,Not captured,
Not captured,Not captured,03/18/2020,Not captured,Not captured,863949,020,00072,ARS-02-0055591,Beacon America,Not captured,Not captured,Not captured,,,,Jones,Elizabeth,M,03/22/1978,female,Not captured,Not captured,Not captured,Not captured,Not captured,Not captured,Not captured,Not captured,Not captured,Not captured,Not captured,Not captured,Not captured,,,Not captured,Not captured,Not captured,Not captured,51 Amwell Road,,Cambridge,,CB4 2UH,,,Not captured,Not captured,beth.j@hotmail.com,Not captured,802047837,,Not captured,Not captured,Not captured,Not captured,Not captured,Not captured,
Not captured,Not captured,03/19/2020,Not captured,Not captured,863949,020,00072,ARS-02-0055587,Beacon America,Not captured,Not captured,Not captured,,,,Zhadnov,Nikita,O,12/05/1993,male,Not captured,Not captured,Not captured,Not captured,Not captured,Not captured,Not captured,Not captured,Not captured,Not captured,Not captured,Not captured,Not captured,,,Not captured,Not captured,Not captured,Not captured,Zelenaya gorka street 1 c1,,Moscow,,108811,,,Not captured,Not captured,nik.zhadnov@yandex.ru,Not captured,802047832,,Not captured,Not captured,Not captured,Not captured,Not captured,Not captured,
Not captured,Not captured,03/18/2020,Not captured,Not captured,863949,020,00072,ARS-02-0055586,Beacon America,Not captured,Not captured,Not captured,Passport(P9323851A),,,Cabreros,Marichu,Benganio,04/12/1979,female,Not captured,Not captured,Not captured,Not captured,Not captured,Not captured,Not captured,Not captured,Not captured,Not captured,Not captured,Not captured,Not captured,Dean Eric Lopez,Fiancee,Not captured,Not captured,Not captured,Not captured,20226 Sunflower Chase Dr.,,Katy,Texas,77449,832-563-8928,,Not captured,Not captured,dlo.houston@gmail.com,Not captured,802047831,,Not captured,Not captured,Not captured,Not captured,Not captured,Not captured,
Not captured,Not captured,03/17/2020,Not captured,Not captured,863949,020,00072,ARS-01-0055584,Beacon International,Not captured,Not captured,Not captured,Passport(545591384),,,Gehman,Abigail,E,02/04/1999,female,Not captured,Not captured,Not captured,Not captured,Not captured,Not captured,Not captured,Not captured,Not captured,Not captured,Not captured,Not captured,Not captured,Brooke Gehman,father,Not captured,Not captured,Not captured,Not captured,110 Woodruff Road,,Adams,Tennessee,37010,6153057055,,Not captured,Not captured,gehmanclan@gmail.com,Not captured,802047829,,Not captured,Not captured,Not captured,Not captured,Not captured,Not captured,
Not captured,Not captured,03/17/2020,Not captured,Not captured,863949,020,00072,ARS-03-0055564,Essential International,Not captured,Not captured,Not captured,Passport(714036472),,,SUKHANOVA,ELENA,,08/13/1985,female,Not captured,Not captured,Not captured,Not captured,Not captured,Not captured,Not captured,Not captured,Not captured,Not captured,Not captured,Not captured,Not captured,,,Not captured,Not captured,Not captured,Not captured,2728 MCKINNON ST,,DALLAS,Texas,75201,4693692277,,Not captured,Not captured,lena.sukhanova@gmail.com,Not captured,802047808,,Not captured,Not captured,Not captured,Not captured,Not captured,Not captured,
Not captured,Not captured,03/17/2020,Not captured,Not captured,863949,020,00072,ARS-03-0055563,Essential America,Not captured,Not captured,Not captured,Passport(NA),,,ROBERT,ANDRE,,07/10/1971,male,Not captured,Not captured,Not captured,Not captured,Not captured,Not captured,Not captured,Not captured,Not captured,Not captured,Not captured,Not captured,Not captured,,,Not captured,Not captured,Not captured,Not captured,2728 MCKINNON ST,,DALLAS,Texas,75201,4693692277,,Not captured,Not captured,aer4090@yahoo.com,Not captured,802047807,,Not captured,Not captured,Not captured,Not captured,Not captured,Not captured,
Not captured,Not captured,03/17/2020,Not captured,Not captured,863949,020,00072,ARS-03-0055562,Essential America,Not captured,Not captured,Not captured,Passport(DL-TS10820150002599),,,Kasinadhuni,Sai Phani Kiran,,11/07/1989,male,Not captured,Not captured,Not captured,Not captured,Not captured,Not captured,Not captured,Not captured,Not captured,Not captured,Not captured,Not captured,Not captured,,,Not captured,Not captured,Not captured,Not captured,House No-11-6-11 Venkateswar Col,,Hyderaban,Andhra Pradesh,500034,609-649-1188,,Not captured,Not captured,phani.kiran0204@gmail.com,Not captured,802047806,,Not captured,Not captured,Not captured,Not captured,Not captured,Not captured,
Not captured,Not captured,03/17/2020,Not captured,Not captured,863949,020,00072,ARS-02-0055579,Beacon America,Not captured,Not captured,Not captured,,,,MAHADEW,SHANTA,,10/05/1963,female,Not captured,Not captured,Not captured,Not captured,Not captured,Not captured,Not captured,Not captured,Not captured,Not captured,Not captured,Not captured,Not captured,,,Not captured,Not captured,Not captured,Not captured,2425 Wilson Blvd. Suite 350,,Arlington,Virginia,22201,7038415607,,Not captured,Not captured,mhernandez@ncsc.org,Not captured,802047823,,Not captured,Not captured,Not captured,Not captured,Not captured,Not captured,
Not captured,Not captured,03/17/2020,Not captured,Not captured,863949,020,00072,ARS-02-0055578,Beacon America,Not captured,Not captured,Not captured,,,,RAMJIAWAN,ROMARIO,,09/26/1990,male,Not captured,Not captured,Not captured,Not captured,Not captured,Not captured,Not captured,Not captured,Not captured,Not captured,Not captured,Not captured,Not captured,,,Not captured,Not captured,Not captured,Not captured,2425 Wilson Blvd. Suite 350,,Arlington,Virginia,22201,7038415607,,Not captured,Not captured,mhernandez@ncsc.org,Not captured,802047822,,Not captured,Not captured,Not captured,Not captured,Not captured,Not captured,
Not captured,Not captured,03/17/2020,Not captured,Not captured,863949,020,00072,ARS-02-0055577,Beacon America,Not captured,Not captured,Not captured,,,,VANDERBOS,KENNETH,,12/30/1986,male,Not captured,Not captured,Not captured,Not captured,Not captured,Not captured,Not captured,Not captured,Not captured,Not captured,Not captured,Not captured,Not captured,,,Not captured,Not captured,Not captured,Not captured,2425 Wilson Blvd. Suite 350,,Arlington,Virginia,22201,7038415607,,Not captured,Not captured,mhernandez@ncsc.org,Not captured,802047821,,Not captured,Not captured,Not captured,Not captured,Not captured,Not captured,
Not captured,Not captured,03/17/2020,Not captured,Not captured,863949,020,00072,ARS-02-0055576,Beacon America,Not captured,Not captured,Not captured,,,,COTINO,DERRYL,,06/18/1985,male,Not captured,Not captured,Not captured,Not captured,Not captured,Not captured,Not captured,Not captured,Not captured,Not captured,Not captured,Not captured,Not captured,,,Not captured,Not captured,Not captured,Not captured,2425 Wilson Blvd. Suite 350,,Arlington,Virginia,22201,7038415607,,Not captured,Not captured,mhernandez@ncsc.org,Not captured,802047820,,Not captured,Not captured,Not captured,Not captured,Not captured,Not captured,
Not captured,Not captured,03/17/2020,Not captured,Not captured,863949,020,00072,ARS-02-0055575,Beacon America,Not captured,Not captured,Not captured,,,,BAKTAWAR,ASHISHKOEMAR,,11/18/1988,male,Not captured,Not captured,Not captured,Not captured,Not captured,Not captured,Not captured,Not captured,Not captured,Not captured,Not captured,Not captured,Not captured,,,Not captured,Not captured,Not captured,Not captured,2425 Wilson Blvd. Suite 350,,Arlington,Virginia,22201,7038415607,,Not captured,Not captured,mhernandez@ncsc.org,Not captured,802047819,,Not captured,Not captured,Not captured,Not captured,Not captured,Not captured,
Not captured,Not captured,03/17/2020,Not captured,Not captured,863949,020,00072,ARS-02-0055574,Beacon America,Not captured,Not captured,Not captured,,,,DAWSA,EDLY,,06/22/1986,male,Not captured,Not captured,Not captured,Not captured,Not captured,Not captured,Not captured,Not captured,Not captured,Not captured,Not captured,Not captured,Not captured,,,Not captured,Not captured,Not captured,Not captured,2425 Wilson Blvd. Suite 350,,Arlington,,22201,7038415607,,Not captured,Not captured,mhernandez@ncsc.org,Not captured,802047818,,Not captured,Not captured,Not captured,Not captured,Not captured,Not captured,
Not captured,Not captured,03/17/2020,Not captured,Not captured,863949,020,00072,ARS-02-0055572,Beacon America,Not captured,Not captured,Not captured,,,,Paxton,Kirsty,L,01/07/1980,female,Not captured,Not captured,Not captured,Not captured,Not captured,Not captured,Not captured,Not captured,Not captured,Not captured,Not captured,Not captured,Not captured,,,Not captured,Not captured,Not captured,Not captured,68 Lippincott Street,,Toronto,Ontario,M5T 2R5,,,Not captured,Not captured,kirstylouisepaxton@gmail.com,Not captured,802047816,,Not captured,Not captured,Not captured,Not captured,Not captured,Not captured,
Not captured,Not captured,03/18/2020,Not captured,Not captured,863949,020,00072,ARS-01-0055571,Beacon International,Not captured,Not captured,Not captured,,,,Seidler,Maria,T,08/25/1958,female,Not captured,Not captured,Not captured,Not captured,Not captured,Not captured,Not captured,Not captured,Not captured,Not captured,Not captured,Not captured,Not captured,,,Not captured,Not captured,Not captured,Not captured,35483 Strathcona Court,,Abbotsford,British Columbia,V3G 3A2,,,Not captured,Not captured,garyrombough@yahoo.ca,Not captured,802047815,,Not captured,Not captured,Not captured,Not captured,Not captured,Not captured,
Not captured,Not captured,03/18/2020,Not captured,Not captured,863949,020,00072,ARS-01-0055570,Beacon International,Not captured,Not captured,Not captured,,,,Rombough,Gary,D,01/19/1954,male,Not captured,Not captured,Not captured,Not captured,Not captured,Not captured,Not captured,Not captured,Not captured,Not captured,Not captured,Not captured,Not captured,,,Not captured,Not captured,Not captured,Not captured,35483 Strathcona Court,,Abbotsford,British Columbia,V3G 3A2,,,Not captured,Not captured,garyrombough@yahoo.ca,Not captured,802047814,,Not captured,Not captured,Not captured,Not captured,Not captured,Not captured,
Not captured,Not captured,03/16/2020,Not captured,Not captured,863949,020,00072,ARS-02-0055569,Beacon America,Not captured,Not captured,Not captured,,,,Leano,Aida,,06/28/1966,female,Not captured,Not captured,Not captured,Not captured,Not captured,Not captured,Not captured,Not captured,Not captured,Not captured,Not captured,Not captured,Not captured,estate,other,Not captured,Not captured,Not captured,Not captured,988 Fifth Ave.&nbsp;,,New York,,10075,917-378-2655,,Not captured,Not captured,isabelachaval@gmail.com,Not captured,802047813,,Not captured,Not captured,Not captured,Not captured,Not captured,Not captured,
Not captured,Not captured,03/17/2020,Not captured,Not captured,863949,020,00072,ARS-03-0055559,Essential America,Not captured,Not captured,Not captured,Passport(44374341),,,Yaramadha,Mounika,,05/29/1993,female,Not captured,Not captured,Not captured,Not captured,Not captured,Not captured,Not captured,Not captured,Not captured,Not captured,Not captured,Not captured,Not captured,,,Not captured,Not captured,Not captured,Not captured,Flat no.302 Pramukha Plaza,,Hyderabad,Andhra Pradesh,500035,919948970627,,Not captured,Not captured,mounika.yreddy@gmail.com,Not captured,802047803,,Not captured,Not captured,Not captured,Not captured,Not captured,Not captured,
Not captured,Not captured,03/16/2020,Not captured,Not captured,863949,020,00072,ARS-03-0055557,Essential America,Not captured,Not captured,Not captured,Passport(EP5448068),,,Mesfin,Esubalew,Wolde,10/20/1984,male,Not captured,Not captured,Not captured,Not captured,Not captured,Not captured,Not captured,Not captured,Not captured,Not captured,Not captured,Not captured,Not captured,,,Not captured,Not captured,Not captured,Not captured,9906 E Arizona Dr,,Aurora,Colorado,80247,7209500161,,Not captured,Not captured,ttigsit@gmail.com,Not captured,802047801,,Not captured,Not captured,Not captured,Not captured,Not captured,Not captured,
Not captured,Not captured,03/16/2020,Not captured,Not captured,863949,020,00072,ARS-02-0055558,Beacon America,Not captured,Not captured,Not captured,,,,neger,moshe,,09/07/1993,male,Not captured,Not captured,Not captured,Not captured,Not captured,Not captured,Not captured,Not captured,Not captured,Not captured,Not captured,Not captured,Not captured,,,Not captured,Not captured,Not captured,Not captured,154 dalemount ave,,toronto,Ontario,m6b3c9,4167853909,,Not captured,Not captured,mosheneger2@gmail.com,Not captured,802047802,,Not captured,Not captured,Not captured,Not captured,Not captured,Not captured,
Not captured,Not captured,03/14/2020,Not captured,Not captured,863949,020,00072,ARS-03-0055540,Essential America,Not captured,Not captured,Not captured,Passport(H8828223),,,Methuku,Lavanya,,03/21/1990,female,Not captured,Not captured,Not captured,Not captured,Not captured,Not captured,Not captured,Not captured,Not captured,Not captured,Not captured,Not captured,Not captured,,,Not captured,Not captured,Not captured,Not captured,H-No-359,,Telangana,Haryana,500092,02172465158,,Not captured,Not captured,lavanya_213@gmail.com,Not captured,802047711,,Not captured,Not captured,Not captured,Not captured,Not captured,Not captured,
Not captured,Not captured,03/16/2020,Not captured,Not captured,863949,020,00072,ARS-02-0055556,Beacon America,Not captured,Not captured,Not captured,Passport(E97530091),,,CHEN,YING,,08/09/1979,female,Not captured,Not captured,Not captured,Not captured,Not captured,Not captured,Not captured,Not captured,Not captured,Not captured,Not captured,Not captured,Not captured,,,Not captured,Not captured,Not captured,Not captured,3049 LIVE OAK CT,,DANVILLE,California,94506,6268980075,,Not captured,Not captured,QIQIBABY1979@HOTMAIL.COM,Not captured,802047800,,Not captured,Not captured,Not captured,Not captured,Not captured,Not captured,
Not captured,Not captured,03/15/2020,Not captured,Not captured,863949,020,00072,ARS-01-0055555,Beacon International,Not captured,Not captured,Not captured,,,,Degani,Sheryl,A,09/18/1958,female,Not captured,Not captured,Not captured,Not captured,Not captured,Not captured,Not captured,Not captured,Not captured,Not captured,Not captured,Not captured,Not captured,,,Not captured,Not captured,Not captured,Not captured,Sheri Degani,,Highland Park,New Jersey,08904,,,Not captured,Not captured,yinond@aol.com,Not captured,802047799,,Not captured,Not captured,Not captured,Not captured,Not captured,Not captured,
Not captured,Not captured,03/15/2020,Not captured,Not captured,863949,020,00072,ARS-02-0055553,Beacon America,Not captured,Not captured,Not captured,,,,Londono,Ines,A,09/14/1968,female,Not captured,Not captured,Not captured,Not captured,Not captured,Not captured,Not captured,Not captured,Not captured,Not captured,Not captured,Not captured,Not captured,,,Not captured,Not captured,Not captured,Not captured,Carrera 48 #55-32,,Medellin,,050015,,,Not captured,Not captured,adrianalondono724@gmail.com,Not captured,802047797,,Not captured,Not captured,Not captured,Not captured,Not captured,Not captured,
Not captured,Not captured,03/16/2020,Not captured,Not captured,863949,020,00072,ARS-02-0055552,Beacon America,Not captured,Not captured,Not captured,Passport(P0327988),,,Stevens,Robert,P,03/01/1953,male,Not captured,Not captured,Not captured,Not captured,Not captured,Not captured,Not captured,Not captured,Not captured,Not captured,Not captured,Not captured,Not captured,Candy Belezaire,Common Law wife,Not captured,Not captured,Not captured,Not captured,2 Northpoint drive Suite 200,,Houston,Texas,77060,8323592338,,Not captured,Not captured,oshabelize@yahoo.co.uk,Not captured,802047796,,Not captured,Not captured,Not captured,Not captured,Not captured,Not captured,