EE Transaction Type,Dependent Transaction Type,Effective Date,EE Signature,EE Signature Date,Control,Suffix,Account,Plan Number,Plan Name,Claim Office,Network ID Number,Customer Code,EE SSN,Dependent SSN,Dependent Relationship,Last Name,First Name,Middle Initial,DOB,Gender,Ethnicity,PCP/PCD,PCP/PCD Current Patient,Provider Cap Office Number,COB,Dep Student Indicator,Dep OOA Indicator,EE Prior Coverage Indicator,EE Late Entrant,EE Language Indicator,Hire Date,Earnings,Earnings Frequency,Beneficiary (Last Name First Name MI),Beneficiary Relationship,Continuation of Coverage Expiration Date,Continuation of Coverage Event Date,Continuation of Coverage Length of Coverage,Work Location Zip Code,Street Address Line 1,Street Address Line 2,City,State,Zip Code,Home Phone Number,Work Phone Number,Accept Code,Evidence Code,EE Email Address,Communication Disability Code,EE Alternate ID,Dep Alternate ID,Old Control,Old Suffix,Old Account,New Control,New Suffix,New Account,
Not captured,Not captured,03/14/2020,Not captured,Not captured,863949,020,00072,ARS-03-0055540,Essential America,Not captured,Not captured,Not captured,Passport(H8828223),,,Methuku,Lavanya,,03/21/1990,female,Not captured,Not captured,Not captured,Not captured,Not captured,Not captured,Not captured,Not captured,Not captured,Not captured,Not captured,Not captured,Not captured,,,Not captured,Not captured,Not captured,Not captured,H-No-359,,Telangana,Haryana,500092,02172465158,,Not captured,Not captured,lavanya_213@gmail.com,Not captured,802047711,,Not captured,Not captured,Not captured,Not captured,Not captured,Not captured,
Not captured,Not captured,03/14/2020,Not captured,Not captured,863949,020,00072,OVI-28-0055549,OverseasCare Visitors Insurance Plan,Not captured,Not captured,Not captured,Passport(P1387813),,,LALITHAMMA,PRABHA,,04/04/1957,female,Not captured,Not captured,Not captured,Not captured,Not captured,Not captured,Not captured,Not captured,Not captured,Not captured,Not captured,Not captured,Not captured,RAJASEKHARA KAIMAL VASUDEVA KAIMAL,SPOUSE,Not captured,Not captured,Not captured,Not captured,110 ADELPHIA DR,,CHESTERFIELD,New Jersey,08515,9496162133,,Not captured,Not captured,lekshmikaimal@gmail.com,Not captured,802047741,,Not captured,Not captured,Not captured,Not captured,Not captured,Not captured,
Not captured,Not captured,03/14/2020,Not captured,Not captured,863949,020,00072,OVI-28-0055548,OverseasCare Visitors Insurance Plan,Not captured,Not captured,Not captured,Passport(J6372813),,,VASUDEVA KAIMAL,RAJASEKHARA KAIMAL,,06/14/1948,male,Not captured,Not captured,Not captured,Not captured,Not captured,Not captured,Not captured,Not captured,Not captured,Not captured,Not captured,Not captured,Not captured,PRABHA LALITHAMMA,SPOUSE,Not captured,Not captured,Not captured,Not captured,110 ADELPHIA DR,,CHESTERFIELD,New Jersey,08515,9496162133,,Not captured,Not captured,LEKSHMIKAIMAL@GMAIL.COM,Not captured,802047740,,Not captured,Not captured,Not captured,Not captured,Not captured,Not captured,
Not captured,Not captured,03/14/2020,Not captured,Not captured,863949,020,00072,ARS-01-0055545,Beacon International,Not captured,Not captured,Not captured,,,,Ghahramani,Adam,,04/30/1983,male,Not captured,Not captured,Not captured,Not captured,Not captured,Not captured,Not captured,Not captured,Not captured,Not captured,Not captured,Not captured,Not captured,,,Not captured,Not captured,Not captured,Not captured,400 E 71st Street,,New York,New York,10021,,,Not captured,Not captured,adamgha@gmail.com,Not captured,802047737,,Not captured,Not captured,Not captured,Not captured,Not captured,Not captured,
Not captured,Not captured,03/13/2020,Not captured,Not captured,863949,020,00072,ARS-02-0055544,Beacon America,Not captured,Not captured,Not captured,Passport(E59348029),,,Hou,Datong ,,11/06/1981,male,Not captured,Not captured,Not captured,Not captured,Not captured,Not captured,Not captured,Not captured,Not captured,Not captured,Not captured,Not captured,Not captured,Lili Chen,spouse,Not captured,Not captured,Not captured,Not captured,65 HICKORY CT,,DANVILLE,California,94506,9258562778,,Not captured,Not captured,LILICHEN11@YAHOO.COM,Not captured,802047736,,Not captured,Not captured,Not captured,Not captured,Not captured,Not captured,
Not captured,Not captured,03/14/2020,Not captured,Not captured,863949,020,00072,ARS-01-0055542,Beacon International,Not captured,Not captured,Not captured,Passport(AAD729825),,,Day,Maria Teresa,,02/22/1971,female,Not captured,Not captured,Not captured,Not captured,Not captured,Not captured,Not captured,Not captured,Not captured,Not captured,Not captured,Not captured,Not captured,,,Not captured,Not captured,Not captured,Not captured,2425 Wilson Blvd,,Arlington,Virginia,22201,703-841-5646,,Not captured,Not captured,rabrego@ncsc.org,Not captured,802047734,,Not captured,Not captured,Not captured,Not captured,Not captured,Not captured,
Not captured,Not captured,03/13/2020,Not captured,Not captured,863949,020,00072,ARS-02-0055541,Beacon America,Not captured,Not captured,Not captured,Passport(E56409163),,,DING,WEILI,,06/12/1955,female,Not captured,Not captured,Not captured,Not captured,Not captured,Not captured,Not captured,Not captured,Not captured,Not captured,Not captured,Not captured,Not captured,YIDING LU,SON,Not captured,Not captured,Not captured,Not captured,7137 165TH ST,,FRESH MEADOWS,New York,11365,9176646685,,Not captured,Not captured,lu_llx@msn.com,Not captured,802047733,,Not captured,Not captured,Not captured,Not captured,Not captured,Not captured,
Not captured,Not captured,03/13/2020,Not captured,Not captured,863949,020,00072,ARS-03-0055522,Essential America,Not captured,Not captured,Not captured,Passport(G26826633),,,Moreno Mendoza ,Elsa ,,11/05/1967,female,Not captured,Not captured,Not captured,Not captured,Not captured,Not captured,Not captured,Not captured,Not captured,Not captured,Not captured,Not captured,Not captured,,,Not captured,Not captured,Not captured,Not captured,26 y Nayarit #2642,,Cuauhtemoc,Chihuahua,31590,0115216251051549,,Not captured,Not captured,Levitniarodriguez@hotmail.com,Not captured,802047691,,Not captured,Not captured,Not captured,Not captured,Not captured,Not captured,
Not captured,Not captured,03/13/2020,Not captured,Not captured,863949,020,00072,ARS-02-0055539,Beacon America,Not captured,Not captured,Not captured,,,,Kruger,Tzipporah,,03/18/1999,female,Not captured,Not captured,Not captured,Not captured,Not captured,Not captured,Not captured,Not captured,Not captured,Not captured,Not captured,Not captured,Not captured,,,Not captured,Not captured,Not captured,Not captured,564 Durocher,,Montreal,Quebec,H2v3y2,732-886-5751,,Not captured,Not captured,tzippycensor@gmail.com,Not captured,802047710,,Not captured,Not captured,Not captured,Not captured,Not captured,Not captured,
Not captured,Not captured,03/13/2020,Not captured,Not captured,863949,020,00072,ARS-02-0055538,Beacon America,Not captured,Not captured,Not captured,,,,Censor,Zev,,06/11/1999,male,Not captured,Not captured,Not captured,Not captured,Not captured,Not captured,Not captured,Not captured,Not captured,Not captured,Not captured,Not captured,Not captured,,,Not captured,Not captured,Not captured,Not captured,564 Durocher,,Montreal,Quebec,H2v3y2,732-886-5751,,Not captured,Not captured,tzippycensor@gmail.com,Not captured,802047709,,Not captured,Not captured,Not captured,Not captured,Not captured,Not captured,
Not captured,Not captured,03/13/2020,Not captured,Not captured,863949,020,00072,ARS-01-0055536,Beacon International,Not captured,Not captured,Not captured,,,,Sussman,Joel,,12/28/1949,male,Not captured,Not captured,Not captured,Not captured,Not captured,Not captured,Not captured,Not captured,Not captured,Not captured,Not captured,Not captured,Not captured,,,Not captured,Not captured,Not captured,Not captured,11258 Green Lake Dr Unit 201,,Boynton Beach,Florida,33437,718-337-1184,,Not captured,Not captured,rivkasussman@yahoo.com,Not captured,802047707,,Not captured,Not captured,Not captured,Not captured,Not captured,Not captured,
Not captured,Not captured,03/13/2020,Not captured,Not captured,863949,020,00072,ARS-01-0055528,Beacon International,Not captured,Not captured,Not captured,,,,Revilla,ANGELICA,M,03/21/1998,female,Not captured,Not captured,Not captured,Not captured,Not captured,Not captured,Not captured,Not captured,Not captured,Not captured,Not captured,Not captured,Not captured,,,Not captured,Not captured,Not captured,Not captured,80 W 5TH ST,,HIALEAH,Florida,33010,,,Not captured,Not captured,angelicarevilla27@gmail.com,Not captured,802047699,,Not captured,Not captured,Not captured,Not captured,Not captured,Not captured,
Not captured,Not captured,03/13/2020,Not captured,Not captured,863949,020,00072,ARS-01-0055526,Beacon International,Not captured,Not captured,Not captured,,,,COLEMAN,MARY,E,01/27/1989,female,Not captured,Not captured,Not captured,Not captured,Not captured,Not captured,Not captured,Not captured,Not captured,Not captured,Not captured,Not captured,Not captured,,,Not captured,Not captured,Not captured,Not captured,302 Island Ave,,San Diego,California,92101,,,Not captured,Not captured,s_sears@ymail.com,Not captured,802047697,,Not captured,Not captured,Not captured,Not captured,Not captured,Not captured,
Not captured,Not captured,03/13/2020,Not captured,Not captured,863949,020,00072,ARS-01-0055525,Beacon International,Not captured,Not captured,Not captured,,,,sears,samuel,s,03/09/1990,male,Not captured,Not captured,Not captured,Not captured,Not captured,Not captured,Not captured,Not captured,Not captured,Not captured,Not captured,Not captured,Not captured,,,Not captured,Not captured,Not captured,Not captured,302 Island Ave,,San Diego,California,92101,,,Not captured,Not captured,s_sears@ymail.com,Not captured,802047696,,Not captured,Not captured,Not captured,Not captured,Not captured,Not captured,
Not captured,Not captured,03/12/2020,Not captured,Not captured,863949,020,00072,ARS-02-0055524,Beacon America,Not captured,Not captured,Not captured,Passport(EC5440708),,,LAI,PEICHEN,,07/09/1989,male,Not captured,Not captured,Not captured,Not captured,Not captured,Not captured,Not captured,Not captured,Not captured,Not captured,Not captured,Not captured,Not captured,,,Not captured,Not captured,Not captured,Not captured,193 COTTONWOOD LP,,MADISONVILLE,Kentucky,42431,3236862999,,Not captured,Not captured,SAMPC89@GMAIL.COM,Not captured,802047693,,Not captured,Not captured,Not captured,Not captured,Not captured,Not captured,
Not captured,Not captured,03/12/2020,Not captured,Not captured,863949,020,00072,ARS-02-0055520,Beacon America,Not captured,Not captured,Not captured,,,,Dupont,Xavier,,11/01/1996,male,Not captured,Not captured,Not captured,Not captured,Not captured,Not captured,Not captured,Not captured,Not captured,Not captured,Not captured,Not captured,Not captured,,,Not captured,Not captured,Not captured,Not captured,6 place de la mairie,,Saint Aubin,,62170,,,Not captured,Not captured,xavierdupont31@gmail.com,Not captured,802047688,,Not captured,Not captured,Not captured,Not captured,Not captured,Not captured,
Not captured,Not captured,03/12/2020,Not captured,Not captured,863949,020,00072,ARS-03-0055511,Essential America,Not captured,Not captured,Not captured,Passport(PB4488826),,,Bhattarai,Jiba,Maya,01/01/1989,female,Not captured,Not captured,Not captured,Not captured,Not captured,Not captured,Not captured,Not captured,Not captured,Not captured,Not captured,Not captured,Not captured,,,Not captured,Not captured,Not captured,Not captured,37 Apollo Crescent,,Dallas,Victoria,3047,+61403252432,,Not captured,Not captured,jibabhattarai1989@gmail.com,Not captured,802047668,,Not captured,Not captured,Not captured,Not captured,Not captured,Not captured,
Not captured,Not captured,03/12/2020,Not captured,Not captured,863949,020,00072,ARS-03-0055511,Essential America,Not captured,Not captured,Not captured,,Passport(PB2262530),Dependant,Gautam,Unisha,,12/14/2017,female,Not captured,Not captured,Not captured,Not captured,Not captured,Not captured,Not captured,Not captured,Not captured,Not captured,Not captured,Not captured,Not captured,,,Not captured,Not captured,Not captured,Not captured,37 Apollo Crescent,,Dallas,Victoria,3047,+61403252432,,Not captured,Not captured,jibabhattarai1989@gmail.com,Not captured,,802047669,Not captured,Not captured,Not captured,Not captured,Not captured,Not captured,
Not captured,Not captured,03/12/2020,Not captured,Not captured,863949,020,00072,ARS-02-0055518,Beacon America,Not captured,Not captured,Not captured,,,,Tucciarone,Anastasia,,04/28/1992,female,Not captured,Not captured,Not captured,Not captured,Not captured,Not captured,Not captured,Not captured,Not captured,Not captured,Not captured,Not captured,Not captured,,,Not captured,Not captured,Not captured,Not captured,Via Francesco baracca 2649,,Santi cosma e Damiano,,04020,,,Not captured,Not captured,annie.etoile@gmail.com,Not captured,802047685,,Not captured,Not captured,Not captured,Not captured,Not captured,Not captured,
Not captured,Not captured,03/12/2020,Not captured,Not captured,863949,020,00072,ARS-02-0055517,Beacon America,Not captured,Not captured,Not captured,Passport(T4416637),,,Korde,Arjun,,10/30/1990,male,Not captured,Not captured,Not captured,Not captured,Not captured,Not captured,Not captured,Not captured,Not captured,Not captured,Not captured,Not captured,Not captured,Jaywant Korde,Father,Not captured,Not captured,Not captured,Not captured,1301 A2 Mandara Nyati Epitome,,Pune,Maharashtra,411060,+919717397952,,Not captured,Not captured,arjunkorde30@gmail.com,Not captured,802047684,,Not captured,Not captured,Not captured,Not captured,Not captured,Not captured,
Not captured,Not captured,03/12/2020,Not captured,Not captured,863949,020,00072,ARS-01-0055514,Beacon International,Not captured,Not captured,Not captured,,,,Stephens,Maxwell,D,09/20/1995,male,Not captured,Not captured,Not captured,Not captured,Not captured,Not captured,Not captured,Not captured,Not captured,Not captured,Not captured,Not captured,Not captured,,,Not captured,Not captured,Not captured,Not captured,28 Burnt House Rd,,Carlisle,Pennsylvania,17015,,,Not captured,Not captured,stephensm2011@gmail.com,Not captured,802047681,,Not captured,Not captured,Not captured,Not captured,Not captured,Not captured,
Not captured,Not captured,03/12/2020,Not captured,Not captured,863949,020,00072,ARS-02-0055513,Beacon America,Not captured,Not captured,Not captured,Passport(G35547042),,,Canez,Felix,G,04/09/1984,male,Not captured,Not captured,Not captured,Not captured,Not captured,Not captured,Not captured,Not captured,Not captured,Not captured,Not captured,Not captured,Not captured,Maria Christina Fernandez,Mother,Not captured,Not captured,Not captured,Not captured,Rio Niagara 38,,Mexico,Distrito Federal,06500,525552070284,525550802777,Not captured,Not captured,FERNANDEZCHRISTI@HOTMAIL.COM,Not captured,802047680,,Not captured,Not captured,Not captured,Not captured,Not captured,Not captured,
Not captured,Not captured,03/12/2020,Not captured,Not captured,863949,020,00072,ARS-02-0055512,Beacon America,Not captured,Not captured,Not captured,,,,Fried,Mordechai,,05/15/1973,male,Not captured,Not captured,Not captured,Not captured,Not captured,Not captured,Not captured,Not captured,Not captured,Not captured,Not captured,Not captured,Not captured,,,Not captured,Not captured,Not captured,Not captured,40 mezritch rd,,Spring valley,New york,10977,8453625082,,Not captured,Not captured,Mfried275@gmail.com,Not captured,802047679,,Not captured,Not captured,Not captured,Not captured,Not captured,Not captured,
Not captured,Not captured,03/12/2020,Not captured,Not captured,863949,020,00072,ARS-03-0055506,Essential America,Not captured,Not captured,Not captured,Passport(845672089),,,Revelli,Swathi, ,11/02/1989,female,Not captured,Not captured,Not captured,Not captured,Not captured,Not captured,Not captured,Not captured,Not captured,Not captured,Not captured,Not captured,Not captured,,,Not captured,Not captured,Not captured,Not captured,H NO 11-2-82,,Hyderabad,Andhra Pradesh,500035,6038586008,,Not captured,Not captured,revelliswathi@gmail.com,Not captured,802047634,,Not captured,Not captured,Not captured,Not captured,Not captured,Not captured,
Not captured,Not captured,03/11/2020,Not captured,Not captured,863949,020,00072,ARS-01-0055505,Beacon International,Not captured,Not captured,Not captured,Passport(653678880),,,Hooser,Sienna,,07/20/2000,female,Not captured,Not captured,Not captured,Not captured,Not captured,Not captured,Not captured,Not captured,Not captured,Not captured,Not captured,Not captured,Not captured,Robin Hooser,Father,Not captured,Not captured,Not captured,Not captured,743 Blevins Rd.,,McAlester,Oklahoma,74501,9184704346,9184243546,Not captured,Not captured,Hooser.anna@gmail.com,Not captured,802047633,,Not captured,Not captured,Not captured,Not captured,Not captured,Not captured,
Not captured,Not captured,03/11/2020,Not captured,Not captured,863949,020,00072,ARS-01-0055504,Beacon International,Not captured,Not captured,Not captured,Passport(649159393),,,Hooser,Anna,,03/09/1967,female,Not captured,Not captured,Not captured,Not captured,Not captured,Not captured,Not captured,Not captured,Not captured,Not captured,Not captured,Not captured,Not captured,Robin Hooser,Spouse,Not captured,Not captured,Not captured,Not captured,743 Blevins Rd.,,McAlester,Oklahoma,74501,9184219663,9184243546,Not captured,Not captured,Hooser.anna@gmail.com,Not captured,802047632,,Not captured,Not captured,Not captured,Not captured,Not captured,Not captured,
Not captured,Not captured,03/11/2020,Not captured,Not captured,863949,020,00072,ARS-01-0055503,Beacon International,Not captured,Not captured,Not captured,Passport(649291312),,,Guthrie,Charissa,,11/16/1972,female,Not captured,Not captured,Not captured,Not captured,Not captured,Not captured,Not captured,Not captured,Not captured,Not captured,Not captured,Not captured,Not captured,Gary Guthrie ,Spouse,Not captured,Not captured,Not captured,Not captured,1209 S. 9th,,McAlester,Oklahoma,74501,9184299775,9184299686,Not captured,Not captured,Chrissylguthrie@gmail.com,Not captured,802047631,,Not captured,Not captured,Not captured,Not captured,Not captured,Not captured,
Not captured,Not captured,03/12/2020,Not captured,Not captured,863949,020,00072,ARS-01-0055502,Beacon International,Not captured,Not captured,Not captured,Passport(567717923),,,Gho,Jessica Park,,04/09/1987,female,Not captured,Not captured,Not captured,Not captured,Not captured,Not captured,Not captured,Not captured,Not captured,Not captured,Not captured,Not captured,Not captured,Resonate Global Mission,other,Not captured,Not captured,Not captured,Not captured,1700 28th St SE,,Grand Rapids,Michigan,49508,6162240750,,Not captured,Not captured,llankheet@crcna.org,Not captured,802047630,,Not captured,Not captured,Not captured,Not captured,Not captured,Not captured,
Not captured,Not captured,03/11/2020,Not captured,Not captured,863949,020,00072,ARS-01-0055495,Beacon International,Not captured,Not captured,Not captured,,,,Weaver,Rachel,E,05/22/1984,female,Not captured,Not captured,Not captured,Not captured,Not captured,Not captured,Not captured,Not captured,Not captured,Not captured,Not captured,Not captured,Not captured,,,Not captured,Not captured,Not captured,Not captured,1001 COVERDALE ST,,PITTSBURGH,Pennsylvania,15220,,,Not captured,Not captured,Erinekelly26@gmail.com,Not captured,802047623,,Not captured,Not captured,Not captured,Not captured,Not captured,Not captured,
Not captured,Not captured,03/11/2020,Not captured,Not captured,863949,020,00072,ARS-01-0055494,Beacon International,Not captured,Not captured,Not captured,,,,Kelly,Erin,E,06/26/1988,female,Not captured,Not captured,Not captured,Not captured,Not captured,Not captured,Not captured,Not captured,Not captured,Not captured,Not captured,Not captured,Not captured,,,Not captured,Not captured,Not captured,Not captured,1001 COVERDALE ST,,PITTSBURGH,Pennsylvania,15220,,,Not captured,Not captured,Erinekelly26@gmail.com,Not captured,802047622,,Not captured,Not captured,Not captured,Not captured,Not captured,Not captured,
Not captured,Not captured,03/10/2020,Not captured,Not captured,863949,020,00072,ARS-01-0055492,Beacon International,Not captured,Not captured,Not captured,Passport(AD109155),,,Smilanich,Isabel,N,06/08/1997,female,Not captured,Not captured,Not captured,Not captured,Not captured,Not captured,Not captured,Not captured,Not captured,Not captured,Not captured,Not captured,Not captured,Elias Smilanich,sibling,Not captured,Not captured,Not captured,Not captured,15208 72 st NW,,Edmonton April,Alberta,T5C 0R9,780-476-6717,,Not captured,Not captured,cchampig@gmail.com,Not captured,802047620,,Not captured,Not captured,Not captured,Not captured,Not captured,Not captured,
Not captured,Not captured,03/10/2020,Not captured,Not captured,863949,020,00072,ARS-01-0055489,Beacon International,Not captured,Not captured,Not captured,Passport(P532615),,,Araujo ,Jose ,F C,03/08/1963,male,Not captured,Not captured,Not captured,Not captured,Not captured,Not captured,Not captured,Not captured,Not captured,Not captured,Not captured,Not captured,Not captured,Herdeiros Legais ,Herdeiros legais ,Not captured,Not captured,Not captured,Not captured,Av General Norton de Matos 21 2.&ordm; Dt,,Braga,Braga,4700387,253278256,253272611,Not captured,Not captured,zfaraujo@gmail.com,Not captured,802047543,,Not captured,Not captured,Not captured,Not captured,Not captured,Not captured,
Not captured,Not captured,03/10/2020,Not captured,Not captured,863949,020,00072,ARS-04-0055462,Enhanced America,Not captured,Not captured,Not captured,Passport(T4073144),,,Kollabathula,Sarah,Prasthuthi,08/13/1991,female,Not captured,Not captured,Not captured,Not captured,Not captured,Not captured,Not captured,Not captured,Not captured,Not captured,Not captured,Not captured,Not captured,,,Not captured,Not captured,Not captured,Not captured,Krupa Nilaya 4th cross,,Devanur Thumkar,Karnataka,572102,9803199245,,Not captured,Not captured,raostephen.sp@gmail.com,Not captured,802047496,,Not captured,Not captured,Not captured,Not captured,Not captured,Not captured,
Not captured,Not captured,03/10/2020,Not captured,Not captured,863949,020,00072,ARS-01-0055487,Beacon International,Not captured,Not captured,Not captured,,,,Toledo,Luz,M,10/04/1950,female,Not captured,Not captured,Not captured,Not captured,Not captured,Not captured,Not captured,Not captured,Not captured,Not captured,Not captured,Not captured,Not captured,,,Not captured,Not captured,Not captured,Not captured,521 Gidney Ave.,,Newburgh,New York,12550,,,Not captured,Not captured,pacemlesu@gmail.com,Not captured,802047540,,Not captured,Not captured,Not captured,Not captured,Not captured,Not captured,
Not captured,Not captured,03/10/2020,Not captured,Not captured,863949,020,00072,ARS-01-0055486,Beacon International,Not captured,Not captured,Not captured,,,,Pena,Jatnael,,12/10/1985,male,Not captured,Not captured,Not captured,Not captured,Not captured,Not captured,Not captured,Not captured,Not captured,Not captured,Not captured,Not captured,Not captured,,,Not captured,Not captured,Not captured,Not captured,521 Gidney Ave.,,Newburgh,New York,12550,,,Not captured,Not captured,pacemlesu@gmail.com,Not captured,802047539,,Not captured,Not captured,Not captured,Not captured,Not captured,Not captured,
Not captured,Not captured,03/10/2020,Not captured,Not captured,863949,020,00072,ARS-01-0055485,Beacon International,Not captured,Not captured,Not captured,,,,Pena,Kemuel,,03/14/1983,male,Not captured,Not captured,Not captured,Not captured,Not captured,Not captured,Not captured,Not captured,Not captured,Not captured,Not captured,Not captured,Not captured,,,Not captured,Not captured,Not captured,Not captured,521 Gidney Ave.,,Newburgh,New York,12550,,,Not captured,Not captured,pacemlesu@gmail.com,Not captured,802047538,,Not captured,Not captured,Not captured,Not captured,Not captured,Not captured,