EE Transaction Type,Dependent Transaction Type,Effective Date,EE Signature,EE Signature Date,Control,Suffix,Account,Plan Number,Plan Name,Claim Office,Network ID Number,Customer Code,EE SSN,Dependent SSN,Dependent Relationship,Last Name,First Name,Middle Initial,DOB,Gender,Ethnicity,PCP/PCD,PCP/PCD Current Patient,Provider Cap Office Number,COB,Dep Student Indicator,Dep OOA Indicator,EE Prior Coverage Indicator,EE Late Entrant,EE Language Indicator,Hire Date,Earnings,Earnings Frequency,Beneficiary (Last Name First Name MI),Beneficiary Relationship,Continuation of Coverage Expiration Date,Continuation of Coverage Event Date,Continuation of Coverage Length of Coverage,Work Location Zip Code,Street Address Line 1,Street Address Line 2,City,State,Zip Code,Home Phone Number,Work Phone Number,Accept Code,Evidence Code,EE Email Address,Communication Disability Code,EE Alternate ID,Dep Alternate ID,Old Control,Old Suffix,Old Account,New Control,New Suffix,New Account,
Not captured,Not captured,03/06/2020,Not captured,Not captured,863949,020,00072,ARS-01-0055452,Beacon International,Not captured,Not captured,Not captured,,,,Harder,Christopher,,11/05/1994,male,Not captured,Not captured,Not captured,Not captured,Not captured,Not captured,Not captured,Not captured,Not captured,Not captured,Not captured,Not captured,Not captured,,,Not captured,Not captured,Not captured,Not captured,1254 Broadway,,San Francisco,California,94109,,,Not captured,Not captured,chrismorrison.h@gmail.com,Not captured,802047484,,Not captured,Not captured,Not captured,Not captured,Not captured,Not captured,
Not captured,Not captured,03/06/2020,Not captured,Not captured,863949,020,00072,ARS-02-0055451,Beacon America,Not captured,Not captured,Not captured,Passport(J0247593),,,Kalahasthi,Lalitha Rani,,04/11/1960,female,Not captured,Not captured,Not captured,Not captured,Not captured,Not captured,Not captured,Not captured,Not captured,Not captured,Not captured,Not captured,Not captured,,,Not captured,Not captured,Not captured,Not captured,1705 Ironwood Lane,,Milpitas,California,95035,5083806974,,Not captured,Not captured,deepu618@gmail.com,Not captured,802047481,,Not captured,Not captured,Not captured,Not captured,Not captured,Not captured,
Not captured,Not captured,03/06/2020,Not captured,Not captured,863949,020,00072,ARS-04-0055445,Enhanced America,Not captured,Not captured,Not captured,Passport(567057098),,,Varadi,Katelyn,Suzanne,01/11/1993,female,Not captured,Not captured,Not captured,Not captured,Not captured,Not captured,Not captured,Not captured,Not captured,Not captured,Not captured,Not captured,Not captured,,,Not captured,Not captured,Not captured,Not captured,9801 S Bur Oak Cir,,De Soto,Kansas,66018,9135483693,,Not captured,Not captured,varadi.katie@gmail.com,Not captured,802047473,,Not captured,Not captured,Not captured,Not captured,Not captured,Not captured,
Not captured,Not captured,03/07/2020,Not captured,Not captured,863949,020,00072,ARS-01-0055447,Beacon International,Not captured,Not captured,Not captured,,,,Mullins,Dana,,10/23/1989,female,Not captured,Not captured,Not captured,Not captured,Not captured,Not captured,Not captured,Not captured,Not captured,Not captured,Not captured,Not captured,Not captured,James Mullins,Father,Not captured,Not captured,Not captured,Not captured,11455 Creekwood Circle,,Indianapolis,Indiana,46239,317-625-1118,,Not captured,Not captured,mullinsfam0602@gmail.com,Not captured,802047475,,Not captured,Not captured,Not captured,Not captured,Not captured,Not captured,
Not captured,Not captured,03/07/2020,Not captured,Not captured,863949,020,00072,ARS-01-0055446,Beacon International,Not captured,Not captured,Not captured,,,,Mullins,Joshua,,01/21/1984,male,Not captured,Not captured,Not captured,Not captured,Not captured,Not captured,Not captured,Not captured,Not captured,Not captured,Not captured,Not captured,Not captured,James Mullins,Father,Not captured,Not captured,Not captured,Not captured,11455 Creekwood Circle,,Indianapolis,Indiana,46239,317-625-1118,,Not captured,Not captured,mullinsfam0602@gmail.com,Not captured,802047474,,Not captured,Not captured,Not captured,Not captured,Not captured,Not captured,
Not captured,Not captured,03/07/2020,Not captured,Not captured,863949,020,00072,ARS-01-0055441,Beacon International,Not captured,Not captured,Not captured,,,,Koornneef,Ralitza,A,09/17/2016,female,Not captured,Not captured,Not captured,Not captured,Not captured,Not captured,Not captured,Not captured,Not captured,Not captured,Not captured,Not captured,Not captured,,,Not captured,Not captured,Not captured,Not captured,str. prof. Milko Borisov 9A ent. D fl.1 ap 5-1,,Sofia,,1700,,,Not captured,Not captured,pdespotova@gmail.com,Not captured,802047469,,Not captured,Not captured,Not captured,Not captured,Not captured,Not captured,
Not captured,Not captured,03/07/2020,Not captured,Not captured,863949,020,00072,ARS-01-0055440,Beacon International,Not captured,Not captured,Not captured,,,,Koornneef,Polina,S,03/09/1981,female,Not captured,Not captured,Not captured,Not captured,Not captured,Not captured,Not captured,Not captured,Not captured,Not captured,Not captured,Not captured,Not captured,,,Not captured,Not captured,Not captured,Not captured,str. prof. Milko Borisov 9A ent. D fl.1 ap 5-1,,Sofia,,1700,,,Not captured,Not captured,pdespotova@gmail.com,Not captured,802047468,,Not captured,Not captured,Not captured,Not captured,Not captured,Not captured,
Not captured,Not captured,03/06/2020,Not captured,Not captured,863949,020,00072,ARS-01-0055439,Beacon International,Not captured,Not captured,Not captured,Passport(653681742),,,Baxter,Kaden,J,12/22/1999,male,Not captured,Not captured,Not captured,Not captured,Not captured,Not captured,Not captured,Not captured,Not captured,Not captured,Not captured,Not captured,Not captured,Matyson Fish,Parents,Not captured,Not captured,Not captured,Not captured,254 S Miller Mile Rd,,Heber,Utah,84032,435503-2060,,Not captured,Not captured,caren.fish@gmail.com,Not captured,802047467,,Not captured,Not captured,Not captured,Not captured,Not captured,Not captured,
Not captured,Not captured,03/06/2020,Not captured,Not captured,863949,020,00072,ARS-01-0055438,Beacon International,Not captured,Not captured,Not captured,Passport(581069871),,,Badger,Caden,S,03/10/1999,male,Not captured,Not captured,Not captured,Not captured,Not captured,Not captured,Not captured,Not captured,Not captured,Not captured,Not captured,Not captured,Not captured,Cherice Badger,Haley Badger,Not captured,Not captured,Not captured,Not captured,254 S Miller Mile Rd,,Heber,Utah,84032,435-503-2060,,Not captured,Not captured,caren.fish@gmail.com,Not captured,802047445,,Not captured,Not captured,Not captured,Not captured,Not captured,Not captured,
Not captured,Not captured,03/06/2020,Not captured,Not captured,863949,020,00072,ARS-01-0055436,Beacon International,Not captured,Not captured,Not captured,,,,Per&auml;m&auml;ki,Sanna,M,03/17/1995,female,Not captured,Not captured,Not captured,Not captured,Not captured,Not captured,Not captured,Not captured,Not captured,Not captured,Not captured,Not captured,Not captured,,,Not captured,Not captured,Not captured,Not captured,Serkustentie 1 G 61,,Helsinki,,00430,,,Not captured,Not captured,bobitronix@gmail.com,Not captured,802047442,,Not captured,Not captured,Not captured,Not captured,Not captured,Not captured,
Not captured,Not captured,03/06/2020,Not captured,Not captured,863949,020,00072,ARS-01-0055435,Beacon International,Not captured,Not captured,Not captured,,,,Aguilera L&oacute;pez,Antonio,J,10/26/1987,male,Not captured,Not captured,Not captured,Not captured,Not captured,Not captured,Not captured,Not captured,Not captured,Not captured,Not captured,Not captured,Not captured,,,Not captured,Not captured,Not captured,Not captured,Serkustentie 1 G 61,,Helsinki,,00430,,,Not captured,Not captured,bobitronix@gmail.com,Not captured,802047441,,Not captured,Not captured,Not captured,Not captured,Not captured,Not captured,
Not captured,Not captured,03/06/2020,Not captured,Not captured,863949,020,00072,ARS-01-0055433,Beacon International,Not captured,Not captured,Not captured,,,,Mandel,Charlotte,J,06/22/2019,female,Not captured,Not captured,Not captured,Not captured,Not captured,Not captured,Not captured,Not captured,Not captured,Not captured,Not captured,Not captured,Not captured,,,Not captured,Not captured,Not captured,Not captured,12100 Ravenwood Court,,Silver Spring,Maryland,20902,,,Not captured,Not captured,bethanyshondark@gmail.com,Not captured,802047438,,Not captured,Not captured,Not captured,Not captured,Not captured,Not captured,
Not captured,Not captured,03/06/2020,Not captured,Not captured,863949,020,00072,ARS-01-0055432,Beacon International,Not captured,Not captured,Not captured,,,,Mandel,Bethany,,03/07/1986,female,Not captured,Not captured,Not captured,Not captured,Not captured,Not captured,Not captured,Not captured,Not captured,Not captured,Not captured,Not captured,Not captured,,,Not captured,Not captured,Not captured,Not captured,12100 Ravenwood Court,,Silver Spring,Maryland,20902,,,Not captured,Not captured,bethanyshondark@gmail.com,Not captured,802047437,,Not captured,Not captured,Not captured,Not captured,Not captured,Not captured,
Not captured,Not captured,03/05/2020,Not captured,Not captured,863949,020,00072,ARS-02-0055431,Beacon America,Not captured,Not captured,Not captured,Passport(014277730),,,Dordevic,Natasa,,05/31/1976,female,Not captured,Not captured,Not captured,Not captured,Not captured,Not captured,Not captured,Not captured,Not captured,Not captured,Not captured,Not captured,Not captured,Darko Dordevic,Spouse,Not captured,Not captured,Not captured,Not captured,Kustiljska 32,,Vrsac,Banat,26300,+381691106467,+447307453966,Not captured,Not captured,grundalica@gmail.com,Not captured,802047413,,Not captured,Not captured,Not captured,Not captured,Not captured,Not captured,
Not captured,Not captured,03/05/2020,Not captured,Not captured,863949,020,00072,ARS-02-0055430,Beacon America,Not captured,Not captured,Not captured,Passport(014635529),,,Dordevic,Darko,,10/21/1979,male,Not captured,Not captured,Not captured,Not captured,Not captured,Not captured,Not captured,Not captured,Not captured,Not captured,Not captured,Not captured,Not captured,,,Not captured,Not captured,Not captured,Not captured,Kustiljska 32,,Vrsac,Banat,26300,+381691106467,+447307453966,Not captured,Not captured,grundalica@gmail.com,Not captured,802047412,,Not captured,Not captured,Not captured,Not captured,Not captured,Not captured,
Not captured,Not captured,03/06/2020,Not captured,Not captured,863949,020,00072,ARS-01-0055429,Beacon International,Not captured,Not captured,Not captured,,,,Lee,Kathleen,R,09/25/1988,female,Not captured,Not captured,Not captured,Not captured,Not captured,Not captured,Not captured,Not captured,Not captured,Not captured,Not captured,Not captured,Not captured,,,Not captured,Not captured,Not captured,Not captured,1300 Army Navy Dr,,Arlington,Virginia,22202,,,Not captured,Not captured,skumm007@gmail.com,Not captured,802047411,,Not captured,Not captured,Not captured,Not captured,Not captured,Not captured,
Not captured,Not captured,03/06/2020,Not captured,Not captured,863949,020,00072,ARS-01-0055428,Beacon International,Not captured,Not captured,Not captured,,,,Lee,Andrew,R,09/18/1979,male,Not captured,Not captured,Not captured,Not captured,Not captured,Not captured,Not captured,Not captured,Not captured,Not captured,Not captured,Not captured,Not captured,,,Not captured,Not captured,Not captured,Not captured,1300 Army Navy Dr,,Arlington,Virginia,22202,,,Not captured,Not captured,skumm007@gmail.com,Not captured,802047410,,Not captured,Not captured,Not captured,Not captured,Not captured,Not captured,
Not captured,Not captured,03/06/2020,Not captured,Not captured,863949,020,00072,ARS-02-0055427,Beacon America,Not captured,Not captured,Not captured,Passport(20171500730001),,,BUSTILLOS GARCIA,LUIS CARLOS,,12/16/1943,male,Not captured,Not captured,Not captured,Not captured,Not captured,Not captured,Not captured,Not captured,Not captured,Not captured,Not captured,Not captured,Not captured,MARTHA SOFIA BUSTILLOS,HIJA,Not captured,Not captured,Not captured,Not captured,14221SW120ST.SUITE127 33186,,MIAMI,Florida,33186,3053785210,584141620322,Not captured,Not captured,VICTORIA.BUSTILLOS@GMAIL.COM,Not captured,802047409,,Not captured,Not captured,Not captured,Not captured,Not captured,Not captured,
Not captured,Not captured,03/07/2020,Not captured,Not captured,863949,020,00072,ARS-01-0055426,Beacon International,Not captured,Not captured,Not captured,,,,Smith,Kristin,A,11/28/1975,male,Not captured,Not captured,Not captured,Not captured,Not captured,Not captured,Not captured,Not captured,Not captured,Not captured,Not captured,Not captured,Not captured,,,Not captured,Not captured,Not captured,Not captured,6545 Royal Oakland PL,,Indianapolis,Indiana,46236,317-464-7361,,Not captured,Not captured,ryanjasonsmith@hotmail.com,Not captured,802047408,,Not captured,Not captured,Not captured,Not captured,Not captured,Not captured,
Not captured,Not captured,03/07/2020,Not captured,Not captured,863949,020,00072,ARS-01-0055425,Beacon International,Not captured,Not captured,Not captured,,,,Smith,Ryan,J,04/16/1976,male,Not captured,Not captured,Not captured,Not captured,Not captured,Not captured,Not captured,Not captured,Not captured,Not captured,Not captured,Not captured,Not captured,,,Not captured,Not captured,Not captured,Not captured,6545 Royal Oakland PL,,Indianapolis,Indiana,46236,317-464-7361,,Not captured,Not captured,ryanjasonsmith@hotmail.com,Not captured,802047407,,Not captured,Not captured,Not captured,Not captured,Not captured,Not captured,
Not captured,Not captured,03/04/2020,Not captured,Not captured,863949,020,00072,ARS-02-0055420,Beacon America,Not captured,Not captured,Not captured,,,,Castro Poot,Lizandro,,03/15/1988,male,Not captured,Not captured,Not captured,Not captured,Not captured,Not captured,Not captured,Not captured,Not captured,Not captured,Not captured,Not captured,Not captured,Monica Castro,Spouse ,Not captured,Not captured,Not captured,Not captured,222 Julian St,,Denver,Colorado,80219,3033058043,,Not captured,Not captured,Lizandrocastro08@gmail.com,Not captured,802047402,,Not captured,Not captured,Not captured,Not captured,Not captured,Not captured,
Not captured,Not captured,03/04/2020,Not captured,Not captured,863949,020,00072,ARS-01-0055415,Beacon International,Not captured,Not captured,Not captured,,,,Petrikowsky,Samuel,,02/15/2004,male,Not captured,Not captured,Not captured,Not captured,Not captured,Not captured,Not captured,Not captured,Not captured,Not captured,Not captured,Not captured,Not captured,,,Not captured,Not captured,Not captured,Not captured,4 Riverside,,Lakewood,New Jersey,08701,215-660-5489,,Not captured,Not captured,michael@palladiumgrp.com,Not captured,802047345,,Not captured,Not captured,Not captured,Not captured,Not captured,Not captured,
Not captured,Not captured,03/04/2020,Not captured,Not captured,863949,020,00072,ARS-01-0055414,Beacon International,Not captured,Not captured,Not captured,,,,Petrikowsky,Michael,,12/18/1980,male,Not captured,Not captured,Not captured,Not captured,Not captured,Not captured,Not captured,Not captured,Not captured,Not captured,Not captured,Not captured,Not captured,,,Not captured,Not captured,Not captured,Not captured,4 Riverside,,Lakewood,New Jersey,08701,215-660-5489,,Not captured,Not captured,michael@palladiumgrp.com,Not captured,802047344,,Not captured,Not captured,Not captured,Not captured,Not captured,Not captured,
Not captured,Not captured,03/04/2020,Not captured,Not captured,863949,020,00072,ARS-02-0055410,Beacon America,Not captured,Not captured,Not captured,Passport(E76793531),,,Yuan,Xunmei,,10/11/2007,female,Not captured,Not captured,Not captured,Not captured,Not captured,Not captured,Not captured,Not captured,Not captured,Not captured,Not captured,Not captured,Not captured,Ming Yuan,Father ,Not captured,Not captured,Not captured,Not captured,1926 Ocean Shore Blvd,,Ormond Beach,FL,32176,8139669139,,Not captured,Not captured,yvonneyang818@yahoo.com,Not captured,802047339,,Not captured,Not captured,Not captured,Not captured,Not captured,Not captured,
Not captured,Not captured,03/04/2020,Not captured,Not captured,863949,020,00072,ARS-01-0055408,Beacon International,Not captured,Not captured,Not captured,Passport(502824263),,,Ekberg,Marta,R,05/20/1969,female,Not captured,Not captured,Not captured,Not captured,Not captured,Not captured,Not captured,Not captured,Not captured,Not captured,Not captured,Not captured,Not captured,Jeff Ekberg,Spouse,Not captured,Not captured,Not captured,Not captured,2830 S. Hulen St,,Fort Worth,Texas,76109,8172716619,,Not captured,Not captured,martaekberg@me.com,Not captured,802047335,,Not captured,Not captured,Not captured,Not captured,Not captured,Not captured,
Not captured,Not captured,03/06/2020,Not captured,Not captured,863949,020,00072,ARS-01-0055407,Beacon International,Not captured,Not captured,Not captured,Passport(649295360),,,Ekberg,Jeffery,D,04/29/1965,male,Not captured,Not captured,Not captured,Not captured,Not captured,Not captured,Not captured,Not captured,Not captured,Not captured,Not captured,Not captured,Not captured,Marta Ekberg,Spouse,Not captured,Not captured,Not captured,Not captured,2830 S. Hulen St,,Fort Worth,Texas,76109,8172716619,,Not captured,Not captured,Martaekberg@me.com,Not captured,802047334,,Not captured,Not captured,Not captured,Not captured,Not captured,Not captured,
Not captured,Not captured,03/05/2020,Not captured,Not captured,863949,020,00072,ARS-01-0055405,Beacon International,Not captured,Not captured,Not captured,,,,Doka,Gabor,,12/15/1969,male,Not captured,Not captured,Not captured,Not captured,Not captured,Not captured,Not captured,Not captured,Not captured,Not captured,Not captured,Not captured,Not captured,,,Not captured,Not captured,Not captured,Not captured,Alfa Residence,,Dubai,,27974,,,Not captured,Not captured,gabor_doka@yahoo.com,Not captured,802047311,,Not captured,Not captured,Not captured,Not captured,Not captured,Not captured,
Not captured,Not captured,03/04/2020,Not captured,Not captured,863949,020,00072,ARS-01-0055404,Beacon International,Not captured,Not captured,Not captured,,,,Aclander,Jaime,,01/24/1958,male,Not captured,Not captured,Not captured,Not captured,Not captured,Not captured,Not captured,Not captured,Not captured,Not captured,Not captured,Not captured,Not captured,,,Not captured,Not captured,Not captured,Not captured,30 W Yale Loop,,Irvine,California,92604,,,Not captured,Not captured,haim267@yahoo.com,Not captured,802047310,,Not captured,Not captured,Not captured,Not captured,Not captured,Not captured,
Not captured,Not captured,03/04/2020,Not captured,Not captured,863949,020,00072,ARS-01-0055403,Beacon International,Not captured,Not captured,Not captured,,,,grimes,daniel,,10/14/1981,male,Not captured,Not captured,Not captured,Not captured,Not captured,Not captured,Not captured,Not captured,Not captured,Not captured,Not captured,Not captured,Not captured,,,Not captured,Not captured,Not captured,Not captured,945 chalcedony st,,san diego,California,92109,,,Not captured,Not captured,mv2asu2000@aol.com,Not captured,802047309,,Not captured,Not captured,Not captured,Not captured,Not captured,Not captured,
Not captured,Not captured,03/03/2020,Not captured,Not captured,863949,020,00072,ARS-01-0055402,Beacon International,Not captured,Not captured,Not captured,,,,becerra,eduardo,,01/26/1982,male,Not captured,Not captured,Not captured,Not captured,Not captured,Not captured,Not captured,Not captured,Not captured,Not captured,Not captured,Not captured,Not captured,,,Not captured,Not captured,Not captured,Not captured,calle san andres 477,,cusco,,08000,,,Not captured,Not captured,eduardocultural@gmail.com,Not captured,802047301,,Not captured,Not captured,Not captured,Not captured,Not captured,Not captured,
Not captured,Not captured,03/04/2020,Not captured,Not captured,863949,020,00072,ARS-02-0055400,Beacon America,Not captured,Not captured,Not captured,,,,Lemus Rendon   ,Cristobal ,,07/25/1969,male,Not captured,Not captured,Not captured,Not captured,Not captured,Not captured,Not captured,Not captured,Not captured,Not captured,Not captured,Not captured,Not captured,,,Not captured,Not captured,Not captured,Not captured,Amer Embassy Mexico City,,Mexico DF,Mexico,06500,01155 5080-2990,,Not captured,Not captured,AlmazanE@state.gov,Not captured,802047246,,Not captured,Not captured,Not captured,Not captured,Not captured,Not captured,
Not captured,Not captured,03/04/2020,Not captured,Not captured,863949,020,00072,ARS-35-0055381,Global Mariner America,Not captured,Not captured,Not captured,Passport(565788237),,,Dates,Brennan,,12/07/1976,male,Not captured,Not captured,Not captured,Not captured,Not captured,Not captured,Not captured,Not captured,Not captured,Not captured,Not captured,Not captured,Not captured,,,Not captured,Not captured,Not captured,Not captured,757 SE 17th St. #982,,Fort Lauderdale,Florida,33316,9546818384,,Not captured,Not captured,brennandates@gmail.com,Not captured,802047169,,Not captured,Not captured,Not captured,Not captured,Not captured,Not captured,
Not captured,Not captured,03/03/2020,Not captured,Not captured,863949,020,00072,ARS-02-0055387,Beacon America,Not captured,Not captured,Not captured,Passport(136158387),,,Rivas,Adela,,06/11/1964,female,Not captured,Not captured,Not captured,Not captured,Not captured,Not captured,Not captured,Not captured,Not captured,Not captured,Not captured,Not captured,Not captured,RUBEN ROJAS,SPOUSE,Not captured,Not captured,Not captured,Not captured,LA PEDREGOSA AVE PRINCIPAL QTA. EL CHALET S/N,,MERIDA,Merida,00000,584147418391,,Not captured,Not captured,RARR2009@GMAIL.COM,Not captured,802047229,,Not captured,Not captured,Not captured,Not captured,Not captured,Not captured,
Not captured,Not captured,03/03/2020,Not captured,Not captured,863949,020,00072,ARS-01-0055383,Beacon International,Not captured,Not captured,Not captured,,,,Wiener,David,,06/02/1954,male,Not captured,Not captured,Not captured,Not captured,Not captured,Not captured,Not captured,Not captured,Not captured,Not captured,Not captured,Not captured,Not captured,,,Not captured,Not captured,Not captured,Not captured,10780 Knight Dr.,,Carmel,Indiana,46032,,,Not captured,Not captured,dwiener1@indy.rr.com,Not captured,802047171,,Not captured,Not captured,Not captured,Not captured,Not captured,Not captured,
Not captured,Not captured,03/03/2020,Not captured,Not captured,863949,020,00072,ARS-01-0055382,Beacon International,Not captured,Not captured,Not captured,,,,Puri,Sean,A,12/09/1991,male,Not captured,Not captured,Not captured,Not captured,Not captured,Not captured,Not captured,Not captured,Not captured,Not captured,Not captured,Not captured,Not captured,,,Not captured,Not captured,Not captured,Not captured,1733 Edison ave,,Bronx,New York,10461,,,Not captured,Not captured,seanpure3@gmail.com,Not captured,802047170,,Not captured,Not captured,Not captured,Not captured,Not captured,Not captured,
Not captured,Not captured,03/07/2020,Not captured,Not captured,863949,020,00072,ARS-02-0055377,Beacon America,Not captured,Not captured,Not captured,Passport(na),,,Bernate Suarez,Romel Alcides,,01/25/1974,male,Not captured,Not captured,Not captured,Not captured,Not captured,Not captured,Not captured,Not captured,Not captured,Not captured,Not captured,Not captured,Not captured,estate,other,Not captured,Not captured,Not captured,Not captured,National Center for State Courts,,Bogota,Distrito Capltal de Santa Fe de Bogot&atilde;,na,5714898640 114,,Not captured,Not captured,yrodriguez@ncsc.co,Not captured,802047165,,Not captured,Not captured,Not captured,Not captured,Not captured,Not captured,