EE Transaction Type,Dependent Transaction Type,Effective Date,EE Signature,EE Signature Date,Control,Suffix,Account,Plan Number,Plan Name,Claim Office,Network ID Number,Customer Code,EE SSN,Dependent SSN,Dependent Relationship,Last Name,First Name,Middle Initial,DOB,Gender,Ethnicity,PCP/PCD,PCP/PCD Current Patient,Provider Cap Office Number,COB,Dep Student Indicator,Dep OOA Indicator,EE Prior Coverage Indicator,EE Late Entrant,EE Language Indicator,Hire Date,Earnings,Earnings Frequency,Beneficiary (Last Name First Name MI),Beneficiary Relationship,Continuation of Coverage Expiration Date,Continuation of Coverage Event Date,Continuation of Coverage Length of Coverage,Work Location Zip Code,Street Address Line 1,Street Address Line 2,City,State,Zip Code,Home Phone Number,Work Phone Number,Accept Code,Evidence Code,EE Email Address,Communication Disability Code,EE Alternate ID,Dep Alternate ID,Old Control,Old Suffix,Old Account,New Control,New Suffix,New Account,
Not captured,Not captured,03/04/2020,Not captured,Not captured,863949,020,00072,ARS-02-0055420,Beacon America,Not captured,Not captured,Not captured,,,,Castro Poot,Lizandro,,03/15/1988,male,Not captured,Not captured,Not captured,Not captured,Not captured,Not captured,Not captured,Not captured,Not captured,Not captured,Not captured,Not captured,Not captured,Monica Castro,Spouse ,Not captured,Not captured,Not captured,Not captured,222 Julian St,,Denver,Colorado,80219,3033058043,,Not captured,Not captured,Lizandrocastro08@gmail.com,Not captured,802047402,,Not captured,Not captured,Not captured,Not captured,Not captured,Not captured,
Not captured,Not captured,03/04/2020,Not captured,Not captured,863949,020,00072,ARS-01-0055415,Beacon International,Not captured,Not captured,Not captured,,,,Petrikowsky,Samuel,,02/15/2004,male,Not captured,Not captured,Not captured,Not captured,Not captured,Not captured,Not captured,Not captured,Not captured,Not captured,Not captured,Not captured,Not captured,,,Not captured,Not captured,Not captured,Not captured,4 Riverside,,Lakewood,New Jersey,08701,215-660-5489,,Not captured,Not captured,michael@palladiumgrp.com,Not captured,802047345,,Not captured,Not captured,Not captured,Not captured,Not captured,Not captured,
Not captured,Not captured,03/04/2020,Not captured,Not captured,863949,020,00072,ARS-01-0055414,Beacon International,Not captured,Not captured,Not captured,,,,Petrikowsky,Michael,,12/18/1980,male,Not captured,Not captured,Not captured,Not captured,Not captured,Not captured,Not captured,Not captured,Not captured,Not captured,Not captured,Not captured,Not captured,,,Not captured,Not captured,Not captured,Not captured,4 Riverside,,Lakewood,New Jersey,08701,215-660-5489,,Not captured,Not captured,michael@palladiumgrp.com,Not captured,802047344,,Not captured,Not captured,Not captured,Not captured,Not captured,Not captured,
Not captured,Not captured,03/04/2020,Not captured,Not captured,863949,020,00072,ARS-02-0055410,Beacon America,Not captured,Not captured,Not captured,Passport(E76793531),,,Yuan,Xunmei,,10/11/2007,female,Not captured,Not captured,Not captured,Not captured,Not captured,Not captured,Not captured,Not captured,Not captured,Not captured,Not captured,Not captured,Not captured,Ming Yuan,Father ,Not captured,Not captured,Not captured,Not captured,1926 Ocean Shore Blvd,,Ormond Beach,FL,32176,8139669139,,Not captured,Not captured,yvonneyang818@yahoo.com,Not captured,802047339,,Not captured,Not captured,Not captured,Not captured,Not captured,Not captured,
Not captured,Not captured,03/04/2020,Not captured,Not captured,863949,020,00072,ARS-01-0055408,Beacon International,Not captured,Not captured,Not captured,Passport(502824263),,,Ekberg,Marta,R,05/20/1969,female,Not captured,Not captured,Not captured,Not captured,Not captured,Not captured,Not captured,Not captured,Not captured,Not captured,Not captured,Not captured,Not captured,Jeff Ekberg,Spouse,Not captured,Not captured,Not captured,Not captured,2830 S. Hulen St,,Fort Worth,Texas,76109,8172716619,,Not captured,Not captured,martaekberg@me.com,Not captured,802047335,,Not captured,Not captured,Not captured,Not captured,Not captured,Not captured,
Not captured,Not captured,03/04/2020,Not captured,Not captured,863949,020,00072,ARS-01-0055404,Beacon International,Not captured,Not captured,Not captured,,,,Aclander,Jaime,,01/24/1958,male,Not captured,Not captured,Not captured,Not captured,Not captured,Not captured,Not captured,Not captured,Not captured,Not captured,Not captured,Not captured,Not captured,,,Not captured,Not captured,Not captured,Not captured,30 W Yale Loop,,Irvine,California,92604,,,Not captured,Not captured,haim267@yahoo.com,Not captured,802047310,,Not captured,Not captured,Not captured,Not captured,Not captured,Not captured,
Not captured,Not captured,03/04/2020,Not captured,Not captured,863949,020,00072,ARS-01-0055403,Beacon International,Not captured,Not captured,Not captured,,,,grimes,daniel,,10/14/1981,male,Not captured,Not captured,Not captured,Not captured,Not captured,Not captured,Not captured,Not captured,Not captured,Not captured,Not captured,Not captured,Not captured,,,Not captured,Not captured,Not captured,Not captured,945 chalcedony st,,san diego,California,92109,,,Not captured,Not captured,mv2asu2000@aol.com,Not captured,802047309,,Not captured,Not captured,Not captured,Not captured,Not captured,Not captured,
Not captured,Not captured,03/03/2020,Not captured,Not captured,863949,020,00072,ARS-01-0055402,Beacon International,Not captured,Not captured,Not captured,,,,becerra,eduardo,,01/26/1982,male,Not captured,Not captured,Not captured,Not captured,Not captured,Not captured,Not captured,Not captured,Not captured,Not captured,Not captured,Not captured,Not captured,,,Not captured,Not captured,Not captured,Not captured,calle san andres 477,,cusco,,08000,,,Not captured,Not captured,eduardocultural@gmail.com,Not captured,802047301,,Not captured,Not captured,Not captured,Not captured,Not captured,Not captured,
Not captured,Not captured,03/04/2020,Not captured,Not captured,863949,020,00072,ARS-02-0055400,Beacon America,Not captured,Not captured,Not captured,,,,Lemus Rendon   ,Cristobal ,,07/25/1969,male,Not captured,Not captured,Not captured,Not captured,Not captured,Not captured,Not captured,Not captured,Not captured,Not captured,Not captured,Not captured,Not captured,,,Not captured,Not captured,Not captured,Not captured,Amer Embassy Mexico City,,Mexico DF,Mexico,06500,01155 5080-2990,,Not captured,Not captured,AlmazanE@state.gov,Not captured,802047246,,Not captured,Not captured,Not captured,Not captured,Not captured,Not captured,
Not captured,Not captured,03/04/2020,Not captured,Not captured,863949,020,00072,ARS-35-0055381,Global Mariner America,Not captured,Not captured,Not captured,Passport(565788237),,,Dates,Brennan,,12/07/1976,male,Not captured,Not captured,Not captured,Not captured,Not captured,Not captured,Not captured,Not captured,Not captured,Not captured,Not captured,Not captured,Not captured,,,Not captured,Not captured,Not captured,Not captured,757 SE 17th St. #982,,Fort Lauderdale,Florida,33316,9546818384,,Not captured,Not captured,brennandates@gmail.com,Not captured,802047169,,Not captured,Not captured,Not captured,Not captured,Not captured,Not captured,
Not captured,Not captured,03/03/2020,Not captured,Not captured,863949,020,00072,ARS-02-0055387,Beacon America,Not captured,Not captured,Not captured,Passport(136158387),,,Rivas,Adela,,06/11/1964,female,Not captured,Not captured,Not captured,Not captured,Not captured,Not captured,Not captured,Not captured,Not captured,Not captured,Not captured,Not captured,Not captured,RUBEN ROJAS,SPOUSE,Not captured,Not captured,Not captured,Not captured,LA PEDREGOSA AVE PRINCIPAL QTA. EL CHALET S/N,,MERIDA,Merida,00000,584147418391,,Not captured,Not captured,RARR2009@GMAIL.COM,Not captured,802047229,,Not captured,Not captured,Not captured,Not captured,Not captured,Not captured,
Not captured,Not captured,03/03/2020,Not captured,Not captured,863949,020,00072,ARS-01-0055383,Beacon International,Not captured,Not captured,Not captured,,,,Wiener,David,,06/02/1954,male,Not captured,Not captured,Not captured,Not captured,Not captured,Not captured,Not captured,Not captured,Not captured,Not captured,Not captured,Not captured,Not captured,,,Not captured,Not captured,Not captured,Not captured,10780 Knight Dr.,,Carmel,Indiana,46032,,,Not captured,Not captured,dwiener1@indy.rr.com,Not captured,802047171,,Not captured,Not captured,Not captured,Not captured,Not captured,Not captured,
Not captured,Not captured,03/03/2020,Not captured,Not captured,863949,020,00072,ARS-01-0055382,Beacon International,Not captured,Not captured,Not captured,,,,Puri,Sean,A,12/09/1991,male,Not captured,Not captured,Not captured,Not captured,Not captured,Not captured,Not captured,Not captured,Not captured,Not captured,Not captured,Not captured,Not captured,,,Not captured,Not captured,Not captured,Not captured,1733 Edison ave,,Bronx,New York,10461,,,Not captured,Not captured,seanpure3@gmail.com,Not captured,802047170,,Not captured,Not captured,Not captured,Not captured,Not captured,Not captured,
Not captured,Not captured,03/03/2020,Not captured,Not captured,863949,020,00072,ARS-01-0055372,Beacon International,Not captured,Not captured,Not captured,,,,Gunderson,Ruby,,08/22/1995,female,Not captured,Not captured,Not captured,Not captured,Not captured,Not captured,Not captured,Not captured,Not captured,Not captured,Not captured,Not captured,Not captured,,,Not captured,Not captured,Not captured,Not captured,9714 281st Ave NW,,Zimmerman,Minnesota,55398,763-269-9281,,Not captured,Not captured,ruby@mailabit.org,Not captured,802047160,,Not captured,Not captured,Not captured,Not captured,Not captured,Not captured,
Not captured,Not captured,03/03/2020,Not captured,Not captured,863949,020,00072,ARS-02-0055371,Beacon America,Not captured,Not captured,Not captured,Passport(G22441177 ),,,Cortez Meraz,Fabiola,,04/28/1976,female,Not captured,Not captured,Not captured,Not captured,Not captured,Not captured,Not captured,Not captured,Not captured,Not captured,Not captured,Not captured,Not captured,,,Not captured,Not captured,Not captured,Not captured,PO Box 9000,,Brownsville,Texas,78520,9562256019,,Not captured,Not captured,terrazasme@state.gov,Not captured,802047159,,Not captured,Not captured,Not captured,Not captured,Not captured,Not captured,
Not captured,Not captured,03/02/2020,Not captured,Not captured,863949,020,00072,ARS-02-0055357,Beacon America,Not captured,Not captured,Not captured,,,,Thupten Wangden,FNU,,06/15/1979,male,Not captured,Not captured,Not captured,Not captured,Not captured,Not captured,Not captured,Not captured,Not captured,Not captured,Not captured,Not captured,Not captured,Estate,Estate,Not captured,Not captured,Not captured,Not captured,1781 Dresden Dr. NE,,Brookhaven,Georgia,30319,4049091985,,Not captured,Not captured,irene@drepung.org,Not captured,802047140,,Not captured,Not captured,Not captured,Not captured,Not captured,Not captured,
Not captured,Not captured,03/02/2020,Not captured,Not captured,863949,020,00072,ARS-02-0055356,Beacon America,Not captured,Not captured,Not captured,,,,Tenzin Sopa,FNU,,03/23/1978,male,Not captured,Not captured,Not captured,Not captured,Not captured,Not captured,Not captured,Not captured,Not captured,Not captured,Not captured,Not captured,Not captured,Estate,Estate,Not captured,Not captured,Not captured,Not captured,1781 Dresden Dr. NE,,Brookhaven,Georgia,30319,4049091985,,Not captured,Not captured,irene@drepung.org,Not captured,802047139,,Not captured,Not captured,Not captured,Not captured,Not captured,Not captured,
Not captured,Not captured,03/03/2020,Not captured,Not captured,863949,020,00072,ARS-01-0055354,Beacon International,Not captured,Not captured,Not captured,Passport(139591736),,,Munoz,Elias,M,04/30/1980,male,Not captured,Not captured,Not captured,Not captured,Not captured,Not captured,Not captured,Not captured,Not captured,Not captured,Not captured,Not captured,Not captured,Julieta Munoz,Mother,Not captured,Not captured,Not captured,Not captured,1107 NW 125Th Path,,Miami,Florida,33182,7869301690,,Not captured,Not captured,eliahwood@gmail.com,Not captured,802047137,,Not captured,Not captured,Not captured,Not captured,Not captured,Not captured,
Not captured,Not captured,03/02/2020,Not captured,Not captured,863949,020,00072,ARS-01-0055347,Beacon International,Not captured,Not captured,Not captured,Passport(142700534),,,Gelves,Eufracio,,08/16/1957,male,Not captured,Not captured,Not captured,Not captured,Not captured,Not captured,Not captured,Not captured,Not captured,Not captured,Not captured,Not captured,Not captured,Magda Salazar De Gelves,ESPOSA,Not captured,Not captured,Not captured,Not captured,14306SW148AVENIDA MIAMI FL:33196,,MIAMI,Florida,33196,3057886790,3053785210,Not captured,Not captured,egelves@live.com,Not captured,802047066,,Not captured,Not captured,Not captured,Not captured,Not captured,Not captured,
Not captured,Not captured,03/02/2020,Not captured,Not captured,863949,020,00072,ARS-01-0055346,Beacon International,Not captured,Not captured,Not captured,,,,Guro,Andrew,,01/12/1996,male,Not captured,Not captured,Not captured,Not captured,Not captured,Not captured,Not captured,Not captured,Not captured,Not captured,Not captured,Not captured,Not captured,,,Not captured,Not captured,Not captured,Not captured,17555 Collins Ave,,Sunny Isles Beach,Florida,33160,,,Not captured,Not captured,jay@loudway.com,Not captured,802047065,,Not captured,Not captured,Not captured,Not captured,Not captured,Not captured,
Not captured,Not captured,03/02/2020,Not captured,Not captured,863949,020,00072,ARS-01-0055345,Beacon International,Not captured,Not captured,Not captured,,,,Guro,Jason,G,09/21/1999,male,Not captured,Not captured,Not captured,Not captured,Not captured,Not captured,Not captured,Not captured,Not captured,Not captured,Not captured,Not captured,Not captured,,,Not captured,Not captured,Not captured,Not captured,17555 Collins Ave,,Sunny Isles Beach,Florida,33160,,,Not captured,Not captured,jay@loudway.com,Not captured,802047064,,Not captured,Not captured,Not captured,Not captured,Not captured,Not captured,
Not captured,Not captured,03/02/2020,Not captured,Not captured,863949,020,00072,ARS-02-0055344,Beacon America,Not captured,Not captured,Not captured,Passport(136158316),,,ROJAS,RUBEN,,07/03/1964,male,Not captured,Not captured,Not captured,Not captured,Not captured,Not captured,Not captured,Not captured,Not captured,Not captured,Not captured,Not captured,Not captured,ADELA RIVAS,SPOUSE,Not captured,Not captured,Not captured,Not captured,LA PEDREGOSA AVE. PRINCIPAL ATA. E CHALET,,MERIDA,Miranda,0000,584147418391,,Not captured,Not captured,RARR2009@GMAIL.COM,Not captured,802047063,,Not captured,Not captured,Not captured,Not captured,Not captured,Not captured,
Not captured,Not captured,03/02/2020,Not captured,Not captured,863949,020,00072,ARS-01-0055343,Beacon International,Not captured,Not captured,Not captured,,,,Flynn,Paula,J,12/19/1963,female,Not captured,Not captured,Not captured,Not captured,Not captured,Not captured,Not captured,Not captured,Not captured,Not captured,Not captured,Not captured,Not captured,,,Not captured,Not captured,Not captured,Not captured,20 Bonair Street,,Somerville,Massachusetts,02145,,,Not captured,Not captured,pfly12@gmail.com,Not captured,802047051,,Not captured,Not captured,Not captured,Not captured,Not captured,Not captured,
Not captured,Not captured,03/04/2020,Not captured,Not captured,863949,020,00072,ARS-01-0055342,Beacon International,Not captured,Not captured,Not captured,,,,plath,dylan,x,03/24/2018,male,Not captured,Not captured,Not captured,Not captured,Not captured,Not captured,Not captured,Not captured,Not captured,Not captured,Not captured,Not captured,Not captured,,,Not captured,Not captured,Not captured,Not captured,283 avenue c,,new york,New York,10009,,,Not captured,Not captured,deniseguy5@yahoo.co.uk,Not captured,802047050,,Not captured,Not captured,Not captured,Not captured,Not captured,Not captured,
Not captured,Not captured,03/04/2020,Not captured,Not captured,863949,020,00072,ARS-01-0055341,Beacon International,Not captured,Not captured,Not captured,,,,guy,denise,e,09/05/1975,female,Not captured,Not captured,Not captured,Not captured,Not captured,Not captured,Not captured,Not captured,Not captured,Not captured,Not captured,Not captured,Not captured,,,Not captured,Not captured,Not captured,Not captured,283 avenue c,,new york,New York,10009,,,Not captured,Not captured,deniseguy5@yahoo.co.uk,Not captured,802047049,,Not captured,Not captured,Not captured,Not captured,Not captured,Not captured,
Not captured,Not captured,03/02/2020,Not captured,Not captured,863949,020,00072,ARS-01-0055340,Beacon International,Not captured,Not captured,Not captured,,,,Noonan,Jeff,,07/19/1973,male,Not captured,Not captured,Not captured,Not captured,Not captured,Not captured,Not captured,Not captured,Not captured,Not captured,Not captured,Not captured,Not captured,,,Not captured,Not captured,Not captured,Not captured,1411 Devon Rd,,Winter Park,Florida,32789,,,Not captured,Not captured,jnoonan73@gmail.com,Not captured,802047016,,Not captured,Not captured,Not captured,Not captured,Not captured,Not captured,
Not captured,Not captured,03/02/2020,Not captured,Not captured,863949,020,00072,ARS-01-0055339,Beacon International,Not captured,Not captured,Not captured,Passport(94521399),,,Medina Pizarro,German Alonso,,05/25/1978,male,Not captured,Not captured,Not captured,Not captured,Not captured,Not captured,Not captured,Not captured,Not captured,Not captured,Not captured,Not captured,Not captured,Hugo Mario Medina Pizarro,Brother,Not captured,Not captured,Not captured,Not captured,calle 20 121 234,,cali,Valle del Cauca,760032,573165225114,573165225105,Not captured,Not captured,admin@cnx.co,Not captured,802047015,,Not captured,Not captured,Not captured,Not captured,Not captured,Not captured,
Not captured,Not captured,03/02/2020,Not captured,Not captured,863949,020,00072,OVI-28-0055338,OverseasCare Visitors Insurance Plan,Not captured,Not captured,Not captured,Passport(E51001142),,,Ghayourazar,Aghdas,,04/21/1950,female,Not captured,Not captured,Not captured,Not captured,Not captured,Not captured,Not captured,Not captured,Not captured,Not captured,Not captured,Not captured,Not captured,Leila Jaberi,Child,Not captured,Not captured,Not captured,Not captured,6464 San Felipe St Apt 3411,,Houston,Texas,77057,8327902339,,Not captured,Not captured,ghaffar.jaberi@gmail.com,Not captured,802047014,,Not captured,Not captured,Not captured,Not captured,Not captured,Not captured,
Not captured,Not captured,03/02/2020,Not captured,Not captured,863949,020,00072,OVI-28-0055337,OverseasCare Visitors Insurance Plan,Not captured,Not captured,Not captured,Passport(E51001143),,,Jaberi,Ghaffar,,01/20/1942,male,Not captured,Not captured,Not captured,Not captured,Not captured,Not captured,Not captured,Not captured,Not captured,Not captured,Not captured,Not captured,Not captured,Leila Jaberi,Child,Not captured,Not captured,Not captured,Not captured,6464 San Felipe St Apt 3411,,Houston,Texas,77057,8327902339,,Not captured,Not captured,ghaffar.jaberi@gmail.com,Not captured,802047013,,Not captured,Not captured,Not captured,Not captured,Not captured,Not captured,
Not captured,Not captured,03/01/2020,Not captured,Not captured,863949,020,00072,ARS-01-0055336,Beacon International,Not captured,Not captured,Not captured,,,,Arredondo,Tianna,R,11/14/1993,female,Not captured,Not captured,Not captured,Not captured,Not captured,Not captured,Not captured,Not captured,Not captured,Not captured,Not captured,Not captured,Not captured,,,Not captured,Not captured,Not captured,Not captured,1250 E Shaw Ave. #156,,Fresno,California,93710,,,Not captured,Not captured,arredondo.tianna@gmail.com,Not captured,802046994,,Not captured,Not captured,Not captured,Not captured,Not captured,Not captured,
Not captured,Not captured,03/01/2020,Not captured,Not captured,863949,020,00072,OVI-28-0055335,OverseasCare Visitors Insurance Plan,Not captured,Not captured,Not captured,,,,Karki,Kanta,,09/04/1953,female,Not captured,Not captured,Not captured,Not captured,Not captured,Not captured,Not captured,Not captured,Not captured,Not captured,Not captured,Not captured,Not captured,Yashvir Karki,Son,Not captured,Not captured,Not captured,Not captured,39 Fulmar ln,,Aliso Viejo,California,92656,5622488218,,Not captured,Not captured,yashvir.karki@gmail.com,Not captured,802046993,,Not captured,Not captured,Not captured,Not captured,Not captured,Not captured,
Not captured,Not captured,03/01/2020,Not captured,Not captured,863949,020,00072,OVI-28-0055334,OverseasCare Visitors Insurance Plan,Not captured,Not captured,Not captured,,,,Bahadur,Ram,,09/04/1952,male,Not captured,Not captured,Not captured,Not captured,Not captured,Not captured,Not captured,Not captured,Not captured,Not captured,Not captured,Not captured,Not captured,Yashvir Karki,Son,Not captured,Not captured,Not captured,Not captured,39 Fulmar ln,,Aliso Viejo,California,92656,5622488218,,Not captured,Not captured,yashvir.karki@gmail.com,Not captured,802046992,,Not captured,Not captured,Not captured,Not captured,Not captured,Not captured,
Not captured,Not captured,03/03/2020,Not captured,Not captured,863949,020,00072,ARS-02-0055332,Beacon America,Not captured,Not captured,Not captured,Passport(BC2718063),,,RAFAEL,Peter,,07/29/1969,male,Not captured,Not captured,Not captured,Not captured,Not captured,Not captured,Not captured,Not captured,Not captured,Not captured,Not captured,Not captured,Not captured,Andrea Rafael,sisterr,Not captured,Not captured,Not captured,Not captured,133 Roundhill Dr,,Yonkers,New York,10710,6462418876,,Not captured,Not captured,andrea.rafael13@gmail.com,Not captured,802046990,,Not captured,Not captured,Not captured,Not captured,Not captured,Not captured,
Not captured,Not captured,03/01/2020,Not captured,Not captured,863949,020,00072,OVI-28-0055331,OverseasCare Visitors Insurance Plan,Not captured,Not captured,Not captured,Passport(GL483585),,,Cho,Isaac,Matthew,06/13/2002,male,Not captured,Not captured,Not captured,Not captured,Not captured,Not captured,Not captured,Not captured,Not captured,Not captured,Not captured,Not captured,Not captured,Isaac Matthew Cho,Son,Not captured,Not captured,Not captured,Not captured,3-2369 Ogilvie Road,,Ottawa,Ontario,K1J7N4,9296205561,,Not captured,Not captured,green6655apple@gmail.com,Not captured,802046989,,Not captured,Not captured,Not captured,Not captured,Not captured,Not captured,
Not captured,Not captured,03/01/2020,Not captured,Not captured,863949,020,00072,OVI-28-0055330,OverseasCare Visitors Insurance Plan,Not captured,Not captured,Not captured,Passport(GL483585),,,Wong,Michelle,,07/05/1972,female,Not captured,Not captured,Not captured,Not captured,Not captured,Not captured,Not captured,Not captured,Not captured,Not captured,Not captured,Not captured,Not captured,Isaac Matthew Cho,Son,Not captured,Not captured,Not captured,Not captured,3-2369 Ogilvie Road,,Ottawa,Ontario,K1J7N4,9296205561,,Not captured,Not captured,green6655apple@gmail.com,Not captured,802046988,,Not captured,Not captured,Not captured,Not captured,Not captured,Not captured,
Not captured,Not captured,03/01/2020,Not captured,Not captured,863949,020,00072,ARS-01-0055329,Beacon International,Not captured,Not captured,Not captured,,,,Freeman Dixon,Samira,,04/06/1963,female,Not captured,Not captured,Not captured,Not captured,Not captured,Not captured,Not captured,Not captured,Not captured,Not captured,Not captured,Not captured,Not captured,,,Not captured,Not captured,Not captured,Not captured,Gullin Road 7,,Pointe Blanche,,00000,,,Not captured,Not captured,edwarddest@gmail.com,Not captured,802046986,,Not captured,Not captured,Not captured,Not captured,Not captured,Not captured,