EE Transaction Type,Dependent Transaction Type,Effective Date,EE Signature,EE Signature Date,Control,Suffix,Account,Plan Number,Plan Name,Claim Office,Network ID Number,Customer Code,EE SSN,Dependent SSN,Dependent Relationship,Last Name,First Name,Middle Initial,DOB,Gender,Ethnicity,PCP/PCD,PCP/PCD Current Patient,Provider Cap Office Number,COB,Dep Student Indicator,Dep OOA Indicator,EE Prior Coverage Indicator,EE Late Entrant,EE Language Indicator,Hire Date,Earnings,Earnings Frequency,Beneficiary (Last Name First Name MI),Beneficiary Relationship,Continuation of Coverage Expiration Date,Continuation of Coverage Event Date,Continuation of Coverage Length of Coverage,Work Location Zip Code,Street Address Line 1,Street Address Line 2,City,State,Zip Code,Home Phone Number,Work Phone Number,Accept Code,Evidence Code,EE Email Address,Communication Disability Code,EE Alternate ID,Dep Alternate ID,Old Control,Old Suffix,Old Account,New Control,New Suffix,New Account,
Not captured,Not captured,02/03/2020,Not captured,Not captured,863949,020,00072,ARS-01-0054840,Beacon International,Not captured,Not captured,Not captured,,,,Hammer,Lazer,,07/02/2000,male,Not captured,Not captured,Not captured,Not captured,Not captured,Not captured,Not captured,Not captured,Not captured,Not captured,Not captured,Not captured,Not captured,,,Not captured,Not captured,Not captured,Not captured,1354 51st street,,Brooklyn,New York,11219,,,Not captured,Not captured,mmhhny@gmail.com,Not captured,802045164,,Not captured,Not captured,Not captured,Not captured,Not captured,Not captured,
Not captured,Not captured,02/03/2020,Not captured,Not captured,863949,020,00072,ARS-01-0054835,Beacon International,Not captured,Not captured,Not captured,Passport(512182023),,,Walker,Lennox,,11/22/1940,male,Not captured,Not captured,Not captured,Not captured,Not captured,Not captured,Not captured,Not captured,Not captured,Not captured,Not captured,Not captured,Not captured,Hazel Walker,Daughter,Not captured,Not captured,Not captured,Not captured,4B La Seiva Avenue,,Maraval,Trinidad,11111,868 622 1274,,Not captured,Not captured,icastagnehay@yahoo.co.uk,Not captured,802045159,,Not captured,Not captured,Not captured,Not captured,Not captured,Not captured,
Not captured,Not captured,02/03/2020,Not captured,Not captured,863949,020,00072,ARS-01-0054825,Beacon International,Not captured,Not captured,Not captured,,,,Decker,Robyn,,04/23/1978,female,Not captured,Not captured,Not captured,Not captured,Not captured,Not captured,Not captured,Not captured,Not captured,Not captured,Not captured,Not captured,Not captured,,,Not captured,Not captured,Not captured,Not captured,17 Wild Rose Drive,,Nashua,New Hampshire,03063,,,Not captured,Not captured,robyn_decker@yahoo.com,Not captured,802045148,,Not captured,Not captured,Not captured,Not captured,Not captured,Not captured,
Not captured,Not captured,02/03/2020,Not captured,Not captured,863949,020,00072,ARS-01-0054818,Beacon International,Not captured,Not captured,Not captured,,,,Keiser,Margarita,M,12/06/1970,female,Not captured,Not captured,Not captured,Not captured,Not captured,Not captured,Not captured,Not captured,Not captured,Not captured,Not captured,Not captured,Not captured,,,Not captured,Not captured,Not captured,Not captured,2200 W Dickerson St,,Bozeman,Montana,59718,,,Not captured,Not captured,buckkeis@hotmail.com,Not captured,802045135,,Not captured,Not captured,Not captured,Not captured,Not captured,Not captured,
Not captured,Not captured,02/03/2020,Not captured,Not captured,863949,020,00072,ARS-01-0054817,Beacon International,Not captured,Not captured,Not captured,,,,Keiser,Charles,D,01/03/1952,male,Not captured,Not captured,Not captured,Not captured,Not captured,Not captured,Not captured,Not captured,Not captured,Not captured,Not captured,Not captured,Not captured,,,Not captured,Not captured,Not captured,Not captured,2200 W Dickerson St,,Bozeman,Montana,59718,,,Not captured,Not captured,buckkeis@hotmail.com,Not captured,802045134,,Not captured,Not captured,Not captured,Not captured,Not captured,Not captured,
Not captured,Not captured,02/03/2020,Not captured,Not captured,863949,020,00072,ARS-01-0054815,Beacon International,Not captured,Not captured,Not captured,,,,DE SANTANA GUTIERREZ,DELCIO,,11/12/1976,male,Not captured,Not captured,Not captured,Not captured,Not captured,Not captured,Not captured,Not captured,Not captured,Not captured,Not captured,Not captured,Not captured,,,Not captured,Not captured,Not captured,Not captured,10234 White Pines Dr,,Katy,Texas,77494,,,Not captured,Not captured,SANTAD76@GMAIL.COM,Not captured,802045132,,Not captured,Not captured,Not captured,Not captured,Not captured,Not captured,
Not captured,Not captured,02/03/2020,Not captured,Not captured,863949,020,00072,ARS-02-0054814,Beacon America,Not captured,Not captured,Not captured,,,,Thibault,Anne,,09/22/1980,female,Not captured,Not captured,Not captured,Not captured,Not captured,Not captured,Not captured,Not captured,Not captured,Not captured,Not captured,Not captured,Not captured,,,Not captured,Not captured,Not captured,Not captured,11 rue Adolphe Mille,,Paris,,75019,,,Not captured,Not captured,annethibault@yahoo.fr,Not captured,802045131,,Not captured,Not captured,Not captured,Not captured,Not captured,Not captured,
Not captured,Not captured,02/01/2020,Not captured,Not captured,863949,020,00072,ARS-02-0054811,Beacon America,Not captured,Not captured,Not captured,,,,lopez,Aaron,s,11/10/1980,male,Not captured,Not captured,Not captured,Not captured,Not captured,Not captured,Not captured,Not captured,Not captured,Not captured,Not captured,Not captured,Not captured,,,Not captured,Not captured,Not captured,Not captured,131 Garfield st.,,Sumas,Washington,98295,,,Not captured,Not captured,aaronlopezcpu@gmail.com,Not captured,802045128,,Not captured,Not captured,Not captured,Not captured,Not captured,Not captured,
Not captured,Not captured,02/01/2020,Not captured,Not captured,863949,020,00072,OVI-28-0054807,OverseasCare Visitors Insurance Plan,Not captured,Not captured,Not captured,Passport(L1589076),,,Kasaragod,Narayan Naik,,04/23/1948,male,Not captured,Not captured,Not captured,Not captured,Not captured,Not captured,Not captured,Not captured,Not captured,Not captured,Not captured,Not captured,Not captured,Ashwitha Naik,Father,Not captured,Not captured,Not captured,Not captured,87Goodwin Drive,,North Brunswick,New Jersey,08902,5857055404,5854858577,Not captured,Not captured,naik.ashwitha@gmail.com,Not captured,802045122,,Not captured,Not captured,Not captured,Not captured,Not captured,Not captured,
Not captured,Not captured,02/01/2020,Not captured,Not captured,863949,020,00072,ARS-01-0054806,Beacon International,Not captured,Not captured,Not captured,,,,Spadavecchia,Kim,,08/01/1966,female,Not captured,Not captured,Not captured,Not captured,Not captured,Not captured,Not captured,Not captured,Not captured,Not captured,Not captured,Not captured,Not captured,,,Not captured,Not captured,Not captured,Not captured,822 NE 71 Street,,Boca Raton,Florida,33487,,,Not captured,Not captured,kims184@comcast.net,Not captured,802045121,,Not captured,Not captured,Not captured,Not captured,Not captured,Not captured,
Not captured,Not captured,02/01/2020,Not captured,Not captured,863949,020,00072,ARS-01-0054805,Beacon International,Not captured,Not captured,Not captured,,,,Spadavecchia,Dominick,,02/16/1966,male,Not captured,Not captured,Not captured,Not captured,Not captured,Not captured,Not captured,Not captured,Not captured,Not captured,Not captured,Not captured,Not captured,,,Not captured,Not captured,Not captured,Not captured,822 NE 71 Street,,Boca Raton,Florida,33487,,,Not captured,Not captured,kims184@comcast.net,Not captured,802045120,,Not captured,Not captured,Not captured,Not captured,Not captured,Not captured,
Not captured,Not captured,01/31/2020,Not captured,Not captured,863949,020,00072,ARS-01-0054803,Beacon International,Not captured,Not captured,Not captured,Passport(582896054),,,Cobb,Gloria,M,02/21/1958,female,Not captured,Not captured,Not captured,Not captured,Not captured,Not captured,Not captured,Not captured,Not captured,Not captured,Not captured,Not captured,Not captured,Samuel Cobb,son,Not captured,Not captured,Not captured,Not captured,55 Overlook Drive,,Candler,North Carolina,28715,8283294068,,Not captured,Not captured,gmcunc@hotmail.com,Not captured,802045118,,Not captured,Not captured,Not captured,Not captured,Not captured,Not captured,
Not captured,Not captured,02/01/2020,Not captured,Not captured,863949,020,00072,ARS-02-0054801,Beacon America,Not captured,Not captured,Not captured,,,,LU,HEHUA,,07/03/1951,female,Not captured,Not captured,Not captured,Not captured,Not captured,Not captured,Not captured,Not captured,Not captured,Not captured,Not captured,Not captured,Not captured,,,Not captured,Not captured,Not captured,Not captured,MAOTAI ROAD # 500 BUILDING 7TH ROOM 806,,SHANGHAI,,200051,,,Not captured,Not captured,jiangyu@airchinacargo.com,Not captured,802045116,,Not captured,Not captured,Not captured,Not captured,Not captured,Not captured,
Not captured,Not captured,01/31/2020,Not captured,Not captured,863949,020,00072,ARS-02-0054800,Beacon America,Not captured,Not captured,Not captured,,,,Smith,Amber,,02/13/1957,female,Not captured,Not captured,Not captured,Not captured,Not captured,Not captured,Not captured,Not captured,Not captured,Not captured,Not captured,Not captured,Not captured,,,Not captured,Not captured,Not captured,Not captured,HC 13 box453,,Fairview,Utah,84629,,,Not captured,Not captured,ambervsmith57@hotmail.com,Not captured,802045115,,Not captured,Not captured,Not captured,Not captured,Not captured,Not captured,
Not captured,Not captured,02/01/2020,Not captured,Not captured,863949,020,00072,ARS-01-0054798,Beacon International,Not captured,Not captured,Not captured,Passport(561573314),,,Young,Zachariah,T,10/24/2000,male,Not captured,Not captured,Not captured,Not captured,Not captured,Not captured,Not captured,Not captured,Not captured,Not captured,Not captured,Not captured,Not captured,Raymond Young,Father,Not captured,Not captured,Not captured,Not captured,108 Barlow Cove,,Liberty Hill,Texas,78642,15127574830,,Not captured,Not captured,youngzach24@gmail.com,Not captured,802045113,,Not captured,Not captured,Not captured,Not captured,Not captured,Not captured,
Not captured,Not captured,01/31/2020,Not captured,Not captured,863949,020,00072,ARS-01-0054797,Beacon International,Not captured,Not captured,Not captured,,,,Nevo,Maayan,,01/28/2010,female,Not captured,Not captured,Not captured,Not captured,Not captured,Not captured,Not captured,Not captured,Not captured,Not captured,Not captured,Not captured,Not captured,Eran Nevo,Spouse,Not captured,Not captured,Not captured,Not captured,310 Centennial DR,,Blue Bell,Pennsylvania,19422,2676387470,,Not captured,Not captured,eran.nevo.10@gmail.com,Not captured,802045112,,Not captured,Not captured,Not captured,Not captured,Not captured,Not captured,
Not captured,Not captured,01/31/2020,Not captured,Not captured,863949,020,00072,ARS-01-0054796,Beacon International,Not captured,Not captured,Not captured,,,,Nevo,Shira,,09/30/2007,female,Not captured,Not captured,Not captured,Not captured,Not captured,Not captured,Not captured,Not captured,Not captured,Not captured,Not captured,Not captured,Not captured,Eran Nevo,Spouse,Not captured,Not captured,Not captured,Not captured,310 Centennial DR,,Blue Bell,Pennsylvania,19422,2676387470,,Not captured,Not captured,eran.nevo.10@gmail.com,Not captured,802045111,,Not captured,Not captured,Not captured,Not captured,Not captured,Not captured,
Not captured,Not captured,01/31/2020,Not captured,Not captured,863949,020,00072,ARS-01-0054795,Beacon International,Not captured,Not captured,Not captured,Passport(20612163),,,Nevo,Anath,,12/24/1973,female,Not captured,Not captured,Not captured,Not captured,Not captured,Not captured,Not captured,Not captured,Not captured,Not captured,Not captured,Not captured,Not captured,Eran Nevo,Spouse,Not captured,Not captured,Not captured,Not captured,310 Centennial DR,,Blue Bell,Pennsylvania,19422,2676387470,,Not captured,Not captured,eran.nevo.10@gmail.com,Not captured,802045110,,Not captured,Not captured,Not captured,Not captured,Not captured,Not captured,
Not captured,Not captured,02/01/2020,Not captured,Not captured,863949,020,00072,ARS-02-0054792,Beacon America,Not captured,Not captured,Not captured,,,,Zapata Sarmiento,Jhon Alex,,01/27/2014,male,Not captured,Not captured,Not captured,Not captured,Not captured,Not captured,Not captured,Not captured,Not captured,Not captured,Not captured,Not captured,Not captured,estate,other,Not captured,Not captured,Not captured,Not captured,National Center for State Courts,,Bogota,Distrito Capltal de Santa Fe de Bogot&atilde;,na,5714898640 114,,Not captured,Not captured,yrodriguez@ncsc.co,Not captured,802045107,,Not captured,Not captured,Not captured,Not captured,Not captured,Not captured,
Not captured,Not captured,02/01/2020,Not captured,Not captured,863949,020,00072,ARS-02-0054791,Beacon America,Not captured,Not captured,Not captured,,,,Zapata Sarmiento,Johan Stiven,,01/14/2010,male,Not captured,Not captured,Not captured,Not captured,Not captured,Not captured,Not captured,Not captured,Not captured,Not captured,Not captured,Not captured,Not captured,estate,other,Not captured,Not captured,Not captured,Not captured,National Center for State Courts,,Bogota,Distrito Capltal de Santa Fe de Bogot&atilde;,na,5714898640 114,,Not captured,Not captured,yrodriguez@ncsc.co,Not captured,802045106,,Not captured,Not captured,Not captured,Not captured,Not captured,Not captured,
Not captured,Not captured,02/01/2020,Not captured,Not captured,863949,020,00072,ARS-02-0054790,Beacon America,Not captured,Not captured,Not captured,,,,Zapata Sarmiento,Andres Felipe,,04/18/2004,male,Not captured,Not captured,Not captured,Not captured,Not captured,Not captured,Not captured,Not captured,Not captured,Not captured,Not captured,Not captured,Not captured,estate,other,Not captured,Not captured,Not captured,Not captured,National Center for State Courts,,Bogota,Distrito Capltal de Santa Fe de Bogot&atilde;,na,5714898640 114,,Not captured,Not captured,yrodriguez@ncsc.co,Not captured,802045105,,Not captured,Not captured,Not captured,Not captured,Not captured,Not captured,
Not captured,Not captured,02/01/2020,Not captured,Not captured,863949,020,00072,ARS-02-0054789,Beacon America,Not captured,Not captured,Not captured,,,,Sarmiento Vasquez,Andrea Del Pilar,,09/02/1986,male,Not captured,Not captured,Not captured,Not captured,Not captured,Not captured,Not captured,Not captured,Not captured,Not captured,Not captured,Not captured,Not captured,estate,other,Not captured,Not captured,Not captured,Not captured,National Center for State Courts,,Bogota,Distrito Capltal de Santa Fe de Bogot&atilde;,na,5714898640 114,,Not captured,Not captured,yrodriguez@ncsc.co,Not captured,802045104,,Not captured,Not captured,Not captured,Not captured,Not captured,Not captured,
Not captured,Not captured,02/01/2020,Not captured,Not captured,863949,020,00072,ARS-02-0054788,Beacon America,Not captured,Not captured,Not captured,,,,Zapata Zapata,Jhon Fredy,,02/10/1975,male,Not captured,Not captured,Not captured,Not captured,Not captured,Not captured,Not captured,Not captured,Not captured,Not captured,Not captured,Not captured,Not captured,estate,other,Not captured,Not captured,Not captured,Not captured,National Center for State Courts,,Bogota,Distrito Capltal de Santa Fe de Bogot&atilde;,na,5714898640 114,,Not captured,Not captured,yrodriguez@ncsc.co,Not captured,802045103,,Not captured,Not captured,Not captured,Not captured,Not captured,Not captured,
Not captured,Not captured,02/02/2020,Not captured,Not captured,863949,020,00072,ARS-01-0054786,Beacon International,Not captured,Not captured,Not captured,,,,Robinson,Daron,,07/10/1977,male,Not captured,Not captured,Not captured,Not captured,Not captured,Not captured,Not captured,Not captured,Not captured,Not captured,Not captured,Not captured,Not captured,,,Not captured,Not captured,Not captured,Not captured,American Embassy Barbados,,St. Michael,Wildey,BB 14006,2462274128,,Not captured,Not captured,McDonaldRH@state.gov,Not captured,802045101,,Not captured,Not captured,Not captured,Not captured,Not captured,Not captured,
Not captured,Not captured,02/02/2020,Not captured,Not captured,863949,020,00072,ARS-01-0054781,Beacon International,Not captured,Not captured,Not captured,,,,Meade,Rexford,,01/17/1984,male,Not captured,Not captured,Not captured,Not captured,Not captured,Not captured,Not captured,Not captured,Not captured,Not captured,Not captured,Not captured,Not captured,,,Not captured,Not captured,Not captured,Not captured,American Embassy Barbados,,St. Michael,Wildey,BB 14006,2462274128,,Not captured,Not captured,mcdonaldrh@state.gov,Not captured,802045096,,Not captured,Not captured,Not captured,Not captured,Not captured,Not captured,
Not captured,Not captured,02/02/2020,Not captured,Not captured,863949,020,00072,ARS-02-0054778,Beacon America,Not captured,Not captured,Not captured,,,,Elorza Bonifaz Calvo,Gracia America,,10/12/1981,male,Not captured,Not captured,Not captured,Not captured,Not captured,Not captured,Not captured,Not captured,Not captured,Not captured,Not captured,Not captured,Not captured,,,Not captured,Not captured,Not captured,Not captured,American Embassy Mexico City,,Mexico DF,Mexico,06600,015550802770,,Not captured,Not captured,TrevinoG@state.gov,Not captured,802045093,,Not captured,Not captured,Not captured,Not captured,Not captured,Not captured,
Not captured,Not captured,02/03/2020,Not captured,Not captured,863949,020,00072,ARS-01-0054777,Beacon International,Not captured,Not captured,Not captured,,,,Acosta Guzman,Maria Andrea,,09/21/1974,female,Not captured,Not captured,Not captured,Not captured,Not captured,Not captured,Not captured,Not captured,Not captured,Not captured,Not captured,Not captured,Not captured,,,Not captured,Not captured,Not captured,Not captured,American Embassy Mexico City,,Mexico DF,Mexico,06600,015550802588,,Not captured,Not captured,CuadraA@state.gov,Not captured,802045092,,Not captured,Not captured,Not captured,Not captured,Not captured,Not captured,
Not captured,Not captured,01/31/2020,Not captured,Not captured,863949,020,00072,ARS-01-0054776,Beacon International,Not captured,Not captured,Not captured,,,,Witocha,Aleksander,,04/02/1998,male,Not captured,Not captured,Not captured,Not captured,Not captured,Not captured,Not captured,Not captured,Not captured,Not captured,Not captured,Not captured,Not captured,,,Not captured,Not captured,Not captured,Not captured,Wiktorska 88/45,,Warszawa,,02-582,,,Not captured,Not captured,maslowskim255@gmail.com,Not captured,802045090,,Not captured,Not captured,Not captured,Not captured,Not captured,Not captured,
Not captured,Not captured,01/31/2020,Not captured,Not captured,863949,020,00072,ARS-01-0054775,Beacon International,Not captured,Not captured,Not captured,,,,MasÅowski,Mateusz,M,07/14/2000,male,Not captured,Not captured,Not captured,Not captured,Not captured,Not captured,Not captured,Not captured,Not captured,Not captured,Not captured,Not captured,Not captured,,,Not captured,Not captured,Not captured,Not captured,Wiktorska 88/45,,Warszawa,,02-582,,,Not captured,Not captured,maslowskim255@gmail.com,Not captured,802045089,,Not captured,Not captured,Not captured,Not captured,Not captured,Not captured,
Not captured,Not captured,01/31/2020,Not captured,Not captured,863949,020,00072,ARS-01-0054773,Beacon International,Not captured,Not captured,Not captured,,,,BardoÅski,Marek,,02/25/1992,male,Not captured,Not captured,Not captured,Not captured,Not captured,Not captured,Not captured,Not captured,Not captured,Not captured,Not captured,Not captured,Not captured,,,Not captured,Not captured,Not captured,Not captured,Twarda 4/292,,Warszawa,,00-105,,,Not captured,Not captured,marek@airev.us,Not captured,802045087,,Not captured,Not captured,Not captured,Not captured,Not captured,Not captured,
Not captured,Not captured,02/01/2020,Not captured,Not captured,863949,020,00072,ARS-03-0054708,Essential America,Not captured,Not captured,Not captured,Passport(561475945),,,Janzen,Teresa,Marie,07/13/1967,female,Not captured,Not captured,Not captured,Not captured,Not captured,Not captured,Not captured,Not captured,Not captured,Not captured,Not captured,Not captured,Not captured,,,Not captured,Not captured,Not captured,Not captured,706 Ashley Dr,,kalamazoo,Michigan,49048,6162325480,,Not captured,Not captured,teresajanzen@gmail.com,Not captured,802044988,,Not captured,Not captured,Not captured,Not captured,Not captured,Not captured,
Not captured,Not captured,02/01/2020,Not captured,Not captured,863949,020,00072,ARS-03-0054708,Essential America,Not captured,Not captured,Not captured,,Passport(561475944),Spouse,Janzen,Daniel,Charles,10/16/1965,male,Not captured,Not captured,Not captured,Not captured,Not captured,Not captured,Not captured,Not captured,Not captured,Not captured,Not captured,Not captured,Not captured,,,Not captured,Not captured,Not captured,Not captured,706 Ashley Dr,,kalamazoo,Michigan,49048,6162325480,,Not captured,Not captured,teresajanzen@gmail.com,Not captured,,802044989,Not captured,Not captured,Not captured,Not captured,Not captured,Not captured,
Not captured,Not captured,01/31/2020,Not captured,Not captured,863949,020,00072,ARS-01-0054771,Beacon International,Not captured,Not captured,Not captured,,,,sweet,nicole,,03/05/1977,female,Not captured,Not captured,Not captured,Not captured,Not captured,Not captured,Not captured,Not captured,Not captured,Not captured,Not captured,Not captured,Not captured,,,Not captured,Not captured,Not captured,Not captured,90 downing st,,brooklyn,New York,11238,,,Not captured,Not captured,nicolesweetphoto@gmail.com,Not captured,802045085,,Not captured,Not captured,Not captured,Not captured,Not captured,Not captured,
Not captured,Not captured,01/31/2020,Not captured,Not captured,863949,020,00072,ARS-02-0054770,Beacon America,Not captured,Not captured,Not captured,,,,Herskowitz,Miriam,,01/04/1997,female,Not captured,Not captured,Not captured,Not captured,Not captured,Not captured,Not captured,Not captured,Not captured,Not captured,Not captured,Not captured,Not captured,,,Not captured,Not captured,Not captured,Not captured,232 Ridge Avenue,,Lakewood,New Jersey,08701,,,Not captured,Not captured,yossiwenger2227@gmail.com,Not captured,802045084,,Not captured,Not captured,Not captured,Not captured,Not captured,Not captured,
Not captured,Not captured,02/01/2020,Not captured,Not captured,863949,020,00072,ARS-02-0054769,Beacon America,Not captured,Not captured,Not captured,Passport(na),,,Garzon Cardenas,Raul Andres,,09/27/1990,male,Not captured,Not captured,Not captured,Not captured,Not captured,Not captured,Not captured,Not captured,Not captured,Not captured,Not captured,Not captured,Not captured,estate,other,Not captured,Not captured,Not captured,Not captured,National Center for State Courts,,Bogota,Distrito Capltal de Santa Fe de Bogot&atilde;,na,5714898640 114,,Not captured,Not captured,yrodriguez@ncsc.co,Not captured,802045083,,Not captured,Not captured,Not captured,Not captured,Not captured,Not captured,
Not captured,Not captured,01/31/2020,Not captured,Not captured,863949,020,00072,ARS-01-0054767,Beacon International,Not captured,Not captured,Not captured,,,,Bergman,Frederick,,05/20/1974,male,Not captured,Not captured,Not captured,Not captured,Not captured,Not captured,Not captured,Not captured,Not captured,Not captured,Not captured,Not captured,Not captured,,,Not captured,Not captured,Not captured,Not captured,Km 13 Carretera Sur,,Managua,,50500,,,Not captured,Not captured,frederick@ntecsa.com,Not captured,802045075,,Not captured,Not captured,Not captured,Not captured,Not captured,Not captured,