EE Transaction Type,Dependent Transaction Type,Effective Date,EE Signature,EE Signature Date,Control,Suffix,Account,Plan Number,Plan Name,Claim Office,Network ID Number,Customer Code,EE SSN,Dependent SSN,Dependent Relationship,Last Name,First Name,Middle Initial,DOB,Gender,Ethnicity,PCP/PCD,PCP/PCD Current Patient,Provider Cap Office Number,COB,Dep Student Indicator,Dep OOA Indicator,EE Prior Coverage Indicator,EE Late Entrant,EE Language Indicator,Hire Date,Earnings,Earnings Frequency,Beneficiary (Last Name First Name MI),Beneficiary Relationship,Continuation of Coverage Expiration Date,Continuation of Coverage Event Date,Continuation of Coverage Length of Coverage,Work Location Zip Code,Street Address Line 1,Street Address Line 2,City,State,Zip Code,Home Phone Number,Work Phone Number,Accept Code,Evidence Code,EE Email Address,Communication Disability Code,EE Alternate ID,Dep Alternate ID,Old Control,Old Suffix,Old Account,New Control,New Suffix,New Account,
Not captured,Not captured,01/26/2020,Not captured,Not captured,863949,020,00072,ARS-01-0054676,Beacon International,Not captured,Not captured,Not captured,,,,Rodr&iacute;guez-daza,Katherin,,11/08/1994,female,Not captured,Not captured,Not captured,Not captured,Not captured,Not captured,Not captured,Not captured,Not captured,Not captured,Not captured,Not captured,Not captured,,,Not captured,Not captured,Not captured,Not captured,328 Farnham ave,,Lodi,New Jersey,07644,,,Not captured,Not captured,xokatherinr@hotmail.com,Not captured,802044903,,Not captured,Not captured,Not captured,Not captured,Not captured,Not captured,
Not captured,Not captured,01/26/2020,Not captured,Not captured,863949,020,00072,ARS-01-0054675,Beacon International,Not captured,Not captured,Not captured,,,,OBrien,Zachary,,06/18/1976,male,Not captured,Not captured,Not captured,Not captured,Not captured,Not captured,Not captured,Not captured,Not captured,Not captured,Not captured,Not captured,Not captured,,,Not captured,Not captured,Not captured,Not captured,1201 East Fork Road,,Williams,Oregon,97544,,,Not captured,Not captured,zorbacci@gmail.com,Not captured,802044902,,Not captured,Not captured,Not captured,Not captured,Not captured,Not captured,
Not captured,Not captured,01/26/2020,Not captured,Not captured,863949,020,00072,ARS-01-0054674,Beacon International,Not captured,Not captured,Not captured,,,,Gershoni,Sharon,,04/26/1972,female,Not captured,Not captured,Not captured,Not captured,Not captured,Not captured,Not captured,Not captured,Not captured,Not captured,Not captured,Not captured,Not captured,,,Not captured,Not captured,Not captured,Not captured,121 W. Durham Street,,Philadelphia,Pennsylvania,19119,,,Not captured,Not captured,sharon.gershoni@gmail.com,Not captured,802044901,,Not captured,Not captured,Not captured,Not captured,Not captured,Not captured,
Not captured,Not captured,01/26/2020,Not captured,Not captured,863949,020,00072,ARS-01-0054673,Beacon International,Not captured,Not captured,Not captured,,,,Romano,Corinne,E,04/21/1991,female,Not captured,Not captured,Not captured,Not captured,Not captured,Not captured,Not captured,Not captured,Not captured,Not captured,Not captured,Not captured,Not captured,,,Not captured,Not captured,Not captured,Not captured,6 Maureen Drive,,Mount Sinai,New York,11766,,,Not captured,Not captured,matt.savona@gmail.com,Not captured,802044900,,Not captured,Not captured,Not captured,Not captured,Not captured,Not captured,
Not captured,Not captured,01/26/2020,Not captured,Not captured,863949,020,00072,ARS-01-0054672,Beacon International,Not captured,Not captured,Not captured,,,,Savona,Matthew,J,09/24/1986,male,Not captured,Not captured,Not captured,Not captured,Not captured,Not captured,Not captured,Not captured,Not captured,Not captured,Not captured,Not captured,Not captured,,,Not captured,Not captured,Not captured,Not captured,6 Maureen Drive,,Mount Sinai,New York,11766,,,Not captured,Not captured,matt.savona@gmail.com,Not captured,802044899,,Not captured,Not captured,Not captured,Not captured,Not captured,Not captured,
Not captured,Not captured,01/26/2020,Not captured,Not captured,863949,020,00072,ARS-02-0054671,Beacon America,Not captured,Not captured,Not captured,,,,Lumia,Margaret,E,11/07/1974,female,Not captured,Not captured,Not captured,Not captured,Not captured,Not captured,Not captured,Not captured,Not captured,Not captured,Not captured,Not captured,Not captured,,,Not captured,Not captured,Not captured,Not captured,5 meadowview dr,,Cranbury,New Jersey,08512,,,Not captured,Not captured,ml_0803@yahoo.com,Not captured,802044898,,Not captured,Not captured,Not captured,Not captured,Not captured,Not captured,
Not captured,Not captured,01/26/2020,Not captured,Not captured,863949,020,00072,ARS-01-0054670,Beacon International,Not captured,Not captured,Not captured,Passport(94521399),,,Medina Pizarro,German Alonso,A,05/25/1978,male,Not captured,Not captured,Not captured,Not captured,Not captured,Not captured,Not captured,Not captured,Not captured,Not captured,Not captured,Not captured,Not captured,Hugo Mario Medina Pizarro,Brother,Not captured,Not captured,Not captured,Not captured,calle 20 121-234,,cali,Valle del Cauca,760032,573165225105,573165225105,Not captured,Not captured,admin@cnx.co,Not captured,802044897,,Not captured,Not captured,Not captured,Not captured,Not captured,Not captured,
Not captured,Not captured,01/25/2020,Not captured,Not captured,863949,020,00072,ARS-02-0054668,Beacon America,Not captured,Not captured,Not captured,,,,COLMENARES VELASQUEZ,MIRANDA,,05/03/2011,female,Not captured,Not captured,Not captured,Not captured,Not captured,Not captured,Not captured,Not captured,Not captured,Not captured,Not captured,Not captured,Not captured,ALBERTO VELASQUEZ,Padre,Not captured,Not captured,Not captured,Not captured,URBANIZACION LOMA DORADA APTO 10-D PORLAMAR,,MARGARITA,Nueva Esparta,6301,+584123566806,,Not captured,Not captured,sofiamichellevc30@hotmail.com,Not captured,802044895,,Not captured,Not captured,Not captured,Not captured,Not captured,Not captured,
Not captured,Not captured,01/25/2020,Not captured,Not captured,863949,020,00072,ARS-02-0054667,Beacon America,Not captured,Not captured,Not captured,,,,COLMENARES,ARMANDO,,04/18/1969,male,Not captured,Not captured,Not captured,Not captured,Not captured,Not captured,Not captured,Not captured,Not captured,Not captured,Not captured,Not captured,Not captured,ALBERTO VELASQUEZ,Padre,Not captured,Not captured,Not captured,Not captured,URBANIZACION LOMA DORADA APTO 10-D PORLAMAR,,MARGARITA,Nueva Esparta,6301,+584123566806,,Not captured,Not captured,sofiamichellevc30@hotmail.com,Not captured,802044894,,Not captured,Not captured,Not captured,Not captured,Not captured,Not captured,
Not captured,Not captured,01/25/2020,Not captured,Not captured,863949,020,00072,ARS-02-0054666,Beacon America,Not captured,Not captured,Not captured,Passport(142868443),,,VELASQUEZ,SOFIA,,04/30/1974,female,Not captured,Not captured,Not captured,Not captured,Not captured,Not captured,Not captured,Not captured,Not captured,Not captured,Not captured,Not captured,Not captured,ALBERTO VELASQUEZ,Padre,Not captured,Not captured,Not captured,Not captured,URBANIZACION LOMA DORADA APTO 10-D PORLAMAR,,MARGARITA,Nueva Esparta,6301,+584123566806,,Not captured,Not captured,sofiamichellevc30@hotmail.com,Not captured,802044893,,Not captured,Not captured,Not captured,Not captured,Not captured,Not captured,
Not captured,Not captured,01/25/2020,Not captured,Not captured,863949,020,00072,ARS-02-0054665,Beacon America,Not captured,Not captured,Not captured,,,,Ball,Alyssa,M,08/14/1995,female,Not captured,Not captured,Not captured,Not captured,Not captured,Not captured,Not captured,Not captured,Not captured,Not captured,Not captured,Not captured,Not captured,,,Not captured,Not captured,Not captured,Not captured,Box 989,,Castor,Alberta,T0C0X0,,,Not captured,Not captured,alyssamegan.ball@gmail.com,Not captured,802044892,,Not captured,Not captured,Not captured,Not captured,Not captured,Not captured,
Not captured,Not captured,01/25/2020,Not captured,Not captured,863949,020,00072,ARS-02-0054664,Beacon America,Not captured,Not captured,Not captured,,,,Nibourg,Lucas,B,01/10/1994,male,Not captured,Not captured,Not captured,Not captured,Not captured,Not captured,Not captured,Not captured,Not captured,Not captured,Not captured,Not captured,Not captured,,,Not captured,Not captured,Not captured,Not captured,Box 989,,Castor,Alberta,T0C0X0,,,Not captured,Not captured,alyssamegan.ball@gmail.com,Not captured,802044891,,Not captured,Not captured,Not captured,Not captured,Not captured,Not captured,
Not captured,Not captured,01/25/2020,Not captured,Not captured,863949,020,00072,ARS-01-0054663,Beacon International,Not captured,Not captured,Not captured,,,,Peng,Chingju,,07/03/1982,female,Not captured,Not captured,Not captured,Not captured,Not captured,Not captured,Not captured,Not captured,Not captured,Not captured,Not captured,Not captured,Not captured,,,Not captured,Not captured,Not captured,Not captured,1520 Southwest Expy,,San Jose,California,95126,,,Not captured,Not captured,karmenpeng.us@gmail.com,Not captured,802044890,,Not captured,Not captured,Not captured,Not captured,Not captured,Not captured,
Not captured,Not captured,01/26/2020,Not captured,Not captured,863949,020,00072,ARS-01-0054662,Beacon International,Not captured,Not captured,Not captured,Passport(566466759),,,Hardesty,Michelle,T,01/14/1995,female,Not captured,Not captured,Not captured,Not captured,Not captured,Not captured,Not captured,Not captured,Not captured,Not captured,Not captured,Not captured,Not captured,Theresa Hardesty,Sister,Not captured,Not captured,Not captured,Not captured,3332 magnolia,,Long Beach,California,90806,5624289548,,Not captured,Not captured,h.michelle777@gmail.com,Not captured,802044889,,Not captured,Not captured,Not captured,Not captured,Not captured,Not captured,
Not captured,Not captured,01/25/2020,Not captured,Not captured,863949,020,00072,ARS-02-0054661,Beacon America,Not captured,Not captured,Not captured,,,,Bliven,Julie,A,03/05/1962,female,Not captured,Not captured,Not captured,Not captured,Not captured,Not captured,Not captured,Not captured,Not captured,Not captured,Not captured,Not captured,Not captured,,,Not captured,Not captured,Not captured,Not captured,9533 Yosemite Rd,,Bloomington,Minnesota,55437,,,Not captured,Not captured,julieb-1962@comcast.net,Not captured,802044888,,Not captured,Not captured,Not captured,Not captured,Not captured,Not captured,
Not captured,Not captured,01/25/2020,Not captured,Not captured,863949,020,00072,ARS-01-0054647,Beacon International,Not captured,Not captured,Not captured,Passport(643914965),,,Fritz,Michael,V,05/04/1982,male,Not captured,Not captured,Not captured,Not captured,Not captured,Not captured,Not captured,Not captured,Not captured,Not captured,Not captured,Not captured,Not captured,Ed Fritz,Father,Not captured,Not captured,Not captured,Not captured,252 Abigail Ct,,Rock Hill,South Carolina,29730,8039848005,,Not captured,Not captured,sparkyfritz@yahoo.com,Not captured,802044871,,Not captured,Not captured,Not captured,Not captured,Not captured,Not captured,
Not captured,Not captured,01/26/2020,Not captured,Not captured,863949,020,00072,ARS-01-0054639,Beacon International,Not captured,Not captured,Not captured,Passport(B01142157),,,Mendez Palomo,Miguel Antonio,,05/10/1966,male,Not captured,Not captured,Not captured,Not captured,Not captured,Not captured,Not captured,Not captured,Not captured,Not captured,Not captured,Not captured,Not captured,,,Not captured,Not captured,Not captured,Not captured,2425 Wilson Blvd Suite 350,,Arlington,Virginia,22201,7038415641,,Not captured,Not captured,pamruthkumar@ncsc.org,Not captured,802044863,,Not captured,Not captured,Not captured,Not captured,Not captured,Not captured,
Not captured,Not captured,01/26/2020,Not captured,Not captured,863949,020,00072,ARS-01-0054638,Beacon International,Not captured,Not captured,Not captured,Passport(B00227545),,,Sandoval Rosales,Rommell Ismael,,09/11/1968,male,Not captured,Not captured,Not captured,Not captured,Not captured,Not captured,Not captured,Not captured,Not captured,Not captured,Not captured,Not captured,Not captured,,,Not captured,Not captured,Not captured,Not captured,2425 Wilson Blvd Suite 350,,Arlington,Virginia,22201,7038415641,,Not captured,Not captured,pamruthkumar@ncsc.org,Not captured,802044862,,Not captured,Not captured,Not captured,Not captured,Not captured,Not captured,
Not captured,Not captured,01/26/2020,Not captured,Not captured,863949,020,00072,ARS-01-0054637,Beacon International,Not captured,Not captured,Not captured,,,,Murillo,Reginaldo,,11/28/1951,male,Not captured,Not captured,Not captured,Not captured,Not captured,Not captured,Not captured,Not captured,Not captured,Not captured,Not captured,Not captured,Not captured,Pedro Lobo,Amizade,Not captured,Not captured,Not captured,Not captured,Rua Afonso Baldaia 755 Bloco A,,Porto,Porto,4150-017,00351912915819,,Not captured,Not captured,p.lobo.am@gmail.com,Not captured,802044861,,Not captured,Not captured,Not captured,Not captured,Not captured,Not captured,
Not captured,Not captured,01/26/2020,Not captured,Not captured,863949,020,00072,ARS-01-0054636,Beacon International,Not captured,Not captured,Not captured,Passport(FR835436),,,Lobo Filho,Pedro,Souza,08/22/1952,male,Not captured,Not captured,Not captured,Not captured,Not captured,Not captured,Not captured,Not captured,Not captured,Not captured,Not captured,Not captured,Not captured,Pedro Lobo,Amizade,Not captured,Not captured,Not captured,Not captured,Rua Afonso Baldaia 755 Bloco A,,Porto,Porto,4150-017,00351912915819,,Not captured,Not captured,p.lobo.am@gmail.com,Not captured,802044860,,Not captured,Not captured,Not captured,Not captured,Not captured,Not captured,
Not captured,Not captured,01/24/2020,Not captured,Not captured,863949,020,00072,ARS-01-0054635,Beacon International,Not captured,Not captured,Not captured,,,,Kempske,Rebekah,,02/19/1997,female,Not captured,Not captured,Not captured,Not captured,Not captured,Not captured,Not captured,Not captured,Not captured,Not captured,Not captured,Not captured,Not captured,,,Not captured,Not captured,Not captured,Not captured,4428 Camellia Road,,Baltimore,Maryland,21236,,,Not captured,Not captured,kempske@verizon.net,Not captured,802044859,,Not captured,Not captured,Not captured,Not captured,Not captured,Not captured,
Not captured,Not captured,01/24/2020,Not captured,Not captured,863949,020,00072,ARS-01-0054634,Beacon International,Not captured,Not captured,Not captured,,,,Kempske,Jacob,,08/08/1995,male,Not captured,Not captured,Not captured,Not captured,Not captured,Not captured,Not captured,Not captured,Not captured,Not captured,Not captured,Not captured,Not captured,,,Not captured,Not captured,Not captured,Not captured,4428 Camellia Road,,Baltimore,Maryland,21236,,,Not captured,Not captured,kempske@verizon.net,Not captured,802044858,,Not captured,Not captured,Not captured,Not captured,Not captured,Not captured,
Not captured,Not captured,01/26/2020,Not captured,Not captured,863949,020,00072,ARS-01-0054632,Beacon International,Not captured,Not captured,Not captured,,,,Lieber,Yehoshua,,04/24/1999,male,Not captured,Not captured,Not captured,Not captured,Not captured,Not captured,Not captured,Not captured,Not captured,Not captured,Not captured,Not captured,Not captured,Miriam Lieber,Mother,Not captured,Not captured,Not captured,Not captured,685 e2nd street,,Brooklyn,New York,11218,17188530722,,Not captured,Not captured,Shealieber685@gmail.com,Not captured,802044856,,Not captured,Not captured,Not captured,Not captured,Not captured,Not captured,
Not captured,Not captured,01/24/2020,Not captured,Not captured,863949,020,00072,ARS-01-0054631,Beacon International,Not captured,Not captured,Not captured,,,,Boon,Xiang Ying Rebecca,,03/13/1986,female,Not captured,Not captured,Not captured,Not captured,Not captured,Not captured,Not captured,Not captured,Not captured,Not captured,Not captured,Not captured,Not captured,,,Not captured,Not captured,Not captured,Not captured,5101 Beech St,,Bellaire,Texas,77401,,,Not captured,Not captured,toffeebean@gmail.com,Not captured,802044855,,Not captured,Not captured,Not captured,Not captured,Not captured,Not captured,
Not captured,Not captured,01/26/2020,Not captured,Not captured,863949,020,00072,ARS-01-0054630,Beacon International,Not captured,Not captured,Not captured,Passport(HH564365),,,Spira ,Aron ,,07/13/1999,male,Not captured,Not captured,Not captured,Not captured,Not captured,Not captured,Not captured,Not captured,Not captured,Not captured,Not captured,Not captured,Not captured,Moshe spira ,Fader ,Not captured,Not captured,Not captured,Not captured,5684 ru&apos; Jeanne-Mance,,Montreal,Quebec,H2v 4k6 ,+1516 418 3155,,Not captured,Not captured,aronmtl36@gmail.com,Not captured,802044854,,Not captured,Not captured,Not captured,Not captured,Not captured,Not captured,
Not captured,Not captured,01/26/2020,Not captured,Not captured,863949,020,00072,ARS-01-0054629,Beacon International,Not captured,Not captured,Not captured,Passport(530293457),,,Lax,Dovy,,04/03/1998,male,Not captured,Not captured,Not captured,Not captured,Not captured,Not captured,Not captured,Not captured,Not captured,Not captured,Not captured,Not captured,Not captured,Miriam Lax,Mother,Not captured,Not captured,Not captured,Not captured,75 Crest CT.,,Monsey,New York,10952,8453567956,,Not captured,Not captured,dovylax@gmail.com,Not captured,802044853,,Not captured,Not captured,Not captured,Not captured,Not captured,Not captured,
Not captured,Not captured,01/23/2020,Not captured,Not captured,863949,020,00072,ARS-02-0054628,Beacon America,Not captured,Not captured,Not captured,,,,Bineth,Isaac,,11/09/2018,male,Not captured,Not captured,Not captured,Not captured,Not captured,Not captured,Not captured,Not captured,Not captured,Not captured,Not captured,Not captured,Not captured,,,Not captured,Not captured,Not captured,Not captured,18 Grove Dr.,,Lakewood,New Jersey,08701,7325349616,,Not captured,Not captured,dovbineth@gmail.com,Not captured,802044852,,Not captured,Not captured,Not captured,Not captured,Not captured,Not captured,
Not captured,Not captured,01/23/2020,Not captured,Not captured,863949,020,00072,ARS-02-0054627,Beacon America,Not captured,Not captured,Not captured,,,,Bineth,Chaim,,11/09/2015,male,Not captured,Not captured,Not captured,Not captured,Not captured,Not captured,Not captured,Not captured,Not captured,Not captured,Not captured,Not captured,Not captured,,,Not captured,Not captured,Not captured,Not captured,18 Grove Dr.,,Lakewood,New Jersey,08701,7325349616,,Not captured,Not captured,dovbineth@gmail.com,Not captured,802044851,,Not captured,Not captured,Not captured,Not captured,Not captured,Not captured,
Not captured,Not captured,01/23/2020,Not captured,Not captured,863949,020,00072,ARS-02-0054626,Beacon America,Not captured,Not captured,Not captured,,,,Bineth,Rachel,,03/13/1987,female,Not captured,Not captured,Not captured,Not captured,Not captured,Not captured,Not captured,Not captured,Not captured,Not captured,Not captured,Not captured,Not captured,,,Not captured,Not captured,Not captured,Not captured,18 Grove Dr.,,Lakewood,New Jersey,08701,7325349616,,Not captured,Not captured,dovbineth@gmail.com,Not captured,802044850,,Not captured,Not captured,Not captured,Not captured,Not captured,Not captured,
Not captured,Not captured,01/23/2020,Not captured,Not captured,863949,020,00072,ARS-02-0054625,Beacon America,Not captured,Not captured,Not captured,,,,Bineth,Dov,,10/03/1986,male,Not captured,Not captured,Not captured,Not captured,Not captured,Not captured,Not captured,Not captured,Not captured,Not captured,Not captured,Not captured,Not captured,,,Not captured,Not captured,Not captured,Not captured,18 Grove Dr.,,Lakewood,New Jersey,08701,7325349616,,Not captured,Not captured,dovbineth@gmail.com,Not captured,802044849,,Not captured,Not captured,Not captured,Not captured,Not captured,Not captured,
Not captured,Not captured,01/26/2020,Not captured,Not captured,863949,020,00072,ARS-01-0054624,Beacon International,Not captured,Not captured,Not captured,Passport(646428614),,,lauber,shmuel,z,06/02/1997,male,Not captured,Not captured,Not captured,Not captured,Not captured,Not captured,Not captured,Not captured,Not captured,Not captured,Not captured,Not captured,Not captured,sarah lauber,mother,Not captured,Not captured,Not captured,Not captured,1913 59th street,,brooklyn,,11204,9292358622,,Not captured,Not captured,shmilylauber@gmail.com,Not captured,802044848,,Not captured,Not captured,Not captured,Not captured,Not captured,Not captured,
Not captured,Not captured,01/26/2020,Not captured,Not captured,863949,020,00072,ARS-01-0054623,Beacon International,Not captured,Not captured,Not captured,,,,Mermelstein,Abraham,,09/27/1999,male,Not captured,Not captured,Not captured,Not captured,Not captured,Not captured,Not captured,Not captured,Not captured,Not captured,Not captured,Not captured,Not captured,Benjamin Mermelstein,Brother,Not captured,Not captured,Not captured,Not captured,72 Francis place,,Spring Valley,,10977,9293908456,,Not captured,Not captured,amermel6@gmail.com,Not captured,802044847,,Not captured,Not captured,Not captured,Not captured,Not captured,Not captured,
Not captured,Not captured,01/24/2020,Not captured,Not captured,863949,020,00072,ARS-02-0054622,Beacon America,Not captured,Not captured,Not captured,Passport(FF771919),,,Tarapova,Olena,,02/13/1953,female,Not captured,Not captured,Not captured,Not captured,Not captured,Not captured,Not captured,Not captured,Not captured,Not captured,Not captured,Not captured,Not captured,NADIA O POSTUPNA,daughter,Not captured,Not captured,Not captured,Not captured,2603 78th ave ne,,Medina,WA,98039,4254430564,,Not captured,Not captured,NADIA.POSTUPNA@GMAIL.COM,Not captured,802044846,,Not captured,Not captured,Not captured,Not captured,Not captured,Not captured,
Not captured,Not captured,01/25/2020,Not captured,Not captured,863949,020,00072,ARS-02-0054620,Beacon America,Not captured,Not captured,Not captured,Passport(EH485961),,,Postupniy,Oleksandr,,10/16/1946,male,Not captured,Not captured,Not captured,Not captured,Not captured,Not captured,Not captured,Not captured,Not captured,Not captured,Not captured,Not captured,Not captured,NADIA O POSTUPNA,daughter,Not captured,Not captured,Not captured,Not captured,2603 78th ave NE,,Medina,Washington,98039,4254430564,,Not captured,Not captured,nadia.postupna@gmail.com,Not captured,802044844,,Not captured,Not captured,Not captured,Not captured,Not captured,Not captured,
Not captured,Not captured,01/23/2020,Not captured,Not captured,863949,020,00072,ARS-01-0054619,Beacon International,Not captured,Not captured,Not captured,,,,Pagel,Cathleen,A,10/15/1948,female,Not captured,Not captured,Not captured,Not captured,Not captured,Not captured,Not captured,Not captured,Not captured,Not captured,Not captured,Not captured,Not captured,,,Not captured,Not captured,Not captured,Not captured,6325 Devonshire Ln,,Sun Prairie,Wisconsin,53590,,,Not captured,Not captured,bcpagel@gmail.com,Not captured,802044843,,Not captured,Not captured,Not captured,Not captured,Not captured,Not captured,
Not captured,Not captured,01/23/2020,Not captured,Not captured,863949,020,00072,ARS-01-0054618,Beacon International,Not captured,Not captured,Not captured,,,,Pagel,Brion,B,01/09/1946,male,Not captured,Not captured,Not captured,Not captured,Not captured,Not captured,Not captured,Not captured,Not captured,Not captured,Not captured,Not captured,Not captured,,,Not captured,Not captured,Not captured,Not captured,6325 Devonshire Ln,,Sun Prairie,Wisconsin,53590,,,Not captured,Not captured,bcpagel@gmail.com,Not captured,802044842,,Not captured,Not captured,Not captured,Not captured,Not captured,Not captured,