EE Transaction Type,Dependent Transaction Type,Effective Date,EE Signature,EE Signature Date,Control,Suffix,Account,Plan Number,Plan Name,Claim Office,Network ID Number,Customer Code,EE SSN,Dependent SSN,Dependent Relationship,Last Name,First Name,Middle Initial,DOB,Gender,Ethnicity,PCP/PCD,PCP/PCD Current Patient,Provider Cap Office Number,COB,Dep Student Indicator,Dep OOA Indicator,EE Prior Coverage Indicator,EE Late Entrant,EE Language Indicator,Hire Date,Earnings,Earnings Frequency,Beneficiary (Last Name First Name MI),Beneficiary Relationship,Continuation of Coverage Expiration Date,Continuation of Coverage Event Date,Continuation of Coverage Length of Coverage,Work Location Zip Code,Street Address Line 1,Street Address Line 2,City,State,Zip Code,Home Phone Number,Work Phone Number,Accept Code,Evidence Code,EE Email Address,Communication Disability Code,EE Alternate ID,Dep Alternate ID,Old Control,Old Suffix,Old Account,New Control,New Suffix,New Account,
Not captured,Not captured,01/13/2020,Not captured,Not captured,863949,020,00072,ARS-01-0054422,Beacon International,Not captured,Not captured,Not captured,,,,Zeldin,Randy,,06/05/1954,male,Not captured,Not captured,Not captured,Not captured,Not captured,Not captured,Not captured,Not captured,Not captured,Not captured,Not captured,Not captured,Not captured,,,Not captured,Not captured,Not captured,Not captured,20967 SOLANO WAY,,Boca Raton,Florida,33434,,,Not captured,Not captured,rzeldin@gmail.com,Not captured,802044417,,Not captured,Not captured,Not captured,Not captured,Not captured,Not captured,
Not captured,Not captured,01/13/2020,Not captured,Not captured,863949,020,00072,ARS-01-0054415,Beacon International,Not captured,Not captured,Not captured,,,,Doctor,Ken,,01/05/1950,male,Not captured,Not captured,Not captured,Not captured,Not captured,Not captured,Not captured,Not captured,Not captured,Not captured,Not captured,Not captured,Not captured,,,Not captured,Not captured,Not captured,Not captured,3470 Haas Drive,,Aptos,California,95003,,,Not captured,Not captured,kdoctor@gmail.com,Not captured,802044410,,Not captured,Not captured,Not captured,Not captured,Not captured,Not captured,
Not captured,Not captured,01/12/2020,Not captured,Not captured,863949,020,00072,ARS-01-0054414,Beacon International,Not captured,Not captured,Not captured,,,,Ouedraogo,Moussa,Y,08/13/1984,male,Not captured,Not captured,Not captured,Not captured,Not captured,Not captured,Not captured,Not captured,Not captured,Not captured,Not captured,Not captured,Not captured,,,Not captured,Not captured,Not captured,Not captured,15 BP 15 Ouaga,,Ouagadougou,,15,,,Not captured,Not captured,cpoonwah@safer-access.com,Not captured,802044409,,Not captured,Not captured,Not captured,Not captured,Not captured,Not captured,
Not captured,Not captured,01/12/2020,Not captured,Not captured,863949,020,00072,ARS-01-0054413,Beacon International,Not captured,Not captured,Not captured,,,,Field,Bernadette,,11/20/1968,female,Not captured,Not captured,Not captured,Not captured,Not captured,Not captured,Not captured,Not captured,Not captured,Not captured,Not captured,Not captured,Not captured,,,Not captured,Not captured,Not captured,Not captured,2300 Maple Ave #214,,Torrance,California,90503,,,Not captured,Not captured,jrfield@gmail.com,Not captured,802044408,,Not captured,Not captured,Not captured,Not captured,Not captured,Not captured,
Not captured,Not captured,01/12/2020,Not captured,Not captured,863949,020,00072,ARS-01-0054412,Beacon International,Not captured,Not captured,Not captured,,,,Tornillo,Vincent,J,06/14/1960,male,Not captured,Not captured,Not captured,Not captured,Not captured,Not captured,Not captured,Not captured,Not captured,Not captured,Not captured,Not captured,Not captured,,,Not captured,Not captured,Not captured,Not captured,14650 West Bates Place,,Lakewood,Colorado,80228,,,Not captured,Not captured,vincetornillo@comcast.net,Not captured,802044407,,Not captured,Not captured,Not captured,Not captured,Not captured,Not captured,
Not captured,Not captured,01/12/2020,Not captured,Not captured,863949,020,00072,OVI-28-0054410,OverseasCare Visitors Insurance Plan,Not captured,Not captured,Not captured,Passport(M2858874),,,Deshpande,Sudhakar ,V,04/16/1937,male,Not captured,Not captured,Not captured,Not captured,Not captured,Not captured,Not captured,Not captured,Not captured,Not captured,Not captured,Not captured,Not captured,Prasad Deshpande,Son,Not captured,Not captured,Not captured,Not captured,13026 Dartmore Ave,,Alpharetta,Georgia,30005,6785282695,7202896786,Not captured,Not captured,sripsd@gmail.com,Not captured,802044403,,Not captured,Not captured,Not captured,Not captured,Not captured,Not captured,
Not captured,Not captured,01/13/2020,Not captured,Not captured,863949,020,00072,ARS-02-0054409,Beacon America,Not captured,Not captured,Not captured,Passport(M20547652),,,Kim,Soon Ja,,09/24/1961,female,Not captured,Not captured,Not captured,Not captured,Not captured,Not captured,Not captured,Not captured,Not captured,Not captured,Not captured,Not captured,Not captured,Sara Ryu,Daughter,Not captured,Not captured,Not captured,Not captured,17250 BLOOMING FIELDS DR,,Land o Lakes,Florida,34638,8134264342,,Not captured,Not captured,sharyu87@gmail.com,Not captured,802044402,,Not captured,Not captured,Not captured,Not captured,Not captured,Not captured,
Not captured,Not captured,01/11/2020,Not captured,Not captured,863949,020,00072,ARS-01-0054408,Beacon International,Not captured,Not captured,Not captured,,,,Mainayar,David,J,07/16/1999,male,Not captured,Not captured,Not captured,Not captured,Not captured,Not captured,Not captured,Not captured,Not captured,Not captured,Not captured,Not captured,Not captured,,,Not captured,Not captured,Not captured,Not captured,44988 Bouchaine St,,Temecula,California,92592,,,Not captured,Not captured,ddmainayar@gmail.com,Not captured,802044384,,Not captured,Not captured,Not captured,Not captured,Not captured,Not captured,
Not captured,Not captured,01/13/2020,Not captured,Not captured,863949,020,00072,ARS-01-0054407,Beacon International,Not captured,Not captured,Not captured,Passport(544949516),,,Konrad,Erika,J,07/18/1990,female,Not captured,Not captured,Not captured,Not captured,Not captured,Not captured,Not captured,Not captured,Not captured,Not captured,Not captured,Not captured,Not captured,Terry Konrad,Mother,Not captured,Not captured,Not captured,Not captured,123 Melrose Street,,Brooklyn,New York,11206,860-933-6331,646-477-7746,Not captured,Not captured,erika.konrad@off---white.com,Not captured,802044383,,Not captured,Not captured,Not captured,Not captured,Not captured,Not captured,
Not captured,Not captured,01/13/2020,Not captured,Not captured,863949,020,00072,ARS-01-0054406,Beacon International,Not captured,Not captured,Not captured,Passport(567012899),,,Randolph,Amanda,L,09/26/1990,female,Not captured,Not captured,Not captured,Not captured,Not captured,Not captured,Not captured,Not captured,Not captured,Not captured,Not captured,Not captured,Not captured,Hope Randolph,Mother ,Not captured,Not captured,Not captured,Not captured,70 Woodbriar Drive,,Rochester,New York,14616,+86 17792727448,,Not captured,Not captured,icnhmchinagirl@gmail.com,Not captured,802044382,,Not captured,Not captured,Not captured,Not captured,Not captured,Not captured,
Not captured,Not captured,01/11/2020,Not captured,Not captured,863949,020,00072,ARS-01-0054405,Beacon International,Not captured,Not captured,Not captured,,,,Jamison,Anne,S,02/05/1991,female,Not captured,Not captured,Not captured,Not captured,Not captured,Not captured,Not captured,Not captured,Not captured,Not captured,Not captured,Not captured,Not captured,,,Not captured,Not captured,Not captured,Not captured,301 Norris Court,,Madison,Wisconsin,53703,,,Not captured,Not captured,asj2591@gmail.com,Not captured,802044381,,Not captured,Not captured,Not captured,Not captured,Not captured,Not captured,
Not captured,Not captured,01/11/2020,Not captured,Not captured,863949,020,00072,ARS-01-0054404,Beacon International,Not captured,Not captured,Not captured,,,,Hoffman,Irene Happie,D,11/19/1991,female,Not captured,Not captured,Not captured,Not captured,Not captured,Not captured,Not captured,Not captured,Not captured,Not captured,Not captured,Not captured,Not captured,,,Not captured,Not captured,Not captured,Not captured,239 e 27th place,,Tulsa,Oklahoma,74114,,,Not captured,Not captured,happiehoffman@gmail.com,Not captured,802044380,,Not captured,Not captured,Not captured,Not captured,Not captured,Not captured,
Not captured,Not captured,01/11/2020,Not captured,Not captured,863949,020,00072,ARS-01-0054402,Beacon International,Not captured,Not captured,Not captured,,,,Ferguson,Linda,,11/02/1955,female,Not captured,Not captured,Not captured,Not captured,Not captured,Not captured,Not captured,Not captured,Not captured,Not captured,Not captured,Not captured,Not captured,linda ferguson,spouse,Not captured,Not captured,Not captured,Not captured,9503 West rd,,Redwood Valley,California,95470,7072725589,,Not captured,Not captured,fergusonrodger@gmail.com,Not captured,802044377,,Not captured,Not captured,Not captured,Not captured,Not captured,Not captured,
Not captured,Not captured,01/11/2020,Not captured,Not captured,863949,020,00072,ARS-01-0054401,Beacon International,Not captured,Not captured,Not captured,Passport(538767441),,,Ferguson,Rodger,,11/16/1958,male,Not captured,Not captured,Not captured,Not captured,Not captured,Not captured,Not captured,Not captured,Not captured,Not captured,Not captured,Not captured,Not captured,linda ferguson,spouse,Not captured,Not captured,Not captured,Not captured,9503 West rd,,Redwood Valley,California,95470,7072725589,,Not captured,Not captured,fergusonrodger@gmail.com,Not captured,802044376,,Not captured,Not captured,Not captured,Not captured,Not captured,Not captured,
Not captured,Not captured,01/13/2020,Not captured,Not captured,863949,020,00072,OVI-28-0054400,OverseasCare Visitors Insurance Plan,Not captured,Not captured,Not captured,Passport(T8334705),,,MOHANASUNDARAM,NIRMALADEVI,,04/12/1968,female,Not captured,Not captured,Not captured,Not captured,Not captured,Not captured,Not captured,Not captured,Not captured,Not captured,Not captured,Not captured,Not captured,,,Not captured,Not captured,Not captured,Not captured,2903 SW MAPLE RD,,BENTONVILLE,Arkansas,72713,4792248787,,Not captured,Not captured,GOKILA90@GMAIL.COM,Not captured,802044375,,Not captured,Not captured,Not captured,Not captured,Not captured,Not captured,
Not captured,Not captured,01/12/2020,Not captured,Not captured,863949,020,00072,ARS-01-0054399,Beacon International,Not captured,Not captured,Not captured,Passport(HB668879),,,Simon,Rebecca,,05/27/1974,female,Not captured,Not captured,Not captured,Not captured,Not captured,Not captured,Not captured,Not captured,Not captured,Not captured,Not captured,Not captured,Not captured,Kathy Woods,Mother,Not captured,Not captured,Not captured,Not captured,1615 Broad Ripple Avenue,,Indianapolis,Indiana,46220,(317) 919-4555,,Not captured,Not captured,becinindy@hotmail.com,Not captured,802044374,,Not captured,Not captured,Not captured,Not captured,Not captured,Not captured,
Not captured,Not captured,01/13/2020,Not captured,Not captured,863949,020,00072,ARS-01-0054395,Beacon International,Not captured,Not captured,Not captured,,,,Brown,Duane,,11/17/1992,male,Not captured,Not captured,Not captured,Not captured,Not captured,Not captured,Not captured,Not captured,Not captured,Not captured,Not captured,Not captured,Not captured,omari brown,son,Not captured,Not captured,Not captured,Not captured,4325 W Rome Blvd,,North Las Vegas,,89084,2295392429,,Not captured,Not captured,duane.brown23@yahoo.com,Not captured,802044361,,Not captured,Not captured,Not captured,Not captured,Not captured,Not captured,
Not captured,Not captured,01/10/2020,Not captured,Not captured,863949,020,00072,ARS-02-0054394,Beacon America,Not captured,Not captured,Not captured,,,,Gestetner,Fraydee,,06/04/2019,female,Not captured,Not captured,Not captured,Not captured,Not captured,Not captured,Not captured,Not captured,Not captured,Not captured,Not captured,Not captured,Not captured,,,Not captured,Not captured,Not captured,Not captured,112 Vine Ave,,Lakewood,New Jersey,08701,631-245-7617,,Not captured,Not captured,boruchgestetner@gmail.com,Not captured,802044360,,Not captured,Not captured,Not captured,Not captured,Not captured,Not captured,
Not captured,Not captured,01/10/2020,Not captured,Not captured,863949,020,00072,ARS-02-0054393,Beacon America,Not captured,Not captured,Not captured,,,,Gestetner,Esther ,,01/12/1984,female,Not captured,Not captured,Not captured,Not captured,Not captured,Not captured,Not captured,Not captured,Not captured,Not captured,Not captured,Not captured,Not captured,,,Not captured,Not captured,Not captured,Not captured,112 Vine Ave,,Lakewood,New Jersey,08701,631-245-7617,,Not captured,Not captured,boruchgestetner@gmail.com,Not captured,802044359,,Not captured,Not captured,Not captured,Not captured,Not captured,Not captured,
Not captured,Not captured,01/11/2020,Not captured,Not captured,863949,020,00072,ARS-36-0054391,Beacon Student Elite,Not captured,Not captured,Not captured,Passport(144896950),,,Zambrano,Jose ,G,04/28/1997,male,Not captured,Not captured,Not captured,Not captured,Not captured,Not captured,Not captured,Not captured,Not captured,Not captured,Not captured,Not captured,Not captured,Jhoel Zambrano,Father,Not captured,Not captured,Not captured,Not captured,Torre 5Apt. Pb4 4. Res. Los Portales,,Barcelona,Anzoategui,0000,7866302215,,Not captured,Not captured,nancyjramirez15@gmail.com,Not captured,802044357,,Not captured,Not captured,Not captured,Not captured,Not captured,Not captured,
Not captured,Not captured,01/11/2020,Not captured,Not captured,863949,020,00072,ARS-02-0054390,Beacon America,Not captured,Not captured,Not captured,Passport(057770426),,,Castaneda ,Jair Elizabeth,,08/24/1974,female,Not captured,Not captured,Not captured,Not captured,Not captured,Not captured,Not captured,Not captured,Not captured,Not captured,Not captured,Not captured,Not captured,Fernan Gabriel Gonzalez ,Conyuge,Not captured,Not captured,Not captured,Not captured,calle 14 nro 21-81,,SAN CRISTOBAL,Tachira,5001,(414) 706-9647,,Not captured,Not captured,oficinafg2011@hotmail.com,Not captured,802044356,,Not captured,Not captured,Not captured,Not captured,Not captured,Not captured,
Not captured,Not captured,01/10/2020,Not captured,Not captured,863949,020,00072,ARS-01-0054389,Beacon International,Not captured,Not captured,Not captured,,,,Nagelberg,Andrew,T,01/03/1991,male,Not captured,Not captured,Not captured,Not captured,Not captured,Not captured,Not captured,Not captured,Not captured,Not captured,Not captured,Not captured,Not captured,,,Not captured,Not captured,Not captured,Not captured,210 1st ave,,New York,New York,10009,,,Not captured,Not captured,andrewnagelberg@gmail.com,Not captured,802044355,,Not captured,Not captured,Not captured,Not captured,Not captured,Not captured,
Not captured,Not captured,01/10/2020,Not captured,Not captured,863949,020,00072,ARS-01-0054386,Beacon International,Not captured,Not captured,Not captured,,,,Fiore,Gregory,,06/19/1969,male,Not captured,Not captured,Not captured,Not captured,Not captured,Not captured,Not captured,Not captured,Not captured,Not captured,Not captured,Not captured,Not captured,,,Not captured,Not captured,Not captured,Not captured,3370 NE 190th Street Unit 2006,,Aventura,Florida,33180,,,Not captured,Not captured,fioregj@aol.com,Not captured,802044351,,Not captured,Not captured,Not captured,Not captured,Not captured,Not captured,
Not captured,Not captured,01/10/2020,Not captured,Not captured,863949,020,00072,ARS-01-0054385,Beacon International,Not captured,Not captured,Not captured,,,,Tahmasian,Michelle,N,04/10/2000,female,Not captured,Not captured,Not captured,Not captured,Not captured,Not captured,Not captured,Not captured,Not captured,Not captured,Not captured,Not captured,Not captured,,,Not captured,Not captured,Not captured,Not captured,3340 Stephens Circle,,Glendale,California,91208,,,Not captured,Not captured,michellenareh@yahoo.com,Not captured,802044350,,Not captured,Not captured,Not captured,Not captured,Not captured,Not captured,
Not captured,Not captured,01/10/2020,Not captured,Not captured,863949,020,00072,ARS-01-0054384,Beacon International,Not captured,Not captured,Not captured,,,,Mikayelyan,Lilit,,01/01/2000,female,Not captured,Not captured,Not captured,Not captured,Not captured,Not captured,Not captured,Not captured,Not captured,Not captured,Not captured,Not captured,Not captured,,,Not captured,Not captured,Not captured,Not captured,1410 Ethel St.,,Glendale,California,91207,,,Not captured,Not captured,lilitt.mikayelyan@gmail.com,Not captured,802044349,,Not captured,Not captured,Not captured,Not captured,Not captured,Not captured,
Not captured,Not captured,01/09/2020,Not captured,Not captured,863949,020,00072,ARS-02-0054382,Beacon America,Not captured,Not captured,Not captured,Passport(J0325211),,,BAROT,BHAVANABEN ,,06/01/1962,female,Not captured,Not captured,Not captured,Not captured,Not captured,Not captured,Not captured,Not captured,Not captured,Not captured,Not captured,Not captured,Not captured,APURAVA BAROT,SON,Not captured,Not captured,Not captured,Not captured,845 Paularino Avenue,,Costa Mesa,California,92626,3234401981,,Not captured,Not captured,barotapurava@gmail.com,Not captured,802044347,,Not captured,Not captured,Not captured,Not captured,Not captured,Not captured,
Not captured,Not captured,01/10/2020,Not captured,Not captured,863949,020,00072,ARS-02-0054379,Beacon America,Not captured,Not captured,Not captured,Passport(133007394),,,CUAHONTE,MARIA ANDREINA,,04/18/2001,female,Not captured,Not captured,Not captured,Not captured,Not captured,Not captured,Not captured,Not captured,Not captured,Not captured,Not captured,Not captured,Not captured,Roberto Cuahonte,Padre,Not captured,Not captured,Not captured,Not captured,URB. PALMA REAL AV. LOS JABILLOS C.R. LOMAS DEL SOL TH # 2,,Maturin,Monagas,6201,04143942121,,Not captured,Not captured,rxcuahonte@hotmail.com,Not captured,802044344,,Not captured,Not captured,Not captured,Not captured,Not captured,Not captured,
Not captured,Not captured,01/11/2020,Not captured,Not captured,863949,020,00072,ARS-01-0054378,Beacon International,Not captured,Not captured,Not captured,,,,Katz,Gitty,,12/01/1999,female,Not captured,Not captured,Not captured,Not captured,Not captured,Not captured,Not captured,Not captured,Not captured,Not captured,Not captured,Not captured,Not captured,,,Not captured,Not captured,Not captured,Not captured,149 Glenn Ave,,Lakewood,New Jersey,08701,973-800-3888,,Not captured,Not captured,heshiekatz@gmail.com,Not captured,802044343,,Not captured,Not captured,Not captured,Not captured,Not captured,Not captured,
Not captured,Not captured,01/11/2020,Not captured,Not captured,863949,020,00072,ARS-01-0054377,Beacon International,Not captured,Not captured,Not captured,,,,Katz,Heshie,,04/09/1996,male,Not captured,Not captured,Not captured,Not captured,Not captured,Not captured,Not captured,Not captured,Not captured,Not captured,Not captured,Not captured,Not captured,,,Not captured,Not captured,Not captured,Not captured,149 Glenn Ave,,Lakewood,New Jersey,08701,973-800-3888,,Not captured,Not captured,heshiekatz@gmail.com,Not captured,802044342,,Not captured,Not captured,Not captured,Not captured,Not captured,Not captured,
Not captured,Not captured,01/12/2020,Not captured,Not captured,863949,020,00072,OVI-28-0054375,OverseasCare Visitors Insurance Plan,Not captured,Not captured,Not captured,,,,NIYOGI,SUMANTA ,,02/03/1939,male,Not captured,Not captured,Not captured,Not captured,Not captured,Not captured,Not captured,Not captured,Not captured,Not captured,Not captured,Not captured,Not captured,Shil Niyogi,son,Not captured,Not captured,Not captured,Not captured,505 Ronnie Dr,,Buffalo Grove,Illinois,60089,310 780 8642,,Not captured,Not captured,shil_niyogi_ucla@yahoo.com,Not captured,802044340,,Not captured,Not captured,Not captured,Not captured,Not captured,Not captured,
Not captured,Not captured,01/13/2020,Not captured,Not captured,863949,020,00072,ARS-01-0054374,Beacon International,Not captured,Not captured,Not captured,,,,gnangadou,hassan,,05/24/1998,male,Not captured,Not captured,Not captured,Not captured,Not captured,Not captured,Not captured,Not captured,Not captured,Not captured,Not captured,Not captured,Not captured,,,Not captured,Not captured,Not captured,Not captured,1936 North Marianna Avenue,,Los Angeles,,90032,,,Not captured,Not captured,hascognang@gmail.com,Not captured,802044339,,Not captured,Not captured,Not captured,Not captured,Not captured,Not captured,
Not captured,Not captured,01/09/2020,Not captured,Not captured,863949,020,00072,ARS-01-0054370,Beacon International,Not captured,Not captured,Not captured,,,,Gentle,Frederick,J,08/03/1960,male,Not captured,Not captured,Not captured,Not captured,Not captured,Not captured,Not captured,Not captured,Not captured,Not captured,Not captured,Not captured,Not captured,,,Not captured,Not captured,Not captured,Not captured,26 Eltinge street,,Staten island,New York,10304,,,Not captured,Not captured,debgentile3@gmail.com,Not captured,802044334,,Not captured,Not captured,Not captured,Not captured,Not captured,Not captured,
Not captured,Not captured,01/09/2020,Not captured,Not captured,863949,020,00072,ARS-01-0054369,Beacon International,Not captured,Not captured,Not captured,,,,Gentile,Deborah,A,05/11/1954,female,Not captured,Not captured,Not captured,Not captured,Not captured,Not captured,Not captured,Not captured,Not captured,Not captured,Not captured,Not captured,Not captured,,,Not captured,Not captured,Not captured,Not captured,26 Eltinge street,,Staten island,New York,10304,,,Not captured,Not captured,debgentile3@gmail.com,Not captured,802044333,,Not captured,Not captured,Not captured,Not captured,Not captured,Not captured,
Not captured,Not captured,01/09/2020,Not captured,Not captured,863949,020,00072,ARS-01-0054368,Beacon International,Not captured,Not captured,Not captured,,,,Brennan,Cat,t,05/30/1993,female,Not captured,Not captured,Not captured,Not captured,Not captured,Not captured,Not captured,Not captured,Not captured,Not captured,Not captured,Not captured,Not captured,,,Not captured,Not captured,Not captured,Not captured,101 Stanton St,,New York,New York,10002,,,Not captured,Not captured,catbrennan8@gmail.com,Not captured,802044331,,Not captured,Not captured,Not captured,Not captured,Not captured,Not captured,
Not captured,Not captured,01/10/2020,Not captured,Not captured,863949,020,00072,ARS-01-0054365,Beacon International,Not captured,Not captured,Not captured,Passport(AV475842),,,MARIN,GABRIEL,A,12/21/2000,male,Not captured,Not captured,Not captured,Not captured,Not captured,Not captured,Not captured,Not captured,Not captured,Not captured,Not captured,Not captured,Not captured,,,Not captured,Not captured,Not captured,Not captured,Calle 166 # 48-21,,Bogota,,111156,3153503014,3153503014,Not captured,Not captured,hmarin@consisa.biz,Not captured,802044328,,Not captured,Not captured,Not captured,Not captured,Not captured,Not captured,
Not captured,Not captured,01/11/2020,Not captured,Not captured,863949,020,00072,ARS-02-0054363,Beacon America,Not captured,Not captured,Not captured,Passport(PA7952670),,,Whitcomb,Finley,B,12/14/1997,male,Not captured,Not captured,Not captured,Not captured,Not captured,Not captured,Not captured,Not captured,Not captured,Not captured,Not captured,Not captured,Not captured,Gabrielle Simmons,Mother,Not captured,Not captured,Not captured,Not captured,735 Ashley Road,,Montecito,California,93108,3104098903,,Not captured,Not captured,finleywhitcomb@gmail.com,Not captured,802044292,,Not captured,Not captured,Not captured,Not captured,Not captured,Not captured,