EE Transaction Type,Dependent Transaction Type,Effective Date,EE Signature,EE Signature Date,Control,Suffix,Account,Plan Number,Plan Name,Claim Office,Network ID Number,Customer Code,EE SSN,Dependent SSN,Dependent Relationship,Last Name,First Name,Middle Initial,DOB,Gender,Ethnicity,PCP/PCD,PCP/PCD Current Patient,Provider Cap Office Number,COB,Dep Student Indicator,Dep OOA Indicator,EE Prior Coverage Indicator,EE Late Entrant,EE Language Indicator,Hire Date,Earnings,Earnings Frequency,Beneficiary (Last Name First Name MI),Beneficiary Relationship,Continuation of Coverage Expiration Date,Continuation of Coverage Event Date,Continuation of Coverage Length of Coverage,Work Location Zip Code,Street Address Line 1,Street Address Line 2,City,State,Zip Code,Home Phone Number,Work Phone Number,Accept Code,Evidence Code,EE Email Address,Communication Disability Code,EE Alternate ID,Dep Alternate ID,Old Control,Old Suffix,Old Account,New Control,New Suffix,New Account,
Not captured,Not captured,12/31/2019,Not captured,Not captured,863949,020,00072,ARS-01-0054278,Beacon International,Not captured,Not captured,Not captured,,,,Fish,Samuel,,12/01/1987,male,Not captured,Not captured,Not captured,Not captured,Not captured,Not captured,Not captured,Not captured,Not captured,Not captured,Not captured,Not captured,Not captured,,,Not captured,Not captured,Not captured,Not captured,100 Dupont St. Apt. 1E,,Brooklyn,New York,11222,,,Not captured,Not captured,shf121@gmail.com,Not captured,802043865,,Not captured,Not captured,Not captured,Not captured,Not captured,Not captured,
Not captured,Not captured,12/31/2019,Not captured,Not captured,863949,020,00072,ARS-02-0054275,Beacon America,Not captured,Not captured,Not captured,,,,Kocsis,Kamilla,,11/07/1999,female,Not captured,Not captured,Not captured,Not captured,Not captured,Not captured,Not captured,Not captured,Not captured,Not captured,Not captured,Not captured,Not captured,Kamilla Kocsis,daughter,Not captured,Not captured,Not captured,Not captured,1361 Maple Terrace,,Rahway,New Jersey,07065,7326190879,,Not captured,Not captured,ancsapancsa2@gmail.com,Not captured,802043862,,Not captured,Not captured,Not captured,Not captured,Not captured,Not captured,
Not captured,Not captured,12/31/2019,Not captured,Not captured,863949,020,00072,ARS-01-0054271,Beacon International,Not captured,Not captured,Not captured,,,,O&apos;Connell,Emily,,11/09/1993,female,Not captured,Not captured,Not captured,Not captured,Not captured,Not captured,Not captured,Not captured,Not captured,Not captured,Not captured,Not captured,Not captured,,,Not captured,Not captured,Not captured,Not captured,160 n Sierra Bonita Ave,,Pasadena,California,91106,,,Not captured,Not captured,emilycoconnell93@gmail.com,Not captured,802043858,,Not captured,Not captured,Not captured,Not captured,Not captured,Not captured,
Not captured,Not captured,12/31/2019,Not captured,Not captured,863949,020,00072,ARS-01-0054270,Beacon International,Not captured,Not captured,Not captured,,,,Coonerty,Nina,R,09/17/1991,female,Not captured,Not captured,Not captured,Not captured,Not captured,Not captured,Not captured,Not captured,Not captured,Not captured,Not captured,Not captured,Not captured,,,Not captured,Not captured,Not captured,Not captured,119 Dimond Street,,Santa Cruz,California,95060,,,Not captured,Not captured,ninarcoonerty@gmail.com,Not captured,802043857,,Not captured,Not captured,Not captured,Not captured,Not captured,Not captured,
Not captured,Not captured,12/31/2019,Not captured,Not captured,863949,020,00072,ARS-01-0054269,Beacon International,Not captured,Not captured,Not captured,,,,Chan,Hay,,03/19/1958,male,Not captured,Not captured,Not captured,Not captured,Not captured,Not captured,Not captured,Not captured,Not captured,Not captured,Not captured,Not captured,Not captured,,,Not captured,Not captured,Not captured,Not captured,4207 Green Hills Circle,,Sugar Land,Texas,77479,,,Not captured,Not captured,haychan99@yahoo.com,Not captured,802043856,,Not captured,Not captured,Not captured,Not captured,Not captured,Not captured,
Not captured,Not captured,12/31/2019,Not captured,Not captured,863949,020,00072,ARS-01-0054267,Beacon International,Not captured,Not captured,Not captured,,,,Kennedy,Clare,,12/24/1988,female,Not captured,Not captured,Not captured,Not captured,Not captured,Not captured,Not captured,Not captured,Not captured,Not captured,Not captured,Not captured,Not captured,,,Not captured,Not captured,Not captured,Not captured,8310 Regents Road,,San Diego,California,92122,,,Not captured,Not captured,brook.j.tozer@gmail.com,Not captured,802043854,,Not captured,Not captured,Not captured,Not captured,Not captured,Not captured,
Not captured,Not captured,12/31/2019,Not captured,Not captured,863949,020,00072,ARS-01-0054266,Beacon International,Not captured,Not captured,Not captured,,,,Tozer,Brook,,12/24/1988,male,Not captured,Not captured,Not captured,Not captured,Not captured,Not captured,Not captured,Not captured,Not captured,Not captured,Not captured,Not captured,Not captured,,,Not captured,Not captured,Not captured,Not captured,8310 Regents Road,,San Diego,California,92122,,,Not captured,Not captured,brook.j.tozer@gmail.com,Not captured,802043853,,Not captured,Not captured,Not captured,Not captured,Not captured,Not captured,
Not captured,Not captured,12/30/2019,Not captured,Not captured,863949,020,00072,ARS-01-0054259,Beacon International,Not captured,Not captured,Not captured,,,,Stewart,Katie,J,07/18/1983,female,Not captured,Not captured,Not captured,Not captured,Not captured,Not captured,Not captured,Not captured,Not captured,Not captured,Not captured,Not captured,Not captured,,,Not captured,Not captured,Not captured,Not captured,4302 Robert Ct,,Silver Spring,Maryland,20906,,,Not captured,Not captured,katiestewart1983@gmail.com,Not captured,802043846,,Not captured,Not captured,Not captured,Not captured,Not captured,Not captured,
Not captured,Not captured,12/30/2019,Not captured,Not captured,863949,020,00072,ARS-01-0054258,Beacon International,Not captured,Not captured,Not captured,,,,Stewart,Isabelle,A,04/26/2019,female,Not captured,Not captured,Not captured,Not captured,Not captured,Not captured,Not captured,Not captured,Not captured,Not captured,Not captured,Not captured,Not captured,,,Not captured,Not captured,Not captured,Not captured,4302 Robert Ct,,Silver Spring,Maryland,20906,,,Not captured,Not captured,katiestewart1983@gmail.com,Not captured,802043845,,Not captured,Not captured,Not captured,Not captured,Not captured,Not captured,
Not captured,Not captured,12/30/2019,Not captured,Not captured,863949,020,00072,ARS-01-0054254,Beacon International,Not captured,Not captured,Not captured,,,,Coats,Anna,,08/20/1981,female,Not captured,Not captured,Not captured,Not captured,Not captured,Not captured,Not captured,Not captured,Not captured,Not captured,Not captured,Not captured,Not captured,,,Not captured,Not captured,Not captured,Not captured,5340 West Kennedy Blvd #422,,Tampa,Florida,33609,,,Not captured,Not captured,annamcoats@gmail.com,Not captured,802043838,,Not captured,Not captured,Not captured,Not captured,Not captured,Not captured,
Not captured,Not captured,12/30/2019,Not captured,Not captured,863949,020,00072,ARS-01-0054253,Beacon International,Not captured,Not captured,Not captured,,,,Jessani,Sameer,,01/08/1979,male,Not captured,Not captured,Not captured,Not captured,Not captured,Not captured,Not captured,Not captured,Not captured,Not captured,Not captured,Not captured,Not captured,,,Not captured,Not captured,Not captured,Not captured,5340 West Kennedy Blvd #422,,Tampa,Florida,33609,,,Not captured,Not captured,annamcoats@gmail.com,Not captured,802043837,,Not captured,Not captured,Not captured,Not captured,Not captured,Not captured,
Not captured,Not captured,12/30/2019,Not captured,Not captured,863949,020,00072,ARS-02-0054252,Beacon America,Not captured,Not captured,Not captured,,,,Marcolino,Marcos,A,11/07/1985,male,Not captured,Not captured,Not captured,Not captured,Not captured,Not captured,Not captured,Not captured,Not captured,Not captured,Not captured,Not captured,Not captured,,,Not captured,Not captured,Not captured,Not captured,Klara-Franke-Strasse 8,,Berlin,,10557,,,Not captured,Not captured,marcosma@pik-potsdam.de,Not captured,802043836,,Not captured,Not captured,Not captured,Not captured,Not captured,Not captured,
Not captured,Not captured,12/30/2019,Not captured,Not captured,863949,020,00072,ARS-01-0054251,Beacon International,Not captured,Not captured,Not captured,,,,Mustroph,Christian,,12/04/1989,male,Not captured,Not captured,Not captured,Not captured,Not captured,Not captured,Not captured,Not captured,Not captured,Not captured,Not captured,Not captured,Not captured,,,Not captured,Not captured,Not captured,Not captured,477 Wilmer Street NE,,Atlanta,Georgia,30308,,,Not captured,Not captured,cmustroph@gmail.com,Not captured,802043835,,Not captured,Not captured,Not captured,Not captured,Not captured,Not captured,
Not captured,Not captured,12/30/2019,Not captured,Not captured,863949,020,00072,ARS-01-0054250,Beacon International,Not captured,Not captured,Not captured,,,,Mann,Laura,,10/11/1990,female,Not captured,Not captured,Not captured,Not captured,Not captured,Not captured,Not captured,Not captured,Not captured,Not captured,Not captured,Not captured,Not captured,,,Not captured,Not captured,Not captured,Not captured,477 Wilmer St NE,,Atlanta,Georgia,30308,,,Not captured,Not captured,lmmann2@gmail.com,Not captured,802043834,,Not captured,Not captured,Not captured,Not captured,Not captured,Not captured,
Not captured,Not captured,12/29/2019,Not captured,Not captured,863949,020,00072,ARS-01-0054248,Beacon International,Not captured,Not captured,Not captured,,,,Newton,Jahnay,,05/03/2002,male,Not captured,Not captured,Not captured,Not captured,Not captured,Not captured,Not captured,Not captured,Not captured,Not captured,Not captured,Not captured,Not captured,,,Not captured,Not captured,Not captured,Not captured,706 Thompson Falls Dr,,Canton,Georgia,30114,,,Not captured,Not captured,Marsha@bapa.us,Not captured,802043832,,Not captured,Not captured,Not captured,Not captured,Not captured,Not captured,
Not captured,Not captured,12/29/2019,Not captured,Not captured,863949,020,00072,ARS-01-0054247,Beacon International,Not captured,Not captured,Not captured,,,,Newton,Marsha,,05/20/1969,female,Not captured,Not captured,Not captured,Not captured,Not captured,Not captured,Not captured,Not captured,Not captured,Not captured,Not captured,Not captured,Not captured,,,Not captured,Not captured,Not captured,Not captured,706 Thompson Falls Dr,,Canton,Georgia,30114,,,Not captured,Not captured,Marsha@bapa.us,Not captured,802043831,,Not captured,Not captured,Not captured,Not captured,Not captured,Not captured,
Not captured,Not captured,12/29/2019,Not captured,Not captured,863949,020,00072,ARS-01-0054246,Beacon International,Not captured,Not captured,Not captured,,,,Newton,Gerald,,04/25/1963,male,Not captured,Not captured,Not captured,Not captured,Not captured,Not captured,Not captured,Not captured,Not captured,Not captured,Not captured,Not captured,Not captured,,,Not captured,Not captured,Not captured,Not captured,706 Thompson Falls Dr,,Canton,Georgia,30114,,,Not captured,Not captured,Marsha@bapa.us,Not captured,802043830,,Not captured,Not captured,Not captured,Not captured,Not captured,Not captured,
Not captured,Not captured,12/30/2019,Not captured,Not captured,863949,020,00072,ARS-01-0054243,Beacon International,Not captured,Not captured,Not captured,Passport(518993788),,,WIRW,SABRINA,L,03/01/1955,female,Not captured,Not captured,Not captured,Not captured,Not captured,Not captured,Not captured,Not captured,Not captured,Not captured,Not captured,Not captured,Not captured,Randy Wire,spouse,Not captured,Not captured,Not captured,Not captured,1223 OTTER DR.,,BOONVILLE,Indiana,47601,8124999230,,Not captured,Not captured,Randywire@gmail.com,Not captured,802043827,,Not captured,Not captured,Not captured,Not captured,Not captured,Not captured,
Not captured,Not captured,12/28/2019,Not captured,Not captured,863949,020,00072,ARS-01-0054236,Beacon International,Not captured,Not captured,Not captured,,,,Rodrigues da Silva,Luiz Otavio,,12/14/1983,male,Not captured,Not captured,Not captured,Not captured,Not captured,Not captured,Not captured,Not captured,Not captured,Not captured,Not captured,Not captured,Not captured,,,Not captured,Not captured,Not captured,Not captured,4224 Homestead Blvd,,Westborough,Massachusetts,01581,,,Not captured,Not captured,luizors@gmail.com,Not captured,802043814,,Not captured,Not captured,Not captured,Not captured,Not captured,Not captured,
Not captured,Not captured,12/28/2019,Not captured,Not captured,863949,020,00072,ARS-01-0054235,Beacon International,Not captured,Not captured,Not captured,,,,Araki,Larissa Ayumi,,05/25/1984,female,Not captured,Not captured,Not captured,Not captured,Not captured,Not captured,Not captured,Not captured,Not captured,Not captured,Not captured,Not captured,Not captured,,,Not captured,Not captured,Not captured,Not captured,4224 Homestead Blvd,,Westborough,Massachusetts,01581,,,Not captured,Not captured,luizors@gmail.com,Not captured,802043813,,Not captured,Not captured,Not captured,Not captured,Not captured,Not captured,
Not captured,Not captured,12/28/2019,Not captured,Not captured,863949,020,00072,ARS-01-0054234,Beacon International,Not captured,Not captured,Not captured,,,,Hook,Michelle,,05/12/1989,female,Not captured,Not captured,Not captured,Not captured,Not captured,Not captured,Not captured,Not captured,Not captured,Not captured,Not captured,Not captured,Not captured,,,Not captured,Not captured,Not captured,Not captured,215 Bayside Court,,Berkeley,California,94804,,,Not captured,Not captured,michellephook@gmail.com,Not captured,802043812,,Not captured,Not captured,Not captured,Not captured,Not captured,Not captured,
Not captured,Not captured,12/28/2019,Not captured,Not captured,863949,020,00072,ARS-01-0054233,Beacon International,Not captured,Not captured,Not captured,,,,Pumputis,Michael,,09/11/1985,male,Not captured,Not captured,Not captured,Not captured,Not captured,Not captured,Not captured,Not captured,Not captured,Not captured,Not captured,Not captured,Not captured,,,Not captured,Not captured,Not captured,Not captured,215 Bayside Court,,Berkeley,California,94804,,,Not captured,Not captured,michellephook@gmail.com,Not captured,802043811,,Not captured,Not captured,Not captured,Not captured,Not captured,Not captured,
Not captured,Not captured,12/28/2019,Not captured,Not captured,863949,020,00072,ARS-01-0054231,Beacon International,Not captured,Not captured,Not captured,,,,Marroquin,Edmund,J,08/29/1963,male,Not captured,Not captured,Not captured,Not captured,Not captured,Not captured,Not captured,Not captured,Not captured,Not captured,Not captured,Not captured,Not captured,,,Not captured,Not captured,Not captured,Not captured,419 Linda Rd,,Santa Barbara,California,93109,,,Not captured,Not captured,emarroquinmd@yahoo.com,Not captured,802043809,,Not captured,Not captured,Not captured,Not captured,Not captured,Not captured,
Not captured,Not captured,12/28/2019,Not captured,Not captured,863949,020,00072,ARS-02-0054230,Beacon America,Not captured,Not captured,Not captured,,,,Arons,Autumn,L,10/24/1989,female,Not captured,Not captured,Not captured,Not captured,Not captured,Not captured,Not captured,Not captured,Not captured,Not captured,Not captured,Not captured,Not captured,,,Not captured,Not captured,Not captured,Not captured,117 Walter St,,Roslindale,Massachusetts,02131,,,Not captured,Not captured,aronsa42@gmail.com,Not captured,802043808,,Not captured,Not captured,Not captured,Not captured,Not captured,Not captured,
Not captured,Not captured,12/28/2019,Not captured,Not captured,863949,020,00072,ARS-01-0054229,Beacon International,Not captured,Not captured,Not captured,,,,Flook Stroup,Lindsey,t,01/15/1969,female,Not captured,Not captured,Not captured,Not captured,Not captured,Not captured,Not captured,Not captured,Not captured,Not captured,Not captured,Not captured,Not captured,,,Not captured,Not captured,Not captured,Not captured,964 15th Street,,Hermosa Beach,California,90254,,,Not captured,Not captured,lindseyf.s@icloud.com,Not captured,802043807,,Not captured,Not captured,Not captured,Not captured,Not captured,Not captured,
Not captured,Not captured,12/28/2019,Not captured,Not captured,863949,020,00072,ARS-01-0054228,Beacon International,Not captured,Not captured,Not captured,,,,hugh,Chris,i,05/08/1965,male,Not captured,Not captured,Not captured,Not captured,Not captured,Not captured,Not captured,Not captured,Not captured,Not captured,Not captured,Not captured,Not captured,,,Not captured,Not captured,Not captured,Not captured,964 15th Street,,Hermosa Beach,California,90254,,,Not captured,Not captured,lindseyf.s@icloud.com,Not captured,802043806,,Not captured,Not captured,Not captured,Not captured,Not captured,Not captured,
Not captured,Not captured,12/27/2019,Not captured,Not captured,863949,020,00072,ARS-01-0054227,Beacon International,Not captured,Not captured,Not captured,,,,La,An,T,01/01/1991,male,Not captured,Not captured,Not captured,Not captured,Not captured,Not captured,Not captured,Not captured,Not captured,Not captured,Not captured,Not captured,Not captured,,,Not captured,Not captured,Not captured,Not captured,13741 Clinton St SPC 55,,Garden Grove,California,92843,,,Not captured,Not captured,anthaila9@gmail.com,Not captured,802043805,,Not captured,Not captured,Not captured,Not captured,Not captured,Not captured,
Not captured,Not captured,12/30/2019,Not captured,Not captured,863949,020,00072,ARS-01-0054226,Beacon International,Not captured,Not captured,Not captured,,,,Smith,Lidiya,530778915,01/02/1960,female,Not captured,Not captured,Not captured,Not captured,Not captured,Not captured,Not captured,Not captured,Not captured,Not captured,Not captured,Not captured,Not captured,Preston Smith,Son,Not captured,Not captured,Not captured,Not captured,125 gateshead way,,Phoenixville,Pennsylvania,19460,6103314773,,Not captured,Not captured,emsgmp@aol.com,Not captured,802043804,,Not captured,Not captured,Not captured,Not captured,Not captured,Not captured,
Not captured,Not captured,12/30/2019,Not captured,Not captured,863949,020,00072,ARS-01-0054225,Beacon International,Not captured,Not captured,Not captured,Passport(488198678),,,Smith,Ernest,M,10/15/1952,male,Not captured,Not captured,Not captured,Not captured,Not captured,Not captured,Not captured,Not captured,Not captured,Not captured,Not captured,Not captured,Not captured,Preston Smith,Son,Not captured,Not captured,Not captured,Not captured,125 gateshead way,,Phoenixville,Pennsylvania,19460,6103314773,,Not captured,Not captured,emsgmp@aol.com,Not captured,802043803,,Not captured,Not captured,Not captured,Not captured,Not captured,Not captured,
Not captured,Not captured,12/27/2019,Not captured,Not captured,863949,020,00072,ARS-01-0054224,Beacon International,Not captured,Not captured,Not captured,Passport(591344381),,,Farinas,Carlos ,A,01/12/1960,male,Not captured,Not captured,Not captured,Not captured,Not captured,Not captured,Not captured,Not captured,Not captured,Not captured,Not captured,Not captured,Not captured,Pedro J Diaz-Marchan,Friend,Not captured,Not captured,Not captured,Not captured,2348 Bolsover St,,Houston,Texas,77005,8327236888,,Not captured,Not captured,prdocs@yahoo.com,Not captured,802043802,,Not captured,Not captured,Not captured,Not captured,Not captured,Not captured,
Not captured,Not captured,12/28/2019,Not captured,Not captured,863949,020,00072,ARS-01-0054223,Beacon International,Not captured,Not captured,Not captured,Passport(534111131),,,DiazMarchan,Pedro,Jose,05/16/1960,male,Not captured,Not captured,Not captured,Not captured,Not captured,Not captured,Not captured,Not captured,Not captured,Not captured,Not captured,Not captured,Not captured,Ivette Diaz Marchan,Sister ,Not captured,Not captured,Not captured,Not captured,2348 Bolsover,,Houston,Texas,77005,8325661283,7137983224,Not captured,Not captured,Pedrod@bcm.edu,Not captured,802043801,,Not captured,Not captured,Not captured,Not captured,Not captured,Not captured,
Not captured,Not captured,12/27/2019,Not captured,Not captured,863949,020,00072,ARS-01-0054220,Beacon International,Not captured,Not captured,Not captured,,,,Vanneman,Matthew,W,02/05/1984,male,Not captured,Not captured,Not captured,Not captured,Not captured,Not captured,Not captured,Not captured,Not captured,Not captured,Not captured,Not captured,Not captured,,,Not captured,Not captured,Not captured,Not captured,34 Prince Street,,Cambridge,Massachusetts,02139,,,Not captured,Not captured,mwvanneman@gmail.com,Not captured,802043798,,Not captured,Not captured,Not captured,Not captured,Not captured,Not captured,
Not captured,Not captured,12/27/2019,Not captured,Not captured,863949,020,00072,ARS-01-0054219,Beacon International,Not captured,Not captured,Not captured,,,,Muakkassa,Omar,W,12/02/1983,male,Not captured,Not captured,Not captured,Not captured,Not captured,Not captured,Not captured,Not captured,Not captured,Not captured,Not captured,Not captured,Not captured,,,Not captured,Not captured,Not captured,Not captured,34 Prince Street,,Cambridge,Massachusetts,02139,,,Not captured,Not captured,mwvanneman@gmail.com,Not captured,802043797,,Not captured,Not captured,Not captured,Not captured,Not captured,Not captured,
Not captured,Not captured,12/28/2019,Not captured,Not captured,863949,020,00072,ARS-01-0054218,Beacon International,Not captured,Not captured,Not captured,Passport(531235562),,,Dewey,Scott,,11/15/1961,male,Not captured,Not captured,Not captured,Not captured,Not captured,Not captured,Not captured,Not captured,Not captured,Not captured,Not captured,Not captured,Not captured,Melanie Dewey,Spouse,Not captured,Not captured,Not captured,Not captured,3027 High St.,,Denver,Colorado,80205,7202619953,,Not captured,Not captured,deweyshop@comcast.net,Not captured,802043796,,Not captured,Not captured,Not captured,Not captured,Not captured,Not captured,
Not captured,Not captured,12/28/2019,Not captured,Not captured,863949,020,00072,ARS-01-0054217,Beacon International,Not captured,Not captured,Not captured,,,,Petrenik,Alisa,,08/23/1988,female,Not captured,Not captured,Not captured,Not captured,Not captured,Not captured,Not captured,Not captured,Not captured,Not captured,Not captured,Not captured,Not captured,,,Not captured,Not captured,Not captured,Not captured,Flat C1805 Skycourts Towers Tower C Dubai Land,,Vladivostic,,690000,,,Not captured,Not captured,m.salem@aol.com,Not captured,802043795,,Not captured,Not captured,Not captured,Not captured,Not captured,Not captured,
Not captured,Not captured,12/27/2019,Not captured,Not captured,863949,020,00072,ARS-01-0054216,Beacon International,Not captured,Not captured,Not captured,,,,Chojnowski,Alex,J,10/28/1998,male,Not captured,Not captured,Not captured,Not captured,Not captured,Not captured,Not captured,Not captured,Not captured,Not captured,Not captured,Not captured,Not captured,,,Not captured,Not captured,Not captured,Not captured,4104 n Murray dr,,Otis orchards,Washington,99027,,,Not captured,Not captured,hellokittyandsix@yahoo.com,Not captured,802043794,,Not captured,Not captured,Not captured,Not captured,Not captured,Not captured,
Not captured,Not captured,12/27/2019,Not captured,Not captured,863949,020,00072,ARS-01-0054215,Beacon International,Not captured,Not captured,Not captured,,,,Contreras,Daniela,,07/20/1993,female,Not captured,Not captured,Not captured,Not captured,Not captured,Not captured,Not captured,Not captured,Not captured,Not captured,Not captured,Not captured,Not captured,,,Not captured,Not captured,Not captured,Not captured,1387 Baker St Apt C,,Costa Mesa,California,92626,,,Not captured,Not captured,danieladennise6@live.com,Not captured,802043793,,Not captured,Not captured,Not captured,Not captured,Not captured,Not captured,