EE Transaction Type,Dependent Transaction Type,Effective Date,EE Signature,EE Signature Date,Control,Suffix,Account,Plan Number,Plan Name,Claim Office,Network ID Number,Customer Code,EE SSN,Dependent SSN,Dependent Relationship,Last Name,First Name,Middle Initial,DOB,Gender,Ethnicity,PCP/PCD,PCP/PCD Current Patient,Provider Cap Office Number,COB,Dep Student Indicator,Dep OOA Indicator,EE Prior Coverage Indicator,EE Late Entrant,EE Language Indicator,Hire Date,Earnings,Earnings Frequency,Beneficiary (Last Name First Name MI),Beneficiary Relationship,Continuation of Coverage Expiration Date,Continuation of Coverage Event Date,Continuation of Coverage Length of Coverage,Work Location Zip Code,Street Address Line 1,Street Address Line 2,City,State,Zip Code,Home Phone Number,Work Phone Number,Accept Code,Evidence Code,EE Email Address,Communication Disability Code,EE Alternate ID,Dep Alternate ID,Old Control,Old Suffix,Old Account,New Control,New Suffix,New Account,
Not captured,Not captured,12/18/2019,Not captured,Not captured,863949,020,00072,ARS-02-0054051,Beacon America,Not captured,Not captured,Not captured,,,,Recchimurzo,Nunzio ,A,01/20/2019,male,Not captured,Not captured,Not captured,Not captured,Not captured,Not captured,Not captured,Not captured,Not captured,Not captured,Not captured,Not captured,Not captured,Tatiana Battistoni,spouse,Not captured,Not captured,Not captured,Not captured,Carr 14 con calle 1 urb Colinas de Sta rosa Norte,,Barquisimeto,Lara,3001,584145230728,582512696902,Not captured,Not captured,nunzior5@hotmail.com,Not captured,802043557,,Not captured,Not captured,Not captured,Not captured,Not captured,Not captured,
Not captured,Not captured,12/18/2019,Not captured,Not captured,863949,020,00072,ARS-02-0054050,Beacon America,Not captured,Not captured,Not captured,,,,Recchimurzo,Nunzio ,J,01/20/2019,male,Not captured,Not captured,Not captured,Not captured,Not captured,Not captured,Not captured,Not captured,Not captured,Not captured,Not captured,Not captured,Not captured,Tatiana Battistoni,spouse,Not captured,Not captured,Not captured,Not captured,Carr 14 con calle 1 urb Colinas de Sta rosa Norte,,Barquisimeto,Lara,3001,584145230728,582512696902,Not captured,Not captured,nunzior5@hotmail.com,Not captured,802043556,,Not captured,Not captured,Not captured,Not captured,Not captured,Not captured,
Not captured,Not captured,12/18/2019,Not captured,Not captured,863949,020,00072,ARS-02-0054049,Beacon America,Not captured,Not captured,Not captured,,,,Battistoni,Tatiana,,08/07/1980,female,Not captured,Not captured,Not captured,Not captured,Not captured,Not captured,Not captured,Not captured,Not captured,Not captured,Not captured,Not captured,Not captured,Tatiana Battistoni,spouse,Not captured,Not captured,Not captured,Not captured,Carr 14 con calle 1 urb Colinas de Sta rosa Norte,,Barquisimeto,Lara,3001,584145230728,582512696902,Not captured,Not captured,nunzior5@hotmail.com,Not captured,802043555,,Not captured,Not captured,Not captured,Not captured,Not captured,Not captured,
Not captured,Not captured,12/18/2019,Not captured,Not captured,863949,020,00072,ARS-02-0054048,Beacon America,Not captured,Not captured,Not captured,Passport(126407981),,,Recchimurzo,Nunzio,M,05/12/1978,male,Not captured,Not captured,Not captured,Not captured,Not captured,Not captured,Not captured,Not captured,Not captured,Not captured,Not captured,Not captured,Not captured,Tatiana Battistoni,spouse,Not captured,Not captured,Not captured,Not captured,Carr 14 con calle 1 urb Colinas de Sta rosa Norte,,Barquisimeto,Lara,3001,584145230728,582512696902,Not captured,Not captured,nunzior5@hotmail.com,Not captured,802043554,,Not captured,Not captured,Not captured,Not captured,Not captured,Not captured,
Not captured,Not captured,12/18/2019,Not captured,Not captured,863949,020,00072,ARS-02-0054047,Beacon America,Not captured,Not captured,Not captured,,,,Martin,Katherine,S,02/22/1981,female,Not captured,Not captured,Not captured,Not captured,Not captured,Not captured,Not captured,Not captured,Not captured,Not captured,Not captured,Not captured,Not captured,,,Not captured,Not captured,Not captured,Not captured,Avenida 4 entre calle 2 y 4,,Heredia,,40301,,,Not captured,Not captured,ksmartin08@gmail.com,Not captured,802043553,,Not captured,Not captured,Not captured,Not captured,Not captured,Not captured,
Not captured,Not captured,12/18/2019,Not captured,Not captured,863949,020,00072,ARS-01-0054041,Beacon International,Not captured,Not captured,Not captured,,,,Maldonado Dominguez,Tania,G,12/01/1963,female,Not captured,Not captured,Not captured,Not captured,Not captured,Not captured,Not captured,Not captured,Not captured,Not captured,Not captured,Not captured,Not captured,,,Not captured,Not captured,Not captured,Not captured,6880 Aylesbury rd,,Topeka,Kansas,66610,,,Not captured,Not captured,ernesto.estrada@futamuragroup.com,Not captured,802043523,,Not captured,Not captured,Not captured,Not captured,Not captured,Not captured,
Not captured,Not captured,12/18/2019,Not captured,Not captured,863949,020,00072,ARS-01-0054040,Beacon International,Not captured,Not captured,Not captured,,,,Estrada Carranza,Ernesto,,11/27/1959,male,Not captured,Not captured,Not captured,Not captured,Not captured,Not captured,Not captured,Not captured,Not captured,Not captured,Not captured,Not captured,Not captured,,,Not captured,Not captured,Not captured,Not captured,6880 Aylesbury rd,,Topeka,Kansas,66610,,,Not captured,Not captured,ernesto.estrada@futamuragroup.com,Not captured,802043522,,Not captured,Not captured,Not captured,Not captured,Not captured,Not captured,
Not captured,Not captured,12/18/2019,Not captured,Not captured,863949,020,00072,ARS-01-0054022,Beacon International,Not captured,Not captured,Not captured,Passport(560598007),,,Zhang,Irene,Qin,06/27/1979,female,Not captured,Not captured,Not captured,Not captured,Not captured,Not captured,Not captured,Not captured,Not captured,Not captured,Not captured,Not captured,Not captured,Roy Tan,Spouse,Not captured,Not captured,Not captured,Not captured,8930 Spectrum Center Blvd,,San Diegoi,California,92123,6262368060,,Not captured,Not captured,irene.qin.zhang@gmail.com,Not captured,802043418,,Not captured,Not captured,Not captured,Not captured,Not captured,Not captured,
Not captured,Not captured,12/18/2019,Not captured,Not captured,863949,020,00072,ARS-01-0053997,Beacon International,Not captured,Not captured,Not captured,,,,Rosenbaum,Floris,,06/12/2002,male,Not captured,Not captured,Not captured,Not captured,Not captured,Not captured,Not captured,Not captured,Not captured,Not captured,Not captured,Not captured,Not captured,,,Not captured,Not captured,Not captured,Not captured,Oude Karselaan 103,,Amstelveen,,1182CP,,,Not captured,Not captured,florisrosenbaum1@aol.com,Not captured,802043366,,Not captured,Not captured,Not captured,Not captured,Not captured,Not captured,
Not captured,Not captured,12/18/2019,Not captured,Not captured,863949,020,00072,ARS-02-0053993,Beacon America,Not captured,Not captured,Not captured,Passport(AD974667),,,Nyhus,Matthew,D,12/08/1994,male,Not captured,Not captured,Not captured,Not captured,Not captured,Not captured,Not captured,Not captured,Not captured,Not captured,Not captured,Not captured,Not captured,Glen Nyhus,Father,Not captured,Not captured,Not captured,Not captured,195 Abraham St,,Cambridge,Ontario,N3H 1H4,5196500759,,Not captured,Not captured,mdnyhus@gmail.com,Not captured,802043362,,Not captured,Not captured,Not captured,Not captured,Not captured,Not captured