EE Transaction Type,Dependent Transaction Type,Effective Date,EE Signature,EE Signature Date,Control,Suffix,Account,Plan Number,Plan Name,Claim Office,Network ID Number,Customer Code,EE SSN,Dependent SSN,Dependent Relationship,Last Name,First Name,Middle Initial,DOB,Gender,Ethnicity,PCP/PCD,PCP/PCD Current Patient,Provider Cap Office Number,COB,Dep Student Indicator,Dep OOA Indicator,EE Prior Coverage Indicator,EE Late Entrant,EE Language Indicator,Hire Date,Earnings,Earnings Frequency,Beneficiary (Last Name First Name MI),Beneficiary Relationship,Continuation of Coverage Expiration Date,Continuation of Coverage Event Date,Continuation of Coverage Length of Coverage,Work Location Zip Code,Street Address Line 1,Street Address Line 2,City,State,Zip Code,Home Phone Number,Work Phone Number,Accept Code,Evidence Code,EE Email Address,Communication Disability Code,EE Alternate ID,Dep Alternate ID,Old Control,Old Suffix,Old Account,New Control,New Suffix,New Account,
Not captured,Not captured,11/30/2019,Not captured,Not captured,863949,020,00072,ARS-02-0053815,Beacon America,Not captured,Not captured,Not captured,,,,Roman,Julie,,01/04/1972,female,Not captured,Not captured,Not captured,Not captured,Not captured,Not captured,Not captured,Not captured,Not captured,Not captured,Not captured,Not captured,Not captured,,,Not captured,Not captured,Not captured,Not captured,14241 NE Woodinville Duvall Road,,Woodinville,Washington,98072,,,Not captured,Not captured,juliemozz@gmail.com,Not captured,701942993,,Not captured,Not captured,Not captured,Not captured,Not captured,Not captured,
Not captured,Not captured,11/30/2019,Not captured,Not captured,863949,020,00072,ARS-01-0053812,Beacon International,Not captured,Not captured,Not captured,,,,Halloran,Jonathan,,04/08/1970,male,Not captured,Not captured,Not captured,Not captured,Not captured,Not captured,Not captured,Not captured,Not captured,Not captured,Not captured,Not captured,Not captured,,,Not captured,Not captured,Not captured,Not captured,4514 N Whipple Street,,CHICAGO,Illinois,60625,,,Not captured,Not captured,jonathan.halloran@gmail.com,Not captured,701942990,,Not captured,Not captured,Not captured,Not captured,Not captured,Not captured,
Not captured,Not captured,11/30/2019,Not captured,Not captured,863949,020,00072,ARS-01-0053811,Beacon International,Not captured,Not captured,Not captured,,,,Mudronja,Jonathan,,11/20/1984,male,Not captured,Not captured,Not captured,Not captured,Not captured,Not captured,Not captured,Not captured,Not captured,Not captured,Not captured,Not captured,Not captured,,,Not captured,Not captured,Not captured,Not captured,1230 W Draper St,,Chicago,Illinois,60614,,,Not captured,Not captured,jmudronja@gmail.com,Not captured,701942989,,Not captured,Not captured,Not captured,Not captured,Not captured,Not captured,
Not captured,Not captured,11/30/2019,Not captured,Not captured,863949,020,00072,ARS-01-0053810,Beacon International,Not captured,Not captured,Not captured,,,,McElvein,Angela,S,12/26/1959,female,Not captured,Not captured,Not captured,Not captured,Not captured,Not captured,Not captured,Not captured,Not captured,Not captured,Not captured,Not captured,Not captured,,,Not captured,Not captured,Not captured,Not captured,21311 San Miguel,,Mission Viejo,California,92692,,,Not captured,Not captured,jackmcelvein@yahoo.com,Not captured,701942988,,Not captured,Not captured,Not captured,Not captured,Not captured,Not captured,
Not captured,Not captured,11/30/2019,Not captured,Not captured,863949,020,00072,ARS-01-0053809,Beacon International,Not captured,Not captured,Not captured,,,,McElvein,John,W,01/13/1953,male,Not captured,Not captured,Not captured,Not captured,Not captured,Not captured,Not captured,Not captured,Not captured,Not captured,Not captured,Not captured,Not captured,,,Not captured,Not captured,Not captured,Not captured,21311 San Miguel,,Mission Viejo,California,92692,,,Not captured,Not captured,jackmcelvein@yahoo.com,Not captured,701942987,,Not captured,Not captured,Not captured,Not captured,Not captured,Not captured,
Not captured,Not captured,11/30/2019,Not captured,Not captured,863949,020,00072,ARS-01-0053802,Beacon International,Not captured,Not captured,Not captured,,,,Wong,Elizabeth,,01/28/1994,female,Not captured,Not captured,Not captured,Not captured,Not captured,Not captured,Not captured,Not captured,Not captured,Not captured,Not captured,Not captured,Not captured,,,Not captured,Not captured,Not captured,Not captured,Taubstummengasse 2 46,,Vienna,,1040,,,Not captured,Not captured,elizabethwong_28@hotmail.com,Not captured,701942980,,Not captured,Not captured,Not captured,Not captured,Not captured,Not captured,
Not captured,Not captured,11/29/2019,Not captured,Not captured,863949,020,00072,ARS-01-0053801,Beacon International,Not captured,Not captured,Not captured,,,,Fujimoto,Sachiko,,12/20/1968,female,Not captured,Not captured,Not captured,Not captured,Not captured,Not captured,Not captured,Not captured,Not captured,Not captured,Not captured,Not captured,Not captured,,,Not captured,Not captured,Not captured,Not captured,PO Box 3793,,Palos Verdes Peninsula,California,90274,,,Not captured,Not captured,sfujimoto10@yahoo.com,Not captured,701942979,,Not captured,Not captured,Not captured,Not captured,Not captured,Not captured,
Not captured,Not captured,11/29/2019,Not captured,Not captured,863949,020,00072,ARS-01-0053799,Beacon International,Not captured,Not captured,Not captured,,,,Samora De Munoz,Daniuska Estrella,,11/13/1976,female,Not captured,Not captured,Not captured,Not captured,Not captured,Not captured,Not captured,Not captured,Not captured,Not captured,Not captured,Not captured,Not captured,Heidi Molina,Hermana,Not captured,Not captured,Not captured,Not captured,14221 SW 120 ST Suite 127,,Miami,Florida,33196,3053786210,,Not captured,Not captured,lesbiamoreno1@gmail.com,Not captured,701942977,,Not captured,Not captured,Not captured,Not captured,Not captured,Not captured,
Not captured,Not captured,11/29/2019,Not captured,Not captured,863949,020,00072,ARS-01-0053798,Beacon International,Not captured,Not captured,Not captured,Passport(136323882),,,Munoz Rodriguez,Gustavo Adolfo,,06/14/1963,male,Not captured,Not captured,Not captured,Not captured,Not captured,Not captured,Not captured,Not captured,Not captured,Not captured,Not captured,Not captured,Not captured,Heidi Molina,Hermana,Not captured,Not captured,Not captured,Not captured,14221 SW 120 ST Suite 127,,Miami,Florida,33196,3053786210,,Not captured,Not captured,lesbiamoreno1@gmail.com,Not captured,701942976,,Not captured,Not captured,Not captured,Not captured,Not captured,Not captured,
Not captured,Not captured,11/28/2019,Not captured,Not captured,863949,020,00072,ARS-01-0053797,Beacon International,Not captured,Not captured,Not captured,,,,Nevo,Anath,,12/24/1973,female,Not captured,Not captured,Not captured,Not captured,Not captured,Not captured,Not captured,Not captured,Not captured,Not captured,Not captured,Not captured,Not captured,,,Not captured,Not captured,Not captured,Not captured,310 Centennial drive,,Blue Bell,Pennsylvania,19422,,,Not captured,Not captured,anathnevo@gmail.com,Not captured,701942975,,Not captured,Not captured,Not captured,Not captured,Not captured,Not captured,
Not captured,Not captured,11/28/2019,Not captured,Not captured,863949,020,00072,ARS-01-0053796,Beacon International,Not captured,Not captured,Not captured,,,,Lim,Linz,,12/12/1982,female,Not captured,Not captured,Not captured,Not captured,Not captured,Not captured,Not captured,Not captured,Not captured,Not captured,Not captured,Not captured,Not captured,,,Not captured,Not captured,Not captured,Not captured,270 10th avenue apartment 6,,San francisco,California,94118,,,Not captured,Not captured,jdlrobson@gmail.com,Not captured,701942974,,Not captured,Not captured,Not captured,Not captured,Not captured,Not captured,
Not captured,Not captured,11/28/2019,Not captured,Not captured,863949,020,00072,ARS-01-0053795,Beacon International,Not captured,Not captured,Not captured,,,,Robson,Jonathan,,02/20/1985,male,Not captured,Not captured,Not captured,Not captured,Not captured,Not captured,Not captured,Not captured,Not captured,Not captured,Not captured,Not captured,Not captured,,,Not captured,Not captured,Not captured,Not captured,270 10th avenue apartment 6,,San francisco,California,94118,,,Not captured,Not captured,jdlrobson@gmail.com,Not captured,701942973,,Not captured,Not captured,Not captured,Not captured,Not captured,Not captured,
Not captured,Not captured,11/28/2019,Not captured,Not captured,863949,020,00072,ARS-01-0053794,Beacon International,Not captured,Not captured,Not captured,,,,Wahl,Baruch,R,05/02/1994,male,Not captured,Not captured,Not captured,Not captured,Not captured,Not captured,Not captured,Not captured,Not captured,Not captured,Not captured,Not captured,Not captured,,,Not captured,Not captured,Not captured,Not captured,1528 49th Street,,Brooklyn,New York,11219,,,Not captured,Not captured,chayarivaapter@gmail.com,Not captured,701942972,,Not captured,Not captured,Not captured,Not captured,Not captured,Not captured,
Not captured,Not captured,11/28/2019,Not captured,Not captured,863949,020,00072,ARS-01-0053793,Beacon International,Not captured,Not captured,Not captured,,,,Apter,Chaya,R,03/21/1997,female,Not captured,Not captured,Not captured,Not captured,Not captured,Not captured,Not captured,Not captured,Not captured,Not captured,Not captured,Not captured,Not captured,,,Not captured,Not captured,Not captured,Not captured,1528 49th Street,,Brooklyn,New York,11219,,,Not captured,Not captured,chayarivaapter@gmail.com,Not captured,701942971,,Not captured,Not captured,Not captured,Not captured,Not captured,Not captured,
Not captured,Not captured,11/28/2019,Not captured,Not captured,863949,020,00072,ARS-02-0053792,Beacon America,Not captured,Not captured,Not captured,,,,Laclau,Maria,L,04/14/1988,female,Not captured,Not captured,Not captured,Not captured,Not captured,Not captured,Not captured,Not captured,Not captured,Not captured,Not captured,Not captured,Not captured,,,Not captured,Not captured,Not captured,Not captured,528 3rd Ave W,,Seattle,Washington,98119,,,Not captured,Not captured,ml.laclau@gmail.com,Not captured,701942970,,Not captured,Not captured,Not captured,Not captured,Not captured,Not captured,
Not captured,Not captured,11/28/2019,Not captured,Not captured,863949,020,00072,ARS-02-0053791,Beacon America,Not captured,Not captured,Not captured,,,,Su,Albert,M,04/04/1984,male,Not captured,Not captured,Not captured,Not captured,Not captured,Not captured,Not captured,Not captured,Not captured,Not captured,Not captured,Not captured,Not captured,,,Not captured,Not captured,Not captured,Not captured,528 3rd Ave W,,Seattle,Washington,98119,,,Not captured,Not captured,albertsu04@gmail.com,Not captured,701942969,,Not captured,Not captured,Not captured,Not captured,Not captured,Not captured,
Not captured,Not captured,11/28/2019,Not captured,Not captured,863949,020,00072,ARS-01-0053790,Beacon International,Not captured,Not captured,Not captured,,,,Rocha Porcoro,Mayra,D,12/10/1991,female,Not captured,Not captured,Not captured,Not captured,Not captured,Not captured,Not captured,Not captured,Not captured,Not captured,Not captured,Not captured,Not captured,,,Not captured,Not captured,Not captured,Not captured,41 Whitaker Ave,,Woodland Park,New Jersey,07424,,,Not captured,Not captured,mayrarochaa@gmail.com,Not captured,701942968,,Not captured,Not captured,Not captured,Not captured,Not captured,Not captured,
Not captured,Not captured,11/28/2019,Not captured,Not captured,863949,020,00072,ARS-02-0053789,Beacon America,Not captured,Not captured,Not captured,Passport(AA789834),,,Mercer,MaryAnne,Carol,10/19/1995,female,Not captured,Not captured,Not captured,Not captured,Not captured,Not captured,Not captured,Not captured,Not captured,Not captured,Not captured,Not captured,Not captured,Bill Mercer,Father,Not captured,Not captured,Not captured,Not captured,21 Applebey St,,Eatontown,NJ,07724,7328819202,,Not captured,Not captured,maryanne.mercer@hotmail.com,Not captured,701942967,,Not captured,Not captured,Not captured,Not captured,Not captured,Not captured,
Not captured,Not captured,11/28/2019,Not captured,Not captured,863949,020,00072,ARS-01-0053788,Beacon International,Not captured,Not captured,Not captured,,,,Loureiro e Oliveira,Ramon Henrique,,01/23/1989,male,Not captured,Not captured,Not captured,Not captured,Not captured,Not captured,Not captured,Not captured,Not captured,Not captured,Not captured,Not captured,Not captured,,,Not captured,Not captured,Not captured,Not captured,1209 Beechtree Lane,,Pflugerville,Texas,78660,,,Not captured,Not captured,luizaozoriodeoliveira@gmail.com,Not captured,701942966,,Not captured,Not captured,Not captured,Not captured,Not captured,Not captured,
Not captured,Not captured,11/28/2019,Not captured,Not captured,863949,020,00072,ARS-01-0053787,Beacon International,Not captured,Not captured,Not captured,,,,Ozorio de Oliveira,Luiza,,04/01/1993,female,Not captured,Not captured,Not captured,Not captured,Not captured,Not captured,Not captured,Not captured,Not captured,Not captured,Not captured,Not captured,Not captured,,,Not captured,Not captured,Not captured,Not captured,1209 Beechtree Lane,,Pflugerville,Texas,78660,,,Not captured,Not captured,luizaozoriodeoliveira@gmail.com,Not captured,701942965,,Not captured,Not captured,Not captured,Not captured,Not captured,Not captured,
Not captured,Not captured,11/28/2019,Not captured,Not captured,863949,020,00072,ARS-01-0053786,Beacon International,Not captured,Not captured,Not captured,,,,Albuquerque de Almeida,Maria Eduarda,V,08/15/2018,female,Not captured,Not captured,Not captured,Not captured,Not captured,Not captured,Not captured,Not captured,Not captured,Not captured,Not captured,Not captured,Not captured,,,Not captured,Not captured,Not captured,Not captured,7861 sw 102nd lane,,Miami,Florida,33156,,,Not captured,Not captured,lelisveiga@gmail.com,Not captured,701942964,,Not captured,Not captured,Not captured,Not captured,Not captured,Not captured,
Not captured,Not captured,11/28/2019,Not captured,Not captured,863949,020,00072,ARS-01-0053785,Beacon International,Not captured,Not captured,Not captured,,,,Albuquerque de Almeida,Felipe,,02/19/1989,male,Not captured,Not captured,Not captured,Not captured,Not captured,Not captured,Not captured,Not captured,Not captured,Not captured,Not captured,Not captured,Not captured,,,Not captured,Not captured,Not captured,Not captured,7861 sw 102nd lane,,Miami,Florida,33156,,,Not captured,Not captured,lelisveiga@gmail.com,Not captured,701942963,,Not captured,Not captured,Not captured,Not captured,Not captured,Not captured,
Not captured,Not captured,11/28/2019,Not captured,Not captured,863949,020,00072,ARS-01-0053784,Beacon International,Not captured,Not captured,Not captured,,,,De almeida veiga,Leticia,,03/05/1990,female,Not captured,Not captured,Not captured,Not captured,Not captured,Not captured,Not captured,Not captured,Not captured,Not captured,Not captured,Not captured,Not captured,,,Not captured,Not captured,Not captured,Not captured,7861 sw 102nd lane,,Miami,Florida,33156,,,Not captured,Not captured,lelisveiga@gmail.com,Not captured,701942962,,Not captured,Not captured,Not captured,Not captured,Not captured,Not captured,
Not captured,Not captured,11/27/2019,Not captured,Not captured,863949,020,00072,ARS-01-0053781,Beacon International,Not captured,Not captured,Not captured,,,,grunwald,Eliezier,,05/27/1988,male,Not captured,Not captured,Not captured,Not captured,Not captured,Not captured,Not captured,Not captured,Not captured,Not captured,Not captured,Not captured,Not captured,,,Not captured,Not captured,Not captured,Not captured,12 da weider blvd,,monroe,New York,10950,,,Not captured,Not captured,Egeg845@gmail.com,Not captured,701942958,,Not captured,Not captured,Not captured,Not captured,Not captured,Not captured,
Not captured,Not captured,11/27/2019,Not captured,Not captured,863949,020,00072,ARS-01-0053774,Beacon International,Not captured,Not captured,Not captured,,,,Gorakine,Alex,,04/27/2005,male,Not captured,Not captured,Not captured,Not captured,Not captured,Not captured,Not captured,Not captured,Not captured,Not captured,Not captured,Not captured,Not captured,,,Not captured,Not captured,Not captured,Not captured,39-22 Van Duren Ave,,Fair Lawn,New Jersey,07410,,,Not captured,Not captured,gorakin@hotmail.com,Not captured,701942950,,Not captured,Not captured,Not captured,Not captured,Not captured,Not captured,
Not captured,Not captured,11/27/2019,Not captured,Not captured,863949,020,00072,ARS-01-0053773,Beacon International,Not captured,Not captured,Not captured,,,,Zelenova,Elena,,10/05/1967,female,Not captured,Not captured,Not captured,Not captured,Not captured,Not captured,Not captured,Not captured,Not captured,Not captured,Not captured,Not captured,Not captured,,,Not captured,Not captured,Not captured,Not captured,39-22 Van Duren Ave,,Fair Lawn,New Jersey,07410,,,Not captured,Not captured,gorakin@hotmail.com,Not captured,701942949,,Not captured,Not captured,Not captured,Not captured,Not captured,Not captured,
Not captured,Not captured,11/27/2019,Not captured,Not captured,863949,020,00072,ARS-01-0053772,Beacon International,Not captured,Not captured,Not captured,,,,Gorakine,Konstantin,,12/05/1970,male,Not captured,Not captured,Not captured,Not captured,Not captured,Not captured,Not captured,Not captured,Not captured,Not captured,Not captured,Not captured,Not captured,,,Not captured,Not captured,Not captured,Not captured,39-22 Van Duren Ave,,Fair Lawn,New Jersey,07410,,,Not captured,Not captured,gorakin@hotmail.com,Not captured,701942948,,Not captured,Not captured,Not captured,Not captured,Not captured,Not captured,
Not captured,Not captured,11/27/2019,Not captured,Not captured,863949,020,00072,ARS-01-0053771,Beacon International,Not captured,Not captured,Not captured,,,,Goffer Daphne,Michal,,02/20/1992,female,Not captured,Not captured,Not captured,Not captured,Not captured,Not captured,Not captured,Not captured,Not captured,Not captured,Not captured,Not captured,Not captured,,,Not captured,Not captured,Not captured,Not captured,425 West 121 Street apt. 407,,New York New York USA,,10027,,,Not captured,Not captured,michalgoffer@gmail.com,Not captured,701942947,,Not captured,Not captured,Not captured,Not captured,Not captured,Not captured,
Not captured,Not captured,11/26/2019,Not captured,Not captured,863949,020,00072,ARS-01-0053767,Beacon International,Not captured,Not captured,Not captured,,,,Bablon,Geoffroy,,07/31/1990,male,Not captured,Not captured,Not captured,Not captured,Not captured,Not captured,Not captured,Not captured,Not captured,Not captured,Not captured,Not captured,Not captured,,,Not captured,Not captured,Not captured,Not captured,265 Bainbridge St Apt 3,,Brooklyn,New York,11233,,,Not captured,Not captured,gbablon@gmail.com,Not captured,701942943,,Not captured,Not captured,Not captured,Not captured,Not captured,Not captured,
Not captured,Not captured,11/26/2019,Not captured,Not captured,863949,020,00072,ARS-01-0053766,Beacon International,Not captured,Not captured,Not captured,,,,Lemoine,Sana&euml;,,10/15/1989,female,Not captured,Not captured,Not captured,Not captured,Not captured,Not captured,Not captured,Not captured,Not captured,Not captured,Not captured,Not captured,Not captured,,,Not captured,Not captured,Not captured,Not captured,265 Bainbridge St Apt 3,,Brooklyn,New York,11233,,,Not captured,Not captured,gbablon@gmail.com,Not captured,701942942,,Not captured,Not captured,Not captured,Not captured,Not captured,Not captured,
Not captured,Not captured,11/26/2019,Not captured,Not captured,863949,020,00072,ARS-01-0053762,Beacon International,Not captured,Not captured,Not captured,,,,ROJAS ROSALES,WILSON JOSE ,,06/22/1973,male,Not captured,Not captured,Not captured,Not captured,Not captured,Not captured,Not captured,Not captured,Not captured,Not captured,Not captured,Not captured,Not captured,Rafael Alejandro Rojas Ramirez,Hijo,Not captured,Not captured,Not captured,Not captured,3400 Ocee St Apt 113,,Houston,Texas,77063,+5804247221082,04247221082,Not captured,Not captured,wrojas11@hotmail.com,Not captured,701942934,,Not captured,Not captured,Not captured,Not captured,Not captured,Not captured,
Not captured,Not captured,11/26/2019,Not captured,Not captured,863949,020,00072,ARS-01-0053761,Beacon International,Not captured,Not captured,Not captured,Passport(151359079),,,GONZALEZ ROMERO,ALEJANDRA JOSE,,12/15/1997,female,Not captured,Not captured,Not captured,Not captured,Not captured,Not captured,Not captured,Not captured,Not captured,Not captured,Not captured,Not captured,Not captured,Rafael Alejandro Rojas Ramirez,Hijo,Not captured,Not captured,Not captured,Not captured,3400 Ocee St Apt 113,,Houston,Texas,77063,+5804247221082,04247221082,Not captured,Not captured,wrojas11@hotmail.com,Not captured,701942933,,Not captured,Not captured,Not captured,Not captured,Not captured,Not captured,
Not captured,Not captured,11/26/2019,Not captured,Not captured,863949,020,00072,ARS-02-0053760,Beacon America,Not captured,Not captured,Not captured,,,,landau,salomon,,03/01/2019,male,Not captured,Not captured,Not captured,Not captured,Not captured,Not captured,Not captured,Not captured,Not captured,Not captured,Not captured,Not captured,Not captured,,,Not captured,Not captured,Not captured,Not captured,2 lublin way,,MONROE,New York,10950,,,Not captured,Not captured,LANDAU545@GMAIL.COM,Not captured,701942932,,Not captured,Not captured,Not captured,Not captured,Not captured,Not captured,
Not captured,Not captured,11/26/2019,Not captured,Not captured,863949,020,00072,ARS-02-0053759,Beacon America,Not captured,Not captured,Not captured,,,,landau,sarah,,11/21/1997,female,Not captured,Not captured,Not captured,Not captured,Not captured,Not captured,Not captured,Not captured,Not captured,Not captured,Not captured,Not captured,Not captured,,,Not captured,Not captured,Not captured,Not captured,2 lublin way,,MONROE,New York,10950,,,Not captured,Not captured,LANDAU545@GMAIL.COM,Not captured,701942931,,Not captured,Not captured,Not captured,Not captured,Not captured,Not captured,
Not captured,Not captured,11/26/2019,Not captured,Not captured,863949,020,00072,ARS-02-0053758,Beacon America,Not captured,Not captured,Not captured,,,,landau,wolf,,03/22/1997,male,Not captured,Not captured,Not captured,Not captured,Not captured,Not captured,Not captured,Not captured,Not captured,Not captured,Not captured,Not captured,Not captured,,,Not captured,Not captured,Not captured,Not captured,2 lublin way,,MONROE,New York,10950,,,Not captured,Not captured,LANDAU545@GMAIL.COM,Not captured,701942930,,Not captured,Not captured,Not captured,Not captured,Not captured,Not captured,
Not captured,Not captured,11/26/2019,Not captured,Not captured,863949,020,00072,ARS-01-0053757,Beacon International,Not captured,Not captured,Not captured,,,,Walker,Melissa,R,06/02/1972,female,Not captured,Not captured,Not captured,Not captured,Not captured,Not captured,Not captured,Not captured,Not captured,Not captured,Not captured,Not captured,Not captured,,,Not captured,Not captured,Not captured,Not captured,6901 W Acre Ct,,Yakima,Washington,98903,,,Not captured,Not captured,mylissajous@gmail.com,Not captured,701942929,,Not captured,Not captured,Not captured,Not captured,Not captured,Not captured,