EE Transaction Type,Dependent Transaction Type,Effective Date,EE Signature,EE Signature Date,Control,Suffix,Account,Plan Number,Plan Name,Claim Office,Network ID Number,Customer Code,EE SSN,Dependent SSN,Dependent Relationship,Last Name,First Name,Middle Initial,DOB,Gender,Ethnicity,PCP/PCD,PCP/PCD Current Patient,Provider Cap Office Number,COB,Dep Student Indicator,Dep OOA Indicator,EE Prior Coverage Indicator,EE Late Entrant,EE Language Indicator,Hire Date,Earnings,Earnings Frequency,Beneficiary (Last Name First Name MI),Beneficiary Relationship,Continuation of Coverage Expiration Date,Continuation of Coverage Event Date,Continuation of Coverage Length of Coverage,Work Location Zip Code,Street Address Line 1,Street Address Line 2,City,State,Zip Code,Home Phone Number,Work Phone Number,Accept Code,Evidence Code,EE Email Address,Communication Disability Code,EE Alternate ID,Dep Alternate ID,Old Control,Old Suffix,Old Account,New Control,New Suffix,New Account,
Not captured,Not captured,12/06/2019,Not captured,Not captured,863949,020,00072,ARS-03-0053865,Essential America,Not captured,Not captured,Not captured,Passport(123698249),,,Previte Colosi,Antonino,Tindaro,07/17/1966,male,Not captured,Not captured,Not captured,Not captured,Not captured,Not captured,Not captured,Not captured,Not captured,Not captured,Not captured,Not captured,Not captured,,,Not captured,Not captured,Not captured,Not captured,Avenida Andres Bello #23,,Ciudad Bolivar,Bolivar,8001,3053217828,,Not captured,Not captured,antoninoprevite@gmail.com,Not captured,,,Not captured,Not captured,Not captured,Not captured,Not captured,Not captured,
Not captured,Not captured,12/06/2019,Not captured,Not captured,863949,020,00072,ARS-03-0053866,Essential America,Not captured,Not captured,Not captured,Passport(AR267950),,,Ortiz  Alzate,Jose,Alejandro,04/21/1972,male,Not captured,Not captured,Not captured,Not captured,Not captured,Not captured,Not captured,Not captured,Not captured,Not captured,Not captured,Not captured,Not captured,,,Not captured,Not captured,Not captured,Not captured,Calle 5F #30-53,,Medellin,Antioquia,8001,3053217828,,Not captured,Not captured,alejortiz@hotmail.com,Not captured,,,Not captured,Not captured,Not captured,Not captured,Not captured,Not captured,
Not captured,Not captured,12/05/2019,Not captured,Not captured,863949,020,00072,ARS-04-0053625,Enhanced America,Not captured,Not captured,Not captured,Passport(A3082070),,,OUOBA,Thiabrimani,,07/09/1976,male,Not captured,Not captured,Not captured,Not captured,Not captured,Not captured,Not captured,Not captured,Not captured,Not captured,Not captured,Not captured,Not captured,,,Not captured,Not captured,Not captured,Not captured,06 BP 9039 ouagadougou 06,,Ouagadougou,Ouagadougou,,+22670204230,,Not captured,Not captured,touoba@gmail.com,Not captured,,,Not captured,Not captured,Not captured,Not captured,Not captured,Not captured,
Not captured,Not captured,12/01/2019,Not captured,Not captured,863949,020,00072,ARS-03-0053733,Essential America,Not captured,Not captured,Not captured,Passport(643065879),,,Brewer,Katherine,Elizabeth,11/01/2019,female,Not captured,Not captured,Not captured,Not captured,Not captured,Not captured,Not captured,Not captured,Not captured,Not captured,Not captured,Not captured,Not captured,,,Not captured,Not captured,Not captured,Not captured,3200 Alta View,,Fort Worth,Texas,76111,8179990088,,Not captured,Not captured,service@azimuthrisk.com,Not captured,,,Not captured,Not captured,Not captured,Not captured,Not captured,Not captured,
Not captured,Not captured,12/02/2019,Not captured,Not captured,863949,020,00072,ARS-03-0053742,Essential International,Not captured,Not captured,Not captured,Passport(551022957),,,Liming,Katherine,Garrison,06/13/1995,female,Not captured,Not captured,Not captured,Not captured,Not captured,Not captured,Not captured,Not captured,Not captured,Not captured,Not captured,Not captured,Not captured,,,Not captured,Not captured,Not captured,Not captured,7537 E Larkspur Dr,,Scottsdale,Arizona,85260,4804837315,,Not captured,Not captured,kgliming@gmail.com,Not captured,,,Not captured,Not captured,Not captured,Not captured,Not captured,Not captured,
Not captured,Not captured,11/21/2019,Not captured,Not captured,863949,020,00072,ARS-03-0053638,Essential America,Not captured,Not captured,Not captured,Passport(567094294),,,Heinichen,Jeffery ,,07/23/2019,male,Not captured,Not captured,Not captured,Not captured,Not captured,Not captured,Not captured,Not captured,Not captured,Not captured,Not captured,Not captured,Not captured,,,Not captured,Not captured,Not captured,Not captured,2244 W Oyer Ln,,Phoenix,Arizona,85085,6307302373,,Not captured,Not captured,heinichen@gmail.com,Not captured,,,Not captured,Not captured,Not captured,Not captured,Not captured,Not captured,
Not captured,Not captured,11/10/2019,Not captured,Not captured,863949,020,00072,ARS-04-0053522,Enhanced America,Not captured,Not captured,Not captured,SSN(174-83-1413),,,Molineux,Jude,Bailey,10/10/2019,male,Not captured,Not captured,Not captured,Not captured,Not captured,Not captured,Not captured,Not captured,Not captured,Not captured,Not captured,Not captured,Not captured,,,Not captured,Not captured,Not captured,Not captured,910 University,,Helena,Montana,59601,4064437909,,Not captured,Not captured,aksha@tinyhands.org,Not captured,,,Not captured,Not captured,Not captured,Not captured,Not captured,Not captured,
Not captured,Not captured,11/06/2019,Not captured,Not captured,863949,020,00072,ARS-04-0053307,Enhanced America,Not captured,Not captured,Not captured,Passport(050009423),,,Jeremic,Vuk,,07/03/1975,male,Not captured,Not captured,Not captured,Not captured,Not captured,Not captured,Not captured,Not captured,Not captured,Not captured,Not captured,Not captured,Not captured,,,Not captured,Not captured,Not captured,Not captured,Brane Crncevica 5/5,,Belgrade,Belgrade,11000,16465209231,,Not captured,Not captured,natasajeremic25@gmail.com,Not captured,,,Not captured,Not captured,Not captured,Not captured,Not captured,Not captured,
Not captured,Not captured,11/06/2019,Not captured,Not captured,863949,020,00072,ARS-04-0053307,Enhanced America,Not captured,Not captured,Not captured,,Passport(050008822),Spouse,Jeremic,Natasa,,05/02/1972,female,Not captured,Not captured,Not captured,Not captured,Not captured,Not captured,Not captured,Not captured,Not captured,Not captured,Not captured,Not captured,Not captured,,,Not captured,Not captured,Not captured,Not captured,Brane Crncevica 5/5,,Belgrade,Belgrade,11000,16465209231,,Not captured,Not captured,natasajeremic25@gmail.com,Not captured,,,Not captured,Not captured,Not captured,Not captured,Not captured,Not captured,
Not captured,Not captured,11/06/2019,Not captured,Not captured,863949,020,00072,ARS-04-0053307,Enhanced America,Not captured,Not captured,Not captured,,Passport(584697276),Dependant,Jeremic,Sofija,,04/29/2018,female,Not captured,Not captured,Not captured,Not captured,Not captured,Not captured,Not captured,Not captured,Not captured,Not captured,Not captured,Not captured,Not captured,,,Not captured,Not captured,Not captured,Not captured,Brane Crncevica 5/5,,Belgrade,Belgrade,11000,16465209231,,Not captured,Not captured,natasajeremic25@gmail.com,Not captured,,,Not captured,Not captured,Not captured,Not captured,Not captured,Not captured,
Not captured,Not captured,11/11/2019,Not captured,Not captured,863949,020,00072,ARS-05-0053485,Clear International,Not captured,Not captured,Not captured,Passport(577754041),,,Blackburn,Barry,Wyatt,08/10/1957,male,Not captured,Not captured,Not captured,Not captured,Not captured,Not captured,Not captured,Not captured,Not captured,Not captured,Not captured,Not captured,Not captured,,,Not captured,Not captured,Not captured,Not captured,75B Lic. Rafael Corrales Ayala,,Guanajuato,Guanajuato,36250,2406767181,,Not captured,Not captured,bmilehigh@gmail.com,Not captured,,,Not captured,Not captured,Not captured,Not captured,Not captured,Not captured,
Not captured,Not captured,11/05/2019,Not captured,Not captured,863949,020,00072,ARS-03-0053408,Essential America,Not captured,Not captured,Not captured,Passport(.),,,Rasmussen,Bjorn,Elihu,10/08/2019,male,Not captured,Not captured,Not captured,Not captured,Not captured,Not captured,Not captured,Not captured,Not captured,Not captured,Not captured,Not captured,Not captured,,,Not captured,Not captured,Not captured,Not captured,4958 Stonecrest Dr,,lakeland,Florida,33813,8638088761,,Not captured,Not captured,beforekings10.18@gmail.com,Not captured,,,Not captured,Not captured,Not captured,Not captured,Not captured,Not captured,
Not captured,Not captured,11/04/2019,Not captured,Not captured,863949,020,00072,ARS-03-0053442,Essential America,Not captured,Not captured,Not captured,Passport(L9126015),,,Dama,SriDevi,,03/03/1993,female,Not captured,Not captured,Not captured,Not captured,Not captured,Not captured,Not captured,Not captured,Not captured,Not captured,Not captured,Not captured,Not captured,,,Not captured,Not captured,Not captured,Not captured,2874 Coral Ct. #30,,Coralville,Iowa,52241,4692367158,,Not captured,Not captured,info@visitorsinsurance.com,Not captured,,,Not captured,Not captured,Not captured,Not captured,Not captured,Not captured,
Not captured,Not captured,12/03/2019,Not captured,Not captured,863949,020,00072,ARS-03-0053409,Essential America,Not captured,Not captured,Not captured,Passport(168064215),,,Vanama,Sainadh,,06/02/1992,male,Not captured,Not captured,Not captured,Not captured,Not captured,Not captured,Not captured,Not captured,Not captured,Not captured,Not captured,Not captured,Not captured,,,Not captured,Not captured,Not captured,Not captured,17-143 Main Roadh Ayyagaripeta Sathupally,,Khammam,Tamil Nadu,TS,6466753336,,Not captured,Not captured,vanamasainadh@gmail.com,Not captured,,,Not captured,Not captured,Not captured,Not captured,Not captured,Not captured,
Not captured,Not captured,10/30/2019,Not captured,Not captured,863949,020,00072,ARS-03-0053208,Essential America,Not captured,Not captured,Not captured,Passport(XDD303794),,,Hernandez Santana,Jose,,11/30/1956,male,Not captured,Not captured,Not captured,Not captured,Not captured,Not captured,Not captured,Not captured,Not captured,Not captured,Not captured,Not captured,Not captured,,,Not captured,Not captured,Not captured,Not captured,caya Bunita Bista (Tiema del Sal) #8,,Palm Beach,,.,17866169947,,Not captured,Not captured,jose.h@grupohersan.com.ve,Not captured,,,Not captured,Not captured,Not captured,Not captured,Not captured,Not captured,
Not captured,Not captured,10/30/2019,Not captured,Not captured,863949,020,00072,ARS-03-0053208,Essential America,Not captured,Not captured,Not captured,,Passport(XDC202505),Dependant,Hernandez Reyes,Armando,Jose,04/07/2003,male,Not captured,Not captured,Not captured,Not captured,Not captured,Not captured,Not captured,Not captured,Not captured,Not captured,Not captured,Not captured,Not captured,,,Not captured,Not captured,Not captured,Not captured,caya Bunita Bista (Tiema del Sal) #8,,Palm Beach,,.,17866169947,,Not captured,Not captured,jose.h@grupohersan.com.ve,Not captured,,,Not captured,Not captured,Not captured,Not captured,Not captured,Not captured,
Not captured,Not captured,10/30/2019,Not captured,Not captured,863949,020,00072,ARS-03-0053208,Essential America,Not captured,Not captured,Not captured,,Passport(XDC204702),Dependant,Hernandez Reyes,Sara ,Cloti,06/01/2004,female,Not captured,Not captured,Not captured,Not captured,Not captured,Not captured,Not captured,Not captured,Not captured,Not captured,Not captured,Not captured,Not captured,,,Not captured,Not captured,Not captured,Not captured,caya Bunita Bista (Tiema del Sal) #8,,Palm Beach,,.,17866169947,,Not captured,Not captured,jose.h@grupohersan.com.ve,Not captured,,,Not captured,Not captured,Not captured,Not captured,Not captured,Not captured,
Not captured,Not captured,10/27/2019,Not captured,Not captured,863949,020,00072,ARS-03-0053343,Essential America,Not captured,Not captured,Not captured,Passport(548658824),,,Appel,James,Eric,03/29/1973,male,Not captured,Not captured,Not captured,Not captured,Not captured,Not captured,Not captured,Not captured,Not captured,Not captured,Not captured,Not captured,Not captured,,,Not captured,Not captured,Not captured,Not captured,2089 Biltmore Point,,Longwood,Florida,32779,2404773327,,Not captured,Not captured,appeltwin1@gmail.com,Not captured,,,Not captured,Not captured,Not captured,Not captured,Not captured,Not captured,
Not captured,Not captured,10/27/2019,Not captured,Not captured,863949,020,00072,ARS-03-0053343,Essential America,Not captured,Not captured,Not captured,,Passport(211532130),Spouse,Andersen,Gry,Sarah Bindesboll,09/29/1977,female,Not captured,Not captured,Not captured,Not captured,Not captured,Not captured,Not captured,Not captured,Not captured,Not captured,Not captured,Not captured,Not captured,,,Not captured,Not captured,Not captured,Not captured,2089 Biltmore Point,,Longwood,Florida,32779,2404773327,,Not captured,Not captured,appeltwin1@gmail.com,Not captured,,,Not captured,Not captured,Not captured,Not captured,Not captured,Not captured,
Not captured,Not captured,10/27/2019,Not captured,Not captured,863949,020,00072,ARS-03-0053343,Essential America,Not captured,Not captured,Not captured,,Passport(545420429),Dependant,Appel,Miriam,Eva Bindesboll,06/26/2011,female,Not captured,Not captured,Not captured,Not captured,Not captured,Not captured,Not captured,Not captured,Not captured,Not captured,Not captured,Not captured,Not captured,,,Not captured,Not captured,Not captured,Not captured,2089 Biltmore Point,,Longwood,Florida,32779,2404773327,,Not captured,Not captured,appeltwin1@gmail.com,Not captured,,,Not captured,Not captured,Not captured,Not captured,Not captured,Not captured,
Not captured,Not captured,10/27/2019,Not captured,Not captured,863949,020,00072,ARS-03-0053343,Essential America,Not captured,Not captured,Not captured,,Passport(561889571),Dependant,Appel,Noah,Bindesboll,01/27/2013,male,Not captured,Not captured,Not captured,Not captured,Not captured,Not captured,Not captured,Not captured,Not captured,Not captured,Not captured,Not captured,Not captured,,,Not captured,Not captured,Not captured,Not captured,2089 Biltmore Point,,Longwood,Florida,32779,2404773327,,Not captured,Not captured,appeltwin1@gmail.com,Not captured,,,Not captured,Not captured,Not captured,Not captured,Not captured,Not captured,
Not captured,Not captured,10/27/2019,Not captured,Not captured,863949,020,00072,ARS-03-0053343,Essential America,Not captured,Not captured,Not captured,,Passport(210271502),Dependant,Appel,Isak,Simon Bindesboll,10/27/2014,male,Not captured,Not captured,Not captured,Not captured,Not captured,Not captured,Not captured,Not captured,Not captured,Not captured,Not captured,Not captured,Not captured,,,Not captured,Not captured,Not captured,Not captured,2089 Biltmore Point,,Longwood,Florida,32779,2404773327,,Not captured,Not captured,appeltwin1@gmail.com,Not captured,,,Not captured,Not captured,Not captured,Not captured,Not captured,Not captured,
Not captured,Not captured,10/22/2019,Not captured,Not captured,863949,020,00072,ARS-03-0053292,Essential America,Not captured,Not captured,Not captured,Driving License(15-265-0972),,,FRADIN,KIARA,NICOLE,06/30/2000,female,Not captured,Not captured,Not captured,Not captured,Not captured,Not captured,Not captured,Not captured,Not captured,Not captured,Not captured,Not captured,Not captured,,,Not captured,Not captured,Not captured,Not captured,2507 Red Hawk Ridge Dr,,CASTLE ROCK,Colorado,80109,3033632000,,Not captured,Not captured,SSFRADIN@GMAIL.COM,Not captured,,,Not captured,Not captured,Not captured,Not captured,Not captured,Not captured,
Not captured,Not captured,11/01/2019,Not captured,Not captured,863949,020,00072,ARS-03-0053271,Essential International,Not captured,Not captured,Not captured,Passport(ILS32010368197),,,Stasky,Chad,Christopher,07/11/1968,male,Not captured,Not captured,Not captured,Not captured,Not captured,Not captured,Not captured,Not captured,Not captured,Not captured,Not captured,Not captured,Not captured,,,Not captured,Not captured,Not captured,Not captured,Wisdom Court 5 Hatton Road,,Hong Kong,Mid Levels,111111,85294752326,,Not captured,Not captured,chad.stasky@gmail.com,Not captured,,,Not captured,Not captured,Not captured,Not captured,Not captured,Not captured,
Not captured,Not captured,10/18/2019,Not captured,Not captured,863949,020,00072,ARS-03-0053071,Essential International,Not captured,Not captured,Not captured,Passport(15FV22783),,,Milea,Dan,,02/07/1965,male,Not captured,Not captured,Not captured,Not captured,Not captured,Not captured,Not captured,Not captured,Not captured,Not captured,Not captured,Not captured,Not captured,,,Not captured,Not captured,Not captured,Not captured,9 maidstone road,,Singapore,,139459,6598307891,,Not captured,Not captured,dominiquemilea@yahoo.com,Not captured,,,Not captured,Not captured,Not captured,Not captured,Not captured,Not captured,
Not captured,Not captured,10/18/2019,Not captured,Not captured,863949,020,00072,ARS-03-0053071,Essential International,Not captured,Not captured,Not captured,,Passport(13fv24523),Spouse,Milea,Dominique,Francoise,07/13/1968,female,Not captured,Not captured,Not captured,Not captured,Not captured,Not captured,Not captured,Not captured,Not captured,Not captured,Not captured,Not captured,Not captured,,,Not captured,Not captured,Not captured,Not captured,9 maidstone road,,Singapore,,139459,6598307891,,Not captured,Not captured,dominiquemilea@yahoo.com,Not captured,,,Not captured,Not captured,Not captured,Not captured,Not captured,Not captured,
Not captured,Not captured,10/18/2019,Not captured,Not captured,863949,020,00072,ARS-03-0053071,Essential International,Not captured,Not captured,Not captured,,Passport(15CR99012),Dependant,Milea,Josephine,Daphne,02/17/2005,female,Not captured,Not captured,Not captured,Not captured,Not captured,Not captured,Not captured,Not captured,Not captured,Not captured,Not captured,Not captured,Not captured,,,Not captured,Not captured,Not captured,Not captured,9 maidstone road,,Singapore,,139459,6598307891,,Not captured,Not captured,dominiquemilea@yahoo.com,Not captured,,,Not captured,Not captured,Not captured,Not captured,Not captured,Not captured,
Not captured,Not captured,10/18/2019,Not captured,Not captured,863949,020,00072,ARS-03-0053193,Essential America,Not captured,Not captured,Not captured,Passport(K8854510),,,Devvrat,Dixit,,10/13/1990,male,Not captured,Not captured,Not captured,Not captured,Not captured,Not captured,Not captured,Not captured,Not captured,Not captured,Not captured,Not captured,Not captured,,,Not captured,Not captured,Not captured,Not captured,185 Ashoka Enclave - III,,Faridabad,Haryana,121003,9811448764,,Not captured,Not captured,dixit.devvat02@gmail.com,Not captured,,,Not captured,Not captured,Not captured,Not captured,Not captured,Not captured,
Not captured,Not captured,11/01/2019,Not captured,Not captured,863949,020,00072,ARS-03-0053079,Essential America,Not captured,Not captured,Not captured,Passport(490955195),,,Gellermann,Chantal,Marie,05/18/1963,female,Not captured,Not captured,Not captured,Not captured,Not captured,Not captured,Not captured,Not captured,Not captured,Not captured,Not captured,Not captured,Not captured,,,Not captured,Not captured,Not captured,Not captured,7511 overlook dr,,lake worth,Florida,33467,5612812209,,Not captured,Not captured,cgellerm@gmail.com,Not captured,,,Not captured,Not captured,Not captured,Not captured,Not captured,Not captured,
Not captured,Not captured,11/01/2019,Not captured,Not captured,863949,020,00072,ARS-03-0053079,Essential America,Not captured,Not captured,Not captured,,Passport(490955201),Spouse,Gellermann,Norbert,Gerhardt,02/16/1957,male,Not captured,Not captured,Not captured,Not captured,Not captured,Not captured,Not captured,Not captured,Not captured,Not captured,Not captured,Not captured,Not captured,,,Not captured,Not captured,Not captured,Not captured,7511 overlook dr,,lake worth,Florida,33467,5612812209,,Not captured,Not captured,cgellerm@gmail.com,Not captured,,,Not captured,Not captured,Not captured,Not captured,Not captured,Not captured,
Not captured,Not captured,10/10/2019,Not captured,Not captured,863949,020,00072,ARS-03-0053059,Essential America,Not captured,Not captured,Not captured,Passport(NA),,,DE ANGELIS,CONSTANZO,,09/26/1959,male,Not captured,Not captured,Not captured,Not captured,Not captured,Not captured,Not captured,Not captured,Not captured,Not captured,Not captured,Not captured,Not captured,,,Not captured,Not captured,Not captured,Not captured,4925 BAL HARBOR,,CHATTANOOGA,Tennessee,37416,9496373936,,Not captured,Not captured,mbazaar1@yahoo.com,Not captured,,,Not captured,Not captured,Not captured,Not captured,Not captured,Not captured,
Not captured,Not captured,10/10/2019,Not captured,Not captured,863949,020,00072,ARS-03-0053059,Essential America,Not captured,Not captured,Not captured,,Passport(NA),Spouse,DE ANGELIS,CAROL,,08/08/1964,female,Not captured,Not captured,Not captured,Not captured,Not captured,Not captured,Not captured,Not captured,Not captured,Not captured,Not captured,Not captured,Not captured,,,Not captured,Not captured,Not captured,Not captured,4925 BAL HARBOR,,CHATTANOOGA,Tennessee,37416,9496373936,,Not captured,Not captured,mbazaar1@yahoo.com,Not captured,,,Not captured,Not captured,Not captured,Not captured,Not captured,Not captured,
Not captured,Not captured,10/09/2019,Not captured,Not captured,863949,020,00072,ARS-04-0053017,Enhanced America,Not captured,Not captured,Not captured,SSN(322418265),,,Smith Foreman,Pippa,Rose,09/10/2019,female,Not captured,Not captured,Not captured,Not captured,Not captured,Not captured,Not captured,Not captured,Not captured,Not captured,Not captured,Not captured,Not captured,,,Not captured,Not captured,Not captured,Not captured,Brandenburry Barn Collier Street,,Kent,England,TN129RH,4076833457,,Not captured,Not captured,service@azimuthrisk.com,Not captured,,,Not captured,Not captured,Not captured,Not captured,Not captured,Not captured,
Not captured,Not captured,10/08/2019,Not captured,Not captured,863949,020,00072,ARS-03-0052830,Essential America,Not captured,Not captured,Not captured,Driving License(VA893751),,,Kilari,Sivaramaiah,,05/30/1982,male,Not captured,Not captured,Not captured,Not captured,Not captured,Not captured,Not captured,Not captured,Not captured,Not captured,Not captured,Not captured,Not captured,,,Not captured,Not captured,Not captured,Not captured,obulesunipalle village,,AP,Andhra Pradesh,522612,2035723554,,Not captured,Not captured,aruna.yaganti87@gmail.com,Not captured,,,Not captured,Not captured,Not captured,Not captured,Not captured,Not captured,
Not captured,Not captured,10/08/2019,Not captured,Not captured,863949,020,00072,ARS-03-0052830,Essential America,Not captured,Not captured,Not captured,,SSN(116699296),Spouse,Yaganti,Aruna,,07/01/1987,female,Not captured,Not captured,Not captured,Not captured,Not captured,Not captured,Not captured,Not captured,Not captured,Not captured,Not captured,Not captured,Not captured,,,Not captured,Not captured,Not captured,Not captured,obulesunipalle village,,AP,Andhra Pradesh,522612,2035723554,,Not captured,Not captured,aruna.yaganti87@gmail.com,Not captured,,,Not captured,Not captured,Not captured,Not captured,Not captured,Not captured,