EE Transaction Type,Dependent Transaction Type,Effective Date,EE Signature,EE Signature Date,Control,Suffix,Account,Plan Number,Plan Name,Claim Office,Network ID Number,Customer Code,EE SSN,Dependent SSN,Dependent Relationship,Last Name,First Name,Middle Initial,DOB,Gender,Ethnicity,PCP/PCD,PCP/PCD Current Patient,Provider Cap Office Number,COB,Dep Student Indicator,Dep OOA Indicator,EE Prior Coverage Indicator,EE Late Entrant,EE Language Indicator,Hire Date,Earnings,Earnings Frequency,Beneficiary (Last Name First Name MI),Beneficiary Relationship,Continuation of Coverage Expiration Date,Continuation of Coverage Event Date,Continuation of Coverage Length of Coverage,Work Location Zip Code,Street Address Line 1,Street Address Line 2,City,State,Zip Code,Home Phone Number,Work Phone Number,Accept Code,Evidence Code,EE Email Address,Communication Disability Code,EE Alternate ID,Dep Alternate ID,Old Control,Old Suffix,Old Account,New Control,New Suffix,New Account,
Not captured,Not captured,10/18/2019,Not captured,Not captured,863949,020,00072,ARS-03-0053071,Essential International,Not captured,Not captured,Not captured,Passport(15FV22783),,,Milea,Dan,,02/07/1965,male,Not captured,Not captured,Not captured,Not captured,Not captured,Not captured,Not captured,Not captured,Not captured,Not captured,Not captured,Not captured,Not captured,,,Not captured,Not captured,Not captured,Not captured,9 maidstone road,,Singapore,,139459,6598307891,,Not captured,Not captured,dominiquemilea@yahoo.com,Not captured,701941407,,Not captured,Not captured,Not captured,Not captured,Not captured,Not captured,
Not captured,Not captured,10/18/2019,Not captured,Not captured,863949,020,00072,ARS-03-0053071,Essential International,Not captured,Not captured,Not captured,,Passport(13fv24523),Spouse,Milea,Dominique,Francoise,07/13/1968,female,Not captured,Not captured,Not captured,Not captured,Not captured,Not captured,Not captured,Not captured,Not captured,Not captured,Not captured,Not captured,Not captured,,,Not captured,Not captured,Not captured,Not captured,9 maidstone road,,Singapore,,139459,6598307891,,Not captured,Not captured,dominiquemilea@yahoo.com,Not captured,,701941408,Not captured,Not captured,Not captured,Not captured,Not captured,Not captured,
Not captured,Not captured,10/18/2019,Not captured,Not captured,863949,020,00072,ARS-03-0053071,Essential International,Not captured,Not captured,Not captured,,Passport(15CR99012),Dependant,Milea,Josephine,Daphne,02/17/2005,female,Not captured,Not captured,Not captured,Not captured,Not captured,Not captured,Not captured,Not captured,Not captured,Not captured,Not captured,Not captured,Not captured,,,Not captured,Not captured,Not captured,Not captured,9 maidstone road,,Singapore,,139459,6598307891,,Not captured,Not captured,dominiquemilea@yahoo.com,Not captured,,701941409,Not captured,Not captured,Not captured,Not captured,Not captured,Not captured,
Not captured,Not captured,10/18/2019,Not captured,Not captured,863949,020,00072,ARS-03-0053193,Essential America,Not captured,Not captured,Not captured,Passport(K8854510),,,Devvrat,Dixit,,10/13/1990,male,Not captured,Not captured,Not captured,Not captured,Not captured,Not captured,Not captured,Not captured,Not captured,Not captured,Not captured,Not captured,Not captured,,,Not captured,Not captured,Not captured,Not captured,185 Ashoka Enclave - III,,Faridabad,Haryana,121003,9811448764,,Not captured,Not captured,dixit.devvat02@gmail.com,Not captured,701941610,,Not captured,Not captured,Not captured,Not captured,Not captured,Not captured,
Not captured,Not captured,10/20/2019,Not captured,Not captured,863949,020,00072,ARS-01-0053265,Beacon International,Not captured,Not captured,Not captured,,,,De Mel,Glen,,06/30/1987,male,Not captured,Not captured,Not captured,Not captured,Not captured,Not captured,Not captured,Not captured,Not captured,Not captured,Not captured,Not captured,Not captured,,,Not captured,Not captured,Not captured,Not captured,9 Karnwood Drive,,Toronto,Ontario,M1L2Z2,,,Not captured,Not captured,glend@outlook.com,Not captured,701941732,,Not captured,Not captured,Not captured,Not captured,Not captured,Not captured,
Not captured,Not captured,10/20/2019,Not captured,Not captured,863949,020,00072,ARS-01-0053263,Beacon International,Not captured,Not captured,Not captured,,,,Kenworthy,Tim,D,01/14/1954,male,Not captured,Not captured,Not captured,Not captured,Not captured,Not captured,Not captured,Not captured,Not captured,Not captured,Not captured,Not captured,Not captured,,,Not captured,Not captured,Not captured,Not captured,3085 W. Ledyard Wy.,,Aptos,California,95003,,,Not captured,Not captured,tdkenworthy24@comcast.net,Not captured,701941730,,Not captured,Not captured,Not captured,Not captured,Not captured,Not captured,
Not captured,Not captured,10/20/2019,Not captured,Not captured,863949,020,00072,OVI-28-0053262,OverseasCare Visitors Insurance Plan,Not captured,Not captured,Not captured,Passport(EG7580162),,,Yin,Xiaoling,,08/18/1957,female,Not captured,Not captured,Not captured,Not captured,Not captured,Not captured,Not captured,Not captured,Not captured,Not captured,Not captured,Not captured,Not captured,Qimin Wang,child,Not captured,Not captured,Not captured,Not captured,79405 hwy 111,,LA QUINTA,California,92253,3104981761,,Not captured,Not captured,cwradi@GMAIL.COM,Not captured,701941729,,Not captured,Not captured,Not captured,Not captured,Not captured,Not captured,
Not captured,Not captured,10/20/2019,Not captured,Not captured,863949,020,00072,OVI-28-0053261,OverseasCare Visitors Insurance Plan,Not captured,Not captured,Not captured,Passport(EG7580162),,,Wang,Yijun,,07/28/1954,male,Not captured,Not captured,Not captured,Not captured,Not captured,Not captured,Not captured,Not captured,Not captured,Not captured,Not captured,Not captured,Not captured,Qimin Wang,child,Not captured,Not captured,Not captured,Not captured,79405 hwy 111,,LA QUINTA,California,92253,3104981761,,Not captured,Not captured,cwradi@GMAIL.COM,Not captured,701941728,,Not captured,Not captured,Not captured,Not captured,Not captured,Not captured,
Not captured,Not captured,10/20/2019,Not captured,Not captured,863949,020,00072,ARS-01-0053260,Beacon International,Not captured,Not captured,Not captured,,,,Meyers,Patricia,S,10/20/1936,female,Not captured,Not captured,Not captured,Not captured,Not captured,Not captured,Not captured,Not captured,Not captured,Not captured,Not captured,Not captured,Not captured,,,Not captured,Not captured,Not captured,Not captured,1330 Union Street,,Manchester,New Hampshire,03104,,,Not captured,Not captured,pmeyers66@aol.com,Not captured,701941727,,Not captured,Not captured,Not captured,Not captured,Not captured,Not captured,
Not captured,Not captured,10/20/2019,Not captured,Not captured,863949,020,00072,ARS-01-0053259,Beacon International,Not captured,Not captured,Not captured,,,,Lee,Yeonseung,,05/11/1988,female,Not captured,Not captured,Not captured,Not captured,Not captured,Not captured,Not captured,Not captured,Not captured,Not captured,Not captured,Not captured,Not captured,,,Not captured,Not captured,Not captured,Not captured,830 Magenta st.,,Bronx,New York,10467,,,Not captured,Not captured,leeysjj@gmail.com,Not captured,701941726,,Not captured,Not captured,Not captured,Not captured,Not captured,Not captured,
Not captured,Not captured,10/20/2019,Not captured,Not captured,863949,020,00072,ARS-01-0053258,Beacon International,Not captured,Not captured,Not captured,,,,Minton,Kathryn,L,01/16/1967,female,Not captured,Not captured,Not captured,Not captured,Not captured,Not captured,Not captured,Not captured,Not captured,Not captured,Not captured,Not captured,Not captured,,,Not captured,Not captured,Not captured,Not captured,1084 Huntington,,Troy,Missouri,63379,,,Not captured,Not captured,Katieminton21@gmail.com,Not captured,701941725,,Not captured,Not captured,Not captured,Not captured,Not captured,Not captured,
Not captured,Not captured,10/20/2019,Not captured,Not captured,863949,020,00072,ARS-01-0053257,Beacon International,Not captured,Not captured,Not captured,,,,Minton,Michael,L,03/16/1967,female,Not captured,Not captured,Not captured,Not captured,Not captured,Not captured,Not captured,Not captured,Not captured,Not captured,Not captured,Not captured,Not captured,,,Not captured,Not captured,Not captured,Not captured,1084 Huntington,,Troy,Missouri,63379,,,Not captured,Not captured,Katieminton21@gmail.com,Not captured,701941724,,Not captured,Not captured,Not captured,Not captured,Not captured,Not captured,
Not captured,Not captured,10/19/2019,Not captured,Not captured,863949,020,00072,ARS-01-0053254,Beacon International,Not captured,Not captured,Not captured,,,,Schuessler,Michael,,04/07/1990,male,Not captured,Not captured,Not captured,Not captured,Not captured,Not captured,Not captured,Not captured,Not captured,Not captured,Not captured,Not captured,Not captured,,,Not captured,Not captured,Not captured,Not captured,1811 Termino Ave.,,Long Beach,California,90815,,,Not captured,Not captured,mike.t.schuessler@gmail.com,Not captured,701941700,,Not captured,Not captured,Not captured,Not captured,Not captured,Not captured,
Not captured,Not captured,10/19/2019,Not captured,Not captured,863949,020,00072,ARS-01-0053253,Beacon International,Not captured,Not captured,Not captured,,,,Castellanos,Kelly,L,12/22/1967,female,Not captured,Not captured,Not captured,Not captured,Not captured,Not captured,Not captured,Not captured,Not captured,Not captured,Not captured,Not captured,Not captured,,,Not captured,Not captured,Not captured,Not captured,2819 Staples Ave,,Key West,Florida,33040,,,Not captured,Not captured,mingo@mingosndcollc.com,Not captured,701941699,,Not captured,Not captured,Not captured,Not captured,Not captured,Not captured,
Not captured,Not captured,10/19/2019,Not captured,Not captured,863949,020,00072,ARS-01-0053252,Beacon International,Not captured,Not captured,Not captured,,,,Castellanos,Domingo,G,10/11/1963,male,Not captured,Not captured,Not captured,Not captured,Not captured,Not captured,Not captured,Not captured,Not captured,Not captured,Not captured,Not captured,Not captured,,,Not captured,Not captured,Not captured,Not captured,2819 Staples Ave,,Key West,Florida,33040,,,Not captured,Not captured,mingo@mingosndcollc.com,Not captured,701941698,,Not captured,Not captured,Not captured,Not captured,Not captured,Not captured,
Not captured,Not captured,10/20/2019,Not captured,Not captured,863949,020,00072,ARS-01-0053251,Beacon International,Not captured,Not captured,Not captured,Passport(468681771),,,FONTANEZ,DANIEL,,09/18/1971,male,Not captured,Not captured,Not captured,Not captured,Not captured,Not captured,Not captured,Not captured,Not captured,Not captured,Not captured,Not captured,Not captured,JACQUELINE MARTELL,WIFE,Not captured,Not captured,Not captured,Not captured,38 BERESFORD DR,,METAIRIE,Louisiana,70001,5043776041,,Not captured,Not captured,NEZTELL@YAHOO.COM,Not captured,701941697,,Not captured,Not captured,Not captured,Not captured,Not captured,Not captured,
Not captured,Not captured,10/19/2019,Not captured,Not captured,863949,020,00072,ARS-01-0053240,Beacon International,Not captured,Not captured,Not captured,Passport(NA),,,MELTON,LESLEY,,03/15/1947,female,Not captured,Not captured,Not captured,Not captured,Not captured,Not captured,Not captured,Not captured,Not captured,Not captured,Not captured,Not captured,Not captured,MARHEA LIBOIRON,daughter,Not captured,Not captured,Not captured,Not captured,120 COUNTRY CLUB PLACE,,EDMONTON,Alberta,T6M2H7,7802374818,,Not captured,Not captured,cjam@shaw.ca,Not captured,701941684,,Not captured,Not captured,Not captured,Not captured,Not captured,Not captured,
Not captured,Not captured,10/19/2019,Not captured,Not captured,863949,020,00072,ARS-01-0053239,Beacon International,Not captured,Not captured,Not captured,Passport(C4FVR0214),,,Heidler,Ulrike,,03/09/1982,female,Not captured,Not captured,Not captured,Not captured,Not captured,Not captured,Not captured,Not captured,Not captured,Not captured,Not captured,Not captured,Not captured,Karl-Heinz Heidler,father,Not captured,Not captured,Not captured,Not captured,1001 N. 19th Street Suite 1200,,Arlington,Virginia,22209,703-945-1079,,Not captured,Not captured,ulrike.heidler@coremedia.com,Not captured,701941683,,Not captured,Not captured,Not captured,Not captured,Not captured,Not captured,
Not captured,Not captured,10/18/2019,Not captured,Not captured,863949,020,00072,ARS-01-0053237,Beacon International,Not captured,Not captured,Not captured,Passport(AAD567188),,,Marquez Gauna,Santiago Gabriel,,07/06/1977,male,Not captured,Not captured,Not captured,Not captured,Not captured,Not captured,Not captured,Not captured,Not captured,Not captured,Not captured,Not captured,Not captured,,,Not captured,Not captured,Not captured,Not captured,2425 Wilson Blvd.,,Arlington,Virginia,22201,7038415641,,Not captured,Not captured,pamruthkumar@ncsc.org,Not captured,701941681,,Not captured,Not captured,Not captured,Not captured,Not captured,Not captured,
Not captured,Not captured,10/19/2019,Not captured,Not captured,863949,020,00072,ARS-01-0053236,Beacon International,Not captured,Not captured,Not captured,Passport(B01142157),,,Mendez Palomo,Miguel Antonio,,05/10/1966,male,Not captured,Not captured,Not captured,Not captured,Not captured,Not captured,Not captured,Not captured,Not captured,Not captured,Not captured,Not captured,Not captured,,,Not captured,Not captured,Not captured,Not captured,2425 Wilson Blvd.,,Arlington,Virginia,22201,7038415641,,Not captured,Not captured,pamruthkumar@ncsc.org,Not captured,701941680,,Not captured,Not captured,Not captured,Not captured,Not captured,Not captured,
Not captured,Not captured,10/18/2019,Not captured,Not captured,863949,020,00072,ARS-01-0053235,Beacon International,Not captured,Not captured,Not captured,,,,Emerick,Patrick,J,05/14/1963,male,Not captured,Not captured,Not captured,Not captured,Not captured,Not captured,Not captured,Not captured,Not captured,Not captured,Not captured,Not captured,Not captured,,,Not captured,Not captured,Not captured,Not captured,1623 James Drive,,Carlsbad,California,92008,,,Not captured,Not captured,hlefrois@yahoo.com,Not captured,701941679,,Not captured,Not captured,Not captured,Not captured,Not captured,Not captured,
Not captured,Not captured,10/18/2019,Not captured,Not captured,863949,020,00072,ARS-01-0053234,Beacon International,Not captured,Not captured,Not captured,,,,LeFrois,Holly,A,07/24/1963,female,Not captured,Not captured,Not captured,Not captured,Not captured,Not captured,Not captured,Not captured,Not captured,Not captured,Not captured,Not captured,Not captured,,,Not captured,Not captured,Not captured,Not captured,1623 James Drive,,Carlsbad,California,92008,,,Not captured,Not captured,hlefrois@yahoo.com,Not captured,701941678,,Not captured,Not captured,Not captured,Not captured,Not captured,Not captured,
Not captured,Not captured,10/18/2019,Not captured,Not captured,863949,020,00072,ARS-02-0053233,Beacon America,Not captured,Not captured,Not captured,,,,Landau,Salomon,,03/01/2019,male,Not captured,Not captured,Not captured,Not captured,Not captured,Not captured,Not captured,Not captured,Not captured,Not captured,Not captured,Not captured,Not captured,,,Not captured,Not captured,Not captured,Not captured,2 Lubin Way,,Monroe,New York,10950,8455457857,,Not captured,Not captured,landau545@gmail.com,Not captured,701941677,,Not captured,Not captured,Not captured,Not captured,Not captured,Not captured,
Not captured,Not captured,10/18/2019,Not captured,Not captured,863949,020,00072,ARS-02-0053232,Beacon America,Not captured,Not captured,Not captured,,,,Landau,Breindel,,09/28/2017,female,Not captured,Not captured,Not captured,Not captured,Not captured,Not captured,Not captured,Not captured,Not captured,Not captured,Not captured,Not captured,Not captured,,,Not captured,Not captured,Not captured,Not captured,2 Lubin Way,,Monroe,New York,10950,8455457857,,Not captured,Not captured,landau545@gmail.com,Not captured,701941676,,Not captured,Not captured,Not captured,Not captured,Not captured,Not captured,
Not captured,Not captured,10/18/2019,Not captured,Not captured,863949,020,00072,ARS-02-0053231,Beacon America,Not captured,Not captured,Not captured,,,,Landau,Sarah,,11/21/1997,female,Not captured,Not captured,Not captured,Not captured,Not captured,Not captured,Not captured,Not captured,Not captured,Not captured,Not captured,Not captured,Not captured,,,Not captured,Not captured,Not captured,Not captured,2 Lubin Way,,Monroe,New York,10950,8455457857,,Not captured,Not captured,landau545@gmail.com,Not captured,701941675,,Not captured,Not captured,Not captured,Not captured,Not captured,Not captured,
Not captured,Not captured,10/18/2019,Not captured,Not captured,863949,020,00072,ARS-02-0053230,Beacon America,Not captured,Not captured,Not captured,,,,Landau,Wolf,,03/22/1997,male,Not captured,Not captured,Not captured,Not captured,Not captured,Not captured,Not captured,Not captured,Not captured,Not captured,Not captured,Not captured,Not captured,,,Not captured,Not captured,Not captured,Not captured,2 Lubin Way,,Monroe,New York,10950,8455457857,,Not captured,Not captured,landau545@gmail.com,Not captured,701941674,,Not captured,Not captured,Not captured,Not captured,Not captured,Not captured,
Not captured,Not captured,10/19/2019,Not captured,Not captured,863949,020,00072,ARS-02-0053227,Beacon America,Not captured,Not captured,Not captured,Passport(141818874),,,BLANCO CHCON,ANA BELKY,ABBC,07/17/1960,female,Not captured,Not captured,Not captured,Not captured,Not captured,Not captured,Not captured,Not captured,Not captured,Not captured,Not captured,Not captured,Not captured,RIGOBERTO A ECHEVERRIA M,ESPOSO,Not captured,Not captured,Not captured,Not captured,209 SAUNDERS AVE,,BRIDGEPORT,CONNECTICUT,06606,0012032869267,00582758810393,Not captured,Not captured,leamigo_1@hotmail.com,Not captured,701941671,,Not captured,Not captured,Not captured,Not captured,Not captured,Not captured,
Not captured,Not captured,10/18/2019,Not captured,Not captured,863949,020,00072,ARS-01-0053226,Beacon International,Not captured,Not captured,Not captured,,,,Feldman,Gabriel,A,02/16/1989,male,Not captured,Not captured,Not captured,Not captured,Not captured,Not captured,Not captured,Not captured,Not captured,Not captured,Not captured,Not captured,Not captured,,,Not captured,Not captured,Not captured,Not captured,4489 Broadway,,New York,New York,10040,,,Not captured,Not captured,gabefutbol21689@gmail.com,Not captured,701941670,,Not captured,Not captured,Not captured,Not captured,Not captured,Not captured,
Not captured,Not captured,10/18/2019,Not captured,Not captured,863949,020,00072,ARS-01-0053225,Beacon International,Not captured,Not captured,Not captured,,,,Pike,Heidi,J,01/28/1969,female,Not captured,Not captured,Not captured,Not captured,Not captured,Not captured,Not captured,Not captured,Not captured,Not captured,Not captured,Not captured,Not captured,,,Not captured,Not captured,Not captured,Not captured,7521 s Madison cir,,Centennial,Colorado,80122,,,Not captured,Not captured,pikepaul2000@yahoo.com,Not captured,701941669,,Not captured,Not captured,Not captured,Not captured,Not captured,Not captured,
Not captured,Not captured,10/18/2019,Not captured,Not captured,863949,020,00072,ARS-01-0053224,Beacon International,Not captured,Not captured,Not captured,,,,Pike,Paul,S,04/21/1965,male,Not captured,Not captured,Not captured,Not captured,Not captured,Not captured,Not captured,Not captured,Not captured,Not captured,Not captured,Not captured,Not captured,,,Not captured,Not captured,Not captured,Not captured,7521 s Madison cir,,Centennial,Colorado,80122,,,Not captured,Not captured,pikepaul2000@yahoo.com,Not captured,701941668,,Not captured,Not captured,Not captured,Not captured,Not captured,Not captured,
Not captured,Not captured,10/18/2019,Not captured,Not captured,863949,020,00072,ARS-01-0053223,Beacon International,Not captured,Not captured,Not captured,,,,Huebecker,Lars,,11/15/1970,male,Not captured,Not captured,Not captured,Not captured,Not captured,Not captured,Not captured,Not captured,Not captured,Not captured,Not captured,Not captured,Not captured,,,Not captured,Not captured,Not captured,Not captured,3711 Baccurate Way,,Marietta,Georgia,30062,,,Not captured,Not captured,allthatforus@gmail.com,Not captured,701941667,,Not captured,Not captured,Not captured,Not captured,Not captured,Not captured,
Not captured,Not captured,10/18/2019,Not captured,Not captured,863949,020,00072,ARS-01-0053222,Beacon International,Not captured,Not captured,Not captured,,,,Huebecker,Cheryl,A,07/19/1970,female,Not captured,Not captured,Not captured,Not captured,Not captured,Not captured,Not captured,Not captured,Not captured,Not captured,Not captured,Not captured,Not captured,,,Not captured,Not captured,Not captured,Not captured,3711 Baccurate Way,,Marietta,Georgia,30062,,,Not captured,Not captured,allthatforus@gmail.com,Not captured,701941666,,Not captured,Not captured,Not captured,Not captured,Not captured,Not captured,
Not captured,Not captured,10/18/2019,Not captured,Not captured,863949,020,00072,ARS-01-0053219,Beacon International,Not captured,Not captured,Not captured,,,,Jones,Bronwyn,M,08/19/1970,female,Not captured,Not captured,Not captured,Not captured,Not captured,Not captured,Not captured,Not captured,Not captured,Not captured,Not captured,Not captured,Not captured,,,Not captured,Not captured,Not captured,Not captured,132 E. 35th Street #7E,,New York City,New York,10016,,,Not captured,Not captured,bronwyn@me.com,Not captured,701941660,,Not captured,Not captured,Not captured,Not captured,Not captured,Not captured,
Not captured,Not captured,10/19/2019,Not captured,Not captured,863949,020,00072,ARS-01-0053218,Beacon International,Not captured,Not captured,Not captured,,,,gridley,jill,,01/26/1964,female,Not captured,Not captured,Not captured,Not captured,Not captured,Not captured,Not captured,Not captured,Not captured,Not captured,Not captured,Not captured,Not captured,,,Not captured,Not captured,Not captured,Not captured,189 west shore drive,,marblehead,Massachusetts,01945,,,Not captured,Not captured,david.gridley@ge.com,Not captured,701941659,,Not captured,Not captured,Not captured,Not captured,Not captured,Not captured,
Not captured,Not captured,10/19/2019,Not captured,Not captured,863949,020,00072,ARS-01-0053217,Beacon International,Not captured,Not captured,Not captured,,,,gridley,david,a,10/30/1952,male,Not captured,Not captured,Not captured,Not captured,Not captured,Not captured,Not captured,Not captured,Not captured,Not captured,Not captured,Not captured,Not captured,,,Not captured,Not captured,Not captured,Not captured,189 west shore drive,,marblehead,Massachusetts,01945,,,Not captured,Not captured,david.gridley@ge.com,Not captured,701941658,,Not captured,Not captured,Not captured,Not captured,Not captured,Not captured,
Not captured,Not captured,10/18/2019,Not captured,Not captured,863949,020,00072,ARS-02-0053216,Beacon America,Not captured,Not captured,Not captured,,,,Katz,Yerachmiel,,06/11/2018,male,Not captured,Not captured,Not captured,Not captured,Not captured,Not captured,Not captured,Not captured,Not captured,Not captured,Not captured,Not captured,Not captured,,,Not captured,Not captured,Not captured,Not captured,98 Aspen Ct,,Lakewood,New Jersey,08701,7328867583,,Not captured,Not captured,Doublejkatz@gmail.com,Not captured,701941657,,Not captured,Not captured,Not captured,Not captured,Not captured,Not captured,