EE Transaction Type,Dependent Transaction Type,Effective Date,EE Signature,EE Signature Date,Control,Suffix,Account,Plan Number,Plan Name,Claim Office,Network ID Number,Customer Code,EE SSN,Dependent SSN,Dependent Relationship,Last Name,First Name,Middle Initial,DOB,Gender,Ethnicity,PCP/PCD,PCP/PCD Current Patient,Provider Cap Office Number,COB,Dep Student Indicator,Dep OOA Indicator,EE Prior Coverage Indicator,EE Late Entrant,EE Language Indicator,Hire Date,Earnings,Earnings Frequency,Beneficiary (Last Name First Name MI),Beneficiary Relationship,Continuation of Coverage Expiration Date,Continuation of Coverage Event Date,Continuation of Coverage Length of Coverage,Work Location Zip Code,Street Address Line 1,Street Address Line 2,City,State,Zip Code,Home Phone Number,Work Phone Number,Accept Code,Evidence Code,EE Email Address,Communication Disability Code,EE Alternate ID,Dep Alternate ID,Old Control,Old Suffix,Old Account,New Control,New Suffix,New Account,
Not captured,Not captured,10/13/2019,Not captured,Not captured,863949,020,00072,ARS-01-0053151,Beacon International,Not captured,Not captured,Not captured,,,,Sahgal,Rohan,,05/19/1984,male,Not captured,Not captured,Not captured,Not captured,Not captured,Not captured,Not captured,Not captured,Not captured,Not captured,Not captured,Not captured,Not captured,,,Not captured,Not captured,Not captured,Not captured,2315 Van Ness Ave,,San Francisco,California,94109,,,Not captured,Not captured,rohansahgal@gmail.com,Not captured,701941542,,Not captured,Not captured,Not captured,Not captured,Not captured,Not captured,
Not captured,Not captured,10/12/2019,Not captured,Not captured,863949,020,00072,ARS-02-0053149,Beacon America,Not captured,Not captured,Not captured,,,,Cao,Trang Minh Tu,,01/01/1980,male,Not captured,Not captured,Not captured,Not captured,Not captured,Not captured,Not captured,Not captured,Not captured,Not captured,Not captured,Not captured,Not captured,,,Not captured,Not captured,Not captured,Not captured,6595 Fleming st,,Vancouver,British Columbia,V5p3h3,,,Not captured,Not captured,tucaotrang@gmail.com,Not captured,701941540,,Not captured,Not captured,Not captured,Not captured,Not captured,Not captured,
Not captured,Not captured,10/12/2019,Not captured,Not captured,863949,020,00072,ARS-02-0053148,Beacon America,Not captured,Not captured,Not captured,,,,Dougnac Labatut,Valeria,,08/24/1964,female,Not captured,Not captured,Not captured,Not captured,Not captured,Not captured,Not captured,Not captured,Not captured,Not captured,Not captured,Not captured,Not captured,,,Not captured,Not captured,Not captured,Not captured,Camarico 13755,,Santiago,,7561469,,,Not captured,Not captured,rcaro@pro-tg.com,Not captured,701941539,,Not captured,Not captured,Not captured,Not captured,Not captured,Not captured,
Not captured,Not captured,10/12/2019,Not captured,Not captured,863949,020,00072,ARS-02-0053147,Beacon America,Not captured,Not captured,Not captured,,,,Caro Marambio,Ruben,,09/11/1959,male,Not captured,Not captured,Not captured,Not captured,Not captured,Not captured,Not captured,Not captured,Not captured,Not captured,Not captured,Not captured,Not captured,,,Not captured,Not captured,Not captured,Not captured,Camarico 13755,,Santiago,,7561469,,,Not captured,Not captured,rcaro@pro-tg.com,Not captured,701941538,,Not captured,Not captured,Not captured,Not captured,Not captured,Not captured,
Not captured,Not captured,10/12/2019,Not captured,Not captured,863949,020,00072,ARS-02-0053146,Beacon America,Not captured,Not captured,Not captured,,,,Haihong,Ma,,10/17/1968,female,Not captured,Not captured,Not captured,Not captured,Not captured,Not captured,Not captured,Not captured,Not captured,Not captured,Not captured,Not captured,Not captured,,,Not captured,Not captured,Not captured,Not captured,1918 Wilmette Ave,,Wilmette,Illinois,60091,.,,Not captured,Not captured,lichengclaire@gmail.com,Not captured,701941537,,Not captured,Not captured,Not captured,Not captured,Not captured,Not captured,
Not captured,Not captured,10/12/2019,Not captured,Not captured,863949,020,00072,ARS-01-0053145,Beacon International,Not captured,Not captured,Not captured,Passport(55095663),,,Bradley,Coranetta,,01/13/1969,female,Not captured,Not captured,Not captured,Not captured,Not captured,Not captured,Not captured,Not captured,Not captured,Not captured,Not captured,Not captured,Not captured,Columbus Wheeler ,7067616776,Not captured,Not captured,Not captured,Not captured,3343 Tewson Drive,,Columbus,Georgia,31909,7065775838,,Not captured,Not captured,coranetta@gmail.com,Not captured,701941536,,Not captured,Not captured,Not captured,Not captured,Not captured,Not captured,
Not captured,Not captured,10/12/2019,Not captured,Not captured,863949,020,00072,ARS-02-0053144,Beacon America,Not captured,Not captured,Not captured,,,,Chakraborty,Ishita,,11/14/2017,female,Not captured,Not captured,Not captured,Not captured,Not captured,Not captured,Not captured,Not captured,Not captured,Not captured,Not captured,Not captured,Not captured,,,Not captured,Not captured,Not captured,Not captured,4 BEACON WAY,,Jersey City,New Jersey,07304,,,Not captured,Not captured,anuradha.s.mehta@gmail.com,Not captured,701941535,,Not captured,Not captured,Not captured,Not captured,Not captured,Not captured,
Not captured,Not captured,10/12/2019,Not captured,Not captured,863949,020,00072,ARS-02-0053143,Beacon America,Not captured,Not captured,Not captured,,,,Mehta,Anuradha,S,11/01/1986,female,Not captured,Not captured,Not captured,Not captured,Not captured,Not captured,Not captured,Not captured,Not captured,Not captured,Not captured,Not captured,Not captured,,,Not captured,Not captured,Not captured,Not captured,4 BEACON WAY,,Jersey City,New Jersey,07304,,,Not captured,Not captured,anuradha.s.mehta@gmail.com,Not captured,701941534,,Not captured,Not captured,Not captured,Not captured,Not captured,Not captured,
Not captured,Not captured,10/11/2019,Not captured,Not captured,863949,020,00072,ARS-02-0053141,Beacon America,Not captured,Not captured,Not captured,,,,Rusyi,Dmytro,,04/16/1982,male,Not captured,Not captured,Not captured,Not captured,Not captured,Not captured,Not captured,Not captured,Not captured,Not captured,Not captured,Not captured,Not captured,,,Not captured,Not captured,Not captured,Not captured,Drevlansakaya st. 24a ap.13,,Rivne,,33013,,,Not captured,Not captured,drusyy@codeminders.com,Not captured,701941532,,Not captured,Not captured,Not captured,Not captured,Not captured,Not captured,
Not captured,Not captured,10/13/2019,Not captured,Not captured,863949,020,00072,ARS-02-0053139,Beacon America,Not captured,Not captured,Not captured,,,,Cohen,Gittle N ,,04/22/2018,male,Not captured,Not captured,Not captured,Not captured,Not captured,Not captured,Not captured,Not captured,Not captured,Not captured,Not captured,Not captured,Not captured,,,Not captured,Not captured,Not captured,Not captured,422 Passaic Ave,,Passaic,New Jersey,07055,917-445-9986,,Not captured,Not captured,scjcohen@gmail.com,Not captured,701941511,,Not captured,Not captured,Not captured,Not captured,Not captured,Not captured,
Not captured,Not captured,10/13/2019,Not captured,Not captured,863949,020,00072,ARS-02-0053138,Beacon America,Not captured,Not captured,Not captured,,,,Cohen,Raphael,,12/15/2016,male,Not captured,Not captured,Not captured,Not captured,Not captured,Not captured,Not captured,Not captured,Not captured,Not captured,Not captured,Not captured,Not captured,,,Not captured,Not captured,Not captured,Not captured,422 Passaic Ave,,Passaic,New Jersey,07055,917-445-9986,,Not captured,Not captured,scjcohen@gmail.com,Not captured,701941510,,Not captured,Not captured,Not captured,Not captured,Not captured,Not captured,
Not captured,Not captured,10/13/2019,Not captured,Not captured,863949,020,00072,ARS-02-0053137,Beacon America,Not captured,Not captured,Not captured,,,,Marcus,Sarah,,11/04/1993,female,Not captured,Not captured,Not captured,Not captured,Not captured,Not captured,Not captured,Not captured,Not captured,Not captured,Not captured,Not captured,Not captured,,,Not captured,Not captured,Not captured,Not captured,422 Passaic Ave,,Passaic,New Jersey,07055,917-445-9986,,Not captured,Not captured,scjcohen@gmail.com,Not captured,701941509,,Not captured,Not captured,Not captured,Not captured,Not captured,Not captured,
Not captured,Not captured,10/13/2019,Not captured,Not captured,863949,020,00072,ARS-02-0053136,Beacon America,Not captured,Not captured,Not captured,,,,Cohen,Joseph,,05/27/1990,male,Not captured,Not captured,Not captured,Not captured,Not captured,Not captured,Not captured,Not captured,Not captured,Not captured,Not captured,Not captured,Not captured,,,Not captured,Not captured,Not captured,Not captured,422 Passaic Ave,,Passaic,New Jersey,07055,917-445-9986,,Not captured,Not captured,scjcohen@gmail.com,Not captured,701941508,,Not captured,Not captured,Not captured,Not captured,Not captured,Not captured,
Not captured,Not captured,10/11/2019,Not captured,Not captured,863949,020,00072,ARS-02-0053131,Beacon America,Not captured,Not captured,Not captured,,,,Avino,Anita,M,11/30/1942,female,Not captured,Not captured,Not captured,Not captured,Not captured,Not captured,Not captured,Not captured,Not captured,Not captured,Not captured,Not captured,Not captured,,,Not captured,Not captured,Not captured,Not captured,800 W Grant Line,,Tracy,California,95376-2416,,,Not captured,Not captured,amavino@comcast.net,Not captured,701941503,,Not captured,Not captured,Not captured,Not captured,Not captured,Not captured,
Not captured,Not captured,10/11/2019,Not captured,Not captured,863949,020,00072,ARS-02-0053118,Beacon America,Not captured,Not captured,Not captured,,,,Guridge,Manachem,,10/09/2018,male,Not captured,Not captured,Not captured,Not captured,Not captured,Not captured,Not captured,Not captured,Not captured,Not captured,Not captured,Not captured,Not captured,,,Not captured,Not captured,Not captured,Not captured,6410 Lenox Ave,,Montreol,Quebec,H3zn7,201-567-3252,,Not captured,Not captured,tzipporahg@yahoo.com,Not captured,701941490,,Not captured,Not captured,Not captured,Not captured,Not captured,Not captured,
Not captured,Not captured,10/11/2019,Not captured,Not captured,863949,020,00072,ARS-02-0053117,Beacon America,Not captured,Not captured,Not captured,,,,Guridge,Eleizer,,10/07/2016,male,Not captured,Not captured,Not captured,Not captured,Not captured,Not captured,Not captured,Not captured,Not captured,Not captured,Not captured,Not captured,Not captured,,,Not captured,Not captured,Not captured,Not captured,6410 Lenox Ave,,Montreol,Quebec,H3zn7,201-567-3252,,Not captured,Not captured,tzipporahg@yahoo.com,Not captured,701941489,,Not captured,Not captured,Not captured,Not captured,Not captured,Not captured,
Not captured,Not captured,10/11/2019,Not captured,Not captured,863949,020,00072,ARS-02-0053115,Beacon America,Not captured,Not captured,Not captured,,,,Rivera Garcia,Sarai,,05/04/1980,female,Not captured,Not captured,Not captured,Not captured,Not captured,Not captured,Not captured,Not captured,Not captured,Not captured,Not captured,Not captured,Not captured,,,Not captured,Not captured,Not captured,Not captured,312 calle delfin,,Dorado,,00646,,,Not captured,Not captured,mayapr22@gmail.com,Not captured,701941483,,Not captured,Not captured,Not captured,Not captured,Not captured,Not captured,
Not captured,Not captured,10/11/2019,Not captured,Not captured,863949,020,00072,ARS-02-0053111,Beacon America,Not captured,Not captured,Not captured,,,,Bursztyn,Faigel,,12/20/1987,female,Not captured,Not captured,Not captured,Not captured,Not captured,Not captured,Not captured,Not captured,Not captured,Not captured,Not captured,Not captured,Not captured,,,Not captured,Not captured,Not captured,Not captured,28 Coles Way,,Lakewood,New Jersey,08701,732-998-0666,,Not captured,Not captured,sholombursztyn@gmail.com,Not captured,701941478,,Not captured,Not captured,Not captured,Not captured,Not captured,Not captured,
Not captured,Not captured,10/11/2019,Not captured,Not captured,863949,020,00072,ARS-02-0053110,Beacon America,Not captured,Not captured,Not captured,,,,Bursztyn,Shraga,,10/21/2009,male,Not captured,Not captured,Not captured,Not captured,Not captured,Not captured,Not captured,Not captured,Not captured,Not captured,Not captured,Not captured,Not captured,,,Not captured,Not captured,Not captured,Not captured,28 Coles Way,,Lakewood,New Jersey,08701,732-998-0666,,Not captured,Not captured,sholombursztyn@gmail.com,Not captured,701941477,,Not captured,Not captured,Not captured,Not captured,Not captured,Not captured,
Not captured,Not captured,10/11/2019,Not captured,Not captured,863949,020,00072,ARS-02-0053108,Beacon America,Not captured,Not captured,Not captured,,,,Busztyn,Ita,,08/03/2014,male,Not captured,Not captured,Not captured,Not captured,Not captured,Not captured,Not captured,Not captured,Not captured,Not captured,Not captured,Not captured,Not captured,,,Not captured,Not captured,Not captured,Not captured,960 County Line Rd,,Lakewood,New Jersey,08701,732-998-0666,,Not captured,Not captured,sholombursztyn@gmail.com,Not captured,701941475,,Not captured,Not captured,Not captured,Not captured,Not captured,Not captured,
Not captured,Not captured,10/11/2019,Not captured,Not captured,863949,020,00072,ARS-02-0053107,Beacon America,Not captured,Not captured,Not captured,,,,bursztyn,Nosson,,02/25/2013,male,Not captured,Not captured,Not captured,Not captured,Not captured,Not captured,Not captured,Not captured,Not captured,Not captured,Not captured,Not captured,Not captured,,,Not captured,Not captured,Not captured,Not captured,960 County Line Rd,,Lakewood,New Jersey,08701,732-998-0666,,Not captured,Not captured,sholombursztyn@gmail.com,Not captured,701941474,,Not captured,Not captured,Not captured,Not captured,Not captured,Not captured,
Not captured,Not captured,10/11/2019,Not captured,Not captured,863949,020,00072,ARS-02-0053106,Beacon America,Not captured,Not captured,Not captured,,,,Bursztyn,Hinda ,,08/02/2019,female,Not captured,Not captured,Not captured,Not captured,Not captured,Not captured,Not captured,Not captured,Not captured,Not captured,Not captured,Not captured,Not captured,,,Not captured,Not captured,Not captured,Not captured,960 County Line Rd,,Lakewood,New Jersey,08701,732-998-0666,,Not captured,Not captured,sholombursztyn@gmail.com,Not captured,701941473,,Not captured,Not captured,Not captured,Not captured,Not captured,Not captured,
Not captured,Not captured,10/11/2019,Not captured,Not captured,863949,020,00072,ARS-02-0053105,Beacon America,Not captured,Not captured,Not captured,,,,Bursztyn,Naftali,,05/25/2017,male,Not captured,Not captured,Not captured,Not captured,Not captured,Not captured,Not captured,Not captured,Not captured,Not captured,Not captured,Not captured,Not captured,,,Not captured,Not captured,Not captured,Not captured,960 County Line Rd,,Lakewood,New Jersey,08701,732-998-0666,,Not captured,Not captured,sholombursztyn@gmail.com,Not captured,701941472,,Not captured,Not captured,Not captured,Not captured,Not captured,Not captured,
Not captured,Not captured,10/11/2019,Not captured,Not captured,863949,020,00072,ARS-02-0053104,Beacon America,Not captured,Not captured,Not captured,,,,Bursztyn,Avrohom,,05/25/2017,male,Not captured,Not captured,Not captured,Not captured,Not captured,Not captured,Not captured,Not captured,Not captured,Not captured,Not captured,Not captured,Not captured,,,Not captured,Not captured,Not captured,Not captured,960 County Line Rd,,Lakewood,New Jersey,08701,732-998-0666,,Not captured,Not captured,sholombursztyn@gmail.com,Not captured,701941471,,Not captured,Not captured,Not captured,Not captured,Not captured,Not captured,
Not captured,Not captured,10/11/2019,Not captured,Not captured,863949,020,00072,ARS-02-0053103,Beacon America,Not captured,Not captured,Not captured,,,,Bursztyn,Chaya,,09/11/2012,female,Not captured,Not captured,Not captured,Not captured,Not captured,Not captured,Not captured,Not captured,Not captured,Not captured,Not captured,Not captured,Not captured,,,Not captured,Not captured,Not captured,Not captured,960 County Line Rd,,Lakewood,New Jersey,08701,732-998-0666,,Not captured,Not captured,sholombursztyn@gmail.com,Not captured,701941470,,Not captured,Not captured,Not captured,Not captured,Not captured,Not captured,
Not captured,Not captured,10/11/2019,Not captured,Not captured,863949,020,00072,ARS-02-0053102,Beacon America,Not captured,Not captured,Not captured,,,,Bursztyn,Esther,,04/01/2011,female,Not captured,Not captured,Not captured,Not captured,Not captured,Not captured,Not captured,Not captured,Not captured,Not captured,Not captured,Not captured,Not captured,,,Not captured,Not captured,Not captured,Not captured,960 County Line Rd,,Lakewood,New Jersey,08701,732-998-0666,,Not captured,Not captured,sholombursztyn@gmail.com,Not captured,701941469,,Not captured,Not captured,Not captured,Not captured,Not captured,Not captured,
Not captured,Not captured,10/11/2019,Not captured,Not captured,863949,020,00072,ARS-02-0053101,Beacon America,Not captured,Not captured,Not captured,,,,Bursztyn,Sholom,,12/18/1984,male,Not captured,Not captured,Not captured,Not captured,Not captured,Not captured,Not captured,Not captured,Not captured,Not captured,Not captured,Not captured,Not captured,,,Not captured,Not captured,Not captured,Not captured,960 County Line Rd,,Lakewood,New Jersey,08701,732-998-0666,,Not captured,Not captured,sholombursztyn@gmail.com,Not captured,701941468,,Not captured,Not captured,Not captured,Not captured,Not captured,Not captured,
Not captured,Not captured,10/10/2019,Not captured,Not captured,863949,020,00072,ARS-02-0053098,Beacon America,Not captured,Not captured,Not captured,,,,Lichter,Esther ,,07/04/1953,female,Not captured,Not captured,Not captured,Not captured,Not captured,Not captured,Not captured,Not captured,Not captured,Not captured,Not captured,Not captured,Not captured,,,Not captured,Not captured,Not captured,Not captured,28 Capital Lane,,Lakewood,New Jersey,08701,716-4506178,,Not captured,Not captured,shayeblichter@gmail.com,Not captured,701941465,,Not captured,Not captured,Not captured,Not captured,Not captured,Not captured,
Not captured,Not captured,10/13/2019,Not captured,Not captured,863949,020,00072,ARS-02-0053097,Beacon America,Not captured,Not captured,Not captured,,,,Pechter,Mordechai,,09/18/2019,male,Not captured,Not captured,Not captured,Not captured,Not captured,Not captured,Not captured,Not captured,Not captured,Not captured,Not captured,Not captured,Not captured,,,Not captured,Not captured,Not captured,Not captured,207 First street,,Lakewood,New Jersey,08701,732-551-0990,,Not captured,Not captured,chavas133@gmail.com,Not captured,701941464,,Not captured,Not captured,Not captured,Not captured,Not captured,Not captured,
Not captured,Not captured,10/13/2019,Not captured,Not captured,863949,020,00072,ARS-02-0053096,Beacon America,Not captured,Not captured,Not captured,,,,Pechter,Gittle ,,12/12/2017,male,Not captured,Not captured,Not captured,Not captured,Not captured,Not captured,Not captured,Not captured,Not captured,Not captured,Not captured,Not captured,Not captured,,,Not captured,Not captured,Not captured,Not captured,207 First street,,Lakewood,New Jersey,08701,732-551-0990,,Not captured,Not captured,chavas133@gmail.com,Not captured,701941463,,Not captured,Not captured,Not captured,Not captured,Not captured,Not captured,
Not captured,Not captured,10/13/2019,Not captured,Not captured,863949,020,00072,ARS-02-0053095,Beacon America,Not captured,Not captured,Not captured,,,,Pechter,Menachem Y,,04/21/2016,male,Not captured,Not captured,Not captured,Not captured,Not captured,Not captured,Not captured,Not captured,Not captured,Not captured,Not captured,Not captured,Not captured,,,Not captured,Not captured,Not captured,Not captured,207 First street,,Lakewood,New Jersey,08701,732-551-0990,,Not captured,Not captured,chavas133@gmail.com,Not captured,701941462,,Not captured,Not captured,Not captured,Not captured,Not captured,Not captured,
Not captured,Not captured,10/13/2019,Not captured,Not captured,863949,020,00072,ARS-02-0053094,Beacon America,Not captured,Not captured,Not captured,,,,Pechter,Eliyahu,,03/10/2013,male,Not captured,Not captured,Not captured,Not captured,Not captured,Not captured,Not captured,Not captured,Not captured,Not captured,Not captured,Not captured,Not captured,,,Not captured,Not captured,Not captured,Not captured,207 First street,,Lakewood,New Jersey,08701,732-551-0990,,Not captured,Not captured,chavas133@gmail.com,Not captured,701941461,,Not captured,Not captured,Not captured,Not captured,Not captured,Not captured,
Not captured,Not captured,10/13/2019,Not captured,Not captured,863949,020,00072,ARS-02-0053093,Beacon America,Not captured,Not captured,Not captured,,,,Pechter,Sara R,,07/13/2011,female,Not captured,Not captured,Not captured,Not captured,Not captured,Not captured,Not captured,Not captured,Not captured,Not captured,Not captured,Not captured,Not captured,,,Not captured,Not captured,Not captured,Not captured,207 First street,,Lakewood,New Jersey,08701,732-551-0990,,Not captured,Not captured,chavas133@gmail.com,Not captured,701941460,,Not captured,Not captured,Not captured,Not captured,Not captured,Not captured,
Not captured,Not captured,10/13/2019,Not captured,Not captured,863949,020,00072,ARS-02-0053092,Beacon America,Not captured,Not captured,Not captured,,,,Pechter,Chava,,01/25/1988,female,Not captured,Not captured,Not captured,Not captured,Not captured,Not captured,Not captured,Not captured,Not captured,Not captured,Not captured,Not captured,Not captured,,,Not captured,Not captured,Not captured,Not captured,207 First street,,Lakewood,New Jersey,08701,732-551-0990,,Not captured,Not captured,chavas133@gmail.com,Not captured,701941459,,Not captured,Not captured,Not captured,Not captured,Not captured,Not captured,
Not captured,Not captured,10/13/2019,Not captured,Not captured,863949,020,00072,ARS-02-0053091,Beacon America,Not captured,Not captured,Not captured,,,,Pechter,Yaakov,,11/21/1986,male,Not captured,Not captured,Not captured,Not captured,Not captured,Not captured,Not captured,Not captured,Not captured,Not captured,Not captured,Not captured,Not captured,,,Not captured,Not captured,Not captured,Not captured,207 First street,,Lakewood,New Jersey,08701,732-551-0990,,Not captured,Not captured,chavas133@gmail.com,Not captured,701941458,,Not captured,Not captured,Not captured,Not captured,Not captured,Not captured,
Not captured,Not captured,10/10/2019,Not captured,Not captured,863949,020,00072,ARS-01-0053090,Beacon International,Not captured,Not captured,Not captured,,,,Wells,Carrie,D,10/08/1967,female,Not captured,Not captured,Not captured,Not captured,Not captured,Not captured,Not captured,Not captured,Not captured,Not captured,Not captured,Not captured,Not captured,Bryce Wells,son,Not captured,Not captured,Not captured,Not captured,4219 N Church Way Apt 6,,Louisville,Kentucky,40207,502-873-7808,,Not captured,Not captured,dwells@reachingandteaching.org,Not captured,701941457,,Not captured,Not captured,Not captured,Not captured,Not captured,Not captured,
Not captured,Not captured,10/10/2019,Not captured,Not captured,863949,020,00072,ARS-01-0053089,Beacon International,Not captured,Not captured,Not captured,Passport(567431452),,,Wells,David,L,01/19/1966,male,Not captured,Not captured,Not captured,Not captured,Not captured,Not captured,Not captured,Not captured,Not captured,Not captured,Not captured,Not captured,Not captured,Bryce Wells,son,Not captured,Not captured,Not captured,Not captured,4219 N Church Way Apt 6,,Louisville,Kentucky,40207,502-873-7808,,Not captured,Not captured,dwells@reachingandteaching.org,Not captured,701941456,,Not captured,Not captured,Not captured,Not captured,Not captured,Not captured,