EE Transaction Type,Dependent Transaction Type,Effective Date,EE Signature,EE Signature Date,Control,Suffix,Account,Plan Number,Plan Name,Claim Office,Network ID Number,Customer Code,EE SSN,Dependent SSN,Dependent Relationship,Last Name,First Name,Middle Initial,DOB,Gender,Ethnicity,PCP/PCD,PCP/PCD Current Patient,Provider Cap Office Number,COB,Dep Student Indicator,Dep OOA Indicator,EE Prior Coverage Indicator,EE Late Entrant,EE Language Indicator,Hire Date,Earnings,Earnings Frequency,Beneficiary (Last Name First Name MI),Beneficiary Relationship,Continuation of Coverage Expiration Date,Continuation of Coverage Event Date,Continuation of Coverage Length of Coverage,Work Location Zip Code,Street Address Line 1,Street Address Line 2,City,State,Zip Code,Home Phone Number,Work Phone Number,Accept Code,Evidence Code,EE Email Address,Communication Disability Code,EE Alternate ID,Dep Alternate ID,Old Control,Old Suffix,Old Account,New Control,New Suffix,New Account,
Not captured,Not captured,10/08/2019,Not captured,Not captured,863949,020,00072,ARS-02-0053068,Beacon America,Not captured,Not captured,Not captured,,,,Sunkara,Annapurna,,01/25/1962,female,Not captured,Not captured,Not captured,Not captured,Not captured,Not captured,Not captured,Not captured,Not captured,Not captured,Not captured,Not captured,Not captured,Rama Chunchu,Daughter,Not captured,Not captured,Not captured,Not captured,4441 DAVIS ST,,Santa Clara,California,95054,4086550056,,Not captured,Not captured,laxmi.chunchu@yahoo.com,Not captured,701941404,,Not captured,Not captured,Not captured,Not captured,Not captured,Not captured,
Not captured,Not captured,10/08/2019,Not captured,Not captured,863949,020,00072,ARS-02-0053067,Beacon America,Not captured,Not captured,Not captured,Passport(L3762336),,,Sunkara,Venkata Rama Rao,,05/13/1957,male,Not captured,Not captured,Not captured,Not captured,Not captured,Not captured,Not captured,Not captured,Not captured,Not captured,Not captured,Not captured,Not captured,Rama Chunchu,Daughter,Not captured,Not captured,Not captured,Not captured,4441 DAVIS ST,,Santa Clara,California,95054,4086550056,,Not captured,Not captured,laxmi.chunchu@yahoo.com,Not captured,701941403,,Not captured,Not captured,Not captured,Not captured,Not captured,Not captured,
Not captured,Not captured,10/08/2019,Not captured,Not captured,863949,020,00072,ARS-01-0053061,Beacon International,Not captured,Not captured,Not captured,,,,Parks,William,M,01/17/1977,male,Not captured,Not captured,Not captured,Not captured,Not captured,Not captured,Not captured,Not captured,Not captured,Not captured,Not captured,Not captured,Not captured,,,Not captured,Not captured,Not captured,Not captured,120B Via Estrada,,Laguna Woods,California,92637,,,Not captured,Not captured,mitchell_parks@hotmail.com,Not captured,701941386,,Not captured,Not captured,Not captured,Not captured,Not captured,Not captured,
Not captured,Not captured,10/08/2019,Not captured,Not captured,863949,020,00072,ARS-03-0052830,Essential America,Not captured,Not captured,Not captured,Driving License(VA893751),,,Kilari,Sivaramaiah,,05/30/1982,male,Not captured,Not captured,Not captured,Not captured,Not captured,Not captured,Not captured,Not captured,Not captured,Not captured,Not captured,Not captured,Not captured,,,Not captured,Not captured,Not captured,Not captured,obulesunipalle village,,AP,Andhra Pradesh,522612,2035723554,,Not captured,Not captured,aruna.yaganti87@gmail.com,Not captured,701940965,,Not captured,Not captured,Not captured,Not captured,Not captured,Not captured,
Not captured,Not captured,10/08/2019,Not captured,Not captured,863949,020,00072,ARS-03-0052830,Essential America,Not captured,Not captured,Not captured,,SSN(116699296),Spouse,Yaganti,Aruna,,07/01/1987,female,Not captured,Not captured,Not captured,Not captured,Not captured,Not captured,Not captured,Not captured,Not captured,Not captured,Not captured,Not captured,Not captured,,,Not captured,Not captured,Not captured,Not captured,obulesunipalle village,,AP,Andhra Pradesh,522612,2035723554,,Not captured,Not captured,aruna.yaganti87@gmail.com,Not captured,,701940966,Not captured,Not captured,Not captured,Not captured,Not captured,Not captured,
Not captured,Not captured,10/08/2019,Not captured,Not captured,863949,020,00072,ARS-03-0052830,Essential America,Not captured,Not captured,Not captured,,Passport(.),Dependant,Kilari,Srilakshmi,,11/24/2013,female,Not captured,Not captured,Not captured,Not captured,Not captured,Not captured,Not captured,Not captured,Not captured,Not captured,Not captured,Not captured,Not captured,,,Not captured,Not captured,Not captured,Not captured,obulesunipalle village,,AP,Andhra Pradesh,522612,2035723554,,Not captured,Not captured,aruna.yaganti87@gmail.com,Not captured,,701940967,Not captured,Not captured,Not captured,Not captured,Not captured,Not captured,
Not captured,Not captured,10/08/2019,Not captured,Not captured,863949,020,00072,ARS-03-0052830,Essential America,Not captured,Not captured,Not captured,,Passport(.),Dependant,Kilari,Nagasaeesha,,10/26/2015,male,Not captured,Not captured,Not captured,Not captured,Not captured,Not captured,Not captured,Not captured,Not captured,Not captured,Not captured,Not captured,Not captured,,,Not captured,Not captured,Not captured,Not captured,obulesunipalle village,,AP,Andhra Pradesh,522612,2035723554,,Not captured,Not captured,aruna.yaganti87@gmail.com,Not captured,,701940968,Not captured,Not captured,Not captured,Not captured,Not captured,Not captured,
Not captured,Not captured,10/08/2019,Not captured,Not captured,863949,020,00072,ARS-01-0053058,Beacon International,Not captured,Not captured,Not captured,,,,Jensen,Kayleigh,,03/20/1986,female,Not captured,Not captured,Not captured,Not captured,Not captured,Not captured,Not captured,Not captured,Not captured,Not captured,Not captured,Not captured,Not captured,,,Not captured,Not captured,Not captured,Not captured,1322 W Province Way,,St George,Utah,84770,,,Not captured,Not captured,chancjensen@gmail.com,Not captured,701941382,,Not captured,Not captured,Not captured,Not captured,Not captured,Not captured,
Not captured,Not captured,10/08/2019,Not captured,Not captured,863949,020,00072,ARS-01-0053057,Beacon International,Not captured,Not captured,Not captured,,,,Jensen,Chanc,S,06/14/1984,male,Not captured,Not captured,Not captured,Not captured,Not captured,Not captured,Not captured,Not captured,Not captured,Not captured,Not captured,Not captured,Not captured,,,Not captured,Not captured,Not captured,Not captured,1322 W Province Way,,St George,Utah,84770,,,Not captured,Not captured,chancjensen@gmail.com,Not captured,701941381,,Not captured,Not captured,Not captured,Not captured,Not captured,Not captured,
Not captured,Not captured,10/08/2019,Not captured,Not captured,863949,020,00072,ARS-01-0053056,Beacon International,Not captured,Not captured,Not captured,,,,Bonilla Vargas,Maureen,,08/30/1986,female,Not captured,Not captured,Not captured,Not captured,Not captured,Not captured,Not captured,Not captured,Not captured,Not captured,Not captured,Not captured,Not captured,,,Not captured,Not captured,Not captured,Not captured,Llorente de Flores Heredia,,Heredia,,246-3007,,,Not captured,Not captured,rolandobonilla7@gmail.com,Not captured,701941380,,Not captured,Not captured,Not captured,Not captured,Not captured,Not captured,
Not captured,Not captured,10/08/2019,Not captured,Not captured,863949,020,00072,ARS-01-0053055,Beacon International,Not captured,Not captured,Not captured,,,,Picado Zuniga,Alfonso,,08/22/1987,male,Not captured,Not captured,Not captured,Not captured,Not captured,Not captured,Not captured,Not captured,Not captured,Not captured,Not captured,Not captured,Not captured,,,Not captured,Not captured,Not captured,Not captured,Llorente de Flores Heredia,,Heredia,,246-3007,,,Not captured,Not captured,rolandobonilla7@gmail.com,Not captured,701941379,,Not captured,Not captured,Not captured,Not captured,Not captured,Not captured,
Not captured,Not captured,10/08/2019,Not captured,Not captured,863949,020,00072,ARS-01-0053054,Beacon International,Not captured,Not captured,Not captured,,,,Vega Matamoros,Leonor,,11/13/1990,female,Not captured,Not captured,Not captured,Not captured,Not captured,Not captured,Not captured,Not captured,Not captured,Not captured,Not captured,Not captured,Not captured,,,Not captured,Not captured,Not captured,Not captured,Llorente de Flores Heredia,,Heredia,,246-3007,,,Not captured,Not captured,rolandobonilla7@gmail.com,Not captured,701941378,,Not captured,Not captured,Not captured,Not captured,Not captured,Not captured,
Not captured,Not captured,10/08/2019,Not captured,Not captured,863949,020,00072,ARS-01-0053053,Beacon International,Not captured,Not captured,Not captured,,,,Bonilla Vargas,Rolando,,01/12/1985,male,Not captured,Not captured,Not captured,Not captured,Not captured,Not captured,Not captured,Not captured,Not captured,Not captured,Not captured,Not captured,Not captured,,,Not captured,Not captured,Not captured,Not captured,Llorente de Flores Heredia,,Heredia,,246-3007,,,Not captured,Not captured,rolandobonilla7@gmail.com,Not captured,701941377,,Not captured,Not captured,Not captured,Not captured,Not captured,Not captured,
Not captured,Not captured,10/07/2019,Not captured,Not captured,863949,020,00072,ARS-01-0053052,Beacon International,Not captured,Not captured,Not captured,,,,Henning,John,Alan,07/25/1964,male,Not captured,Not captured,Not captured,Not captured,Not captured,Not captured,Not captured,Not captured,Not captured,Not captured,Not captured,Not captured,Not captured,Ann Bauer,sister,Not captured,Not captured,Not captured,Not captured,235 Montomgery St,,San Francisco,California,94104,4159633993,,Not captured,Not captured,DANLABBE@GRANITESOLUTIONSGROUPE.COM,Not captured,701941367,,Not captured,Not captured,Not captured,Not captured,Not captured,Not captured,
Not captured,Not captured,10/07/2019,Not captured,Not captured,863949,020,00072,ARS-01-0053051,Beacon International,Not captured,Not captured,Not captured,Passport(566323731),,,LAbbe,Daniel,Hector,01/26/1970,male,Not captured,Not captured,Not captured,Not captured,Not captured,Not captured,Not captured,Not captured,Not captured,Not captured,Not captured,Not captured,Not captured,Ann Bauer,sister,Not captured,Not captured,Not captured,Not captured,235 Montomgery St,,San Francisco,California,94104,4159633993,,Not captured,Not captured,DANLABBE@GRANITESOLUTIONSGROUPE.COM,Not captured,701941366,,Not captured,Not captured,Not captured,Not captured,Not captured,Not captured,
Not captured,Not captured,10/08/2019,Not captured,Not captured,863949,020,00072,ARS-03-0053012,Essential America,Not captured,Not captured,Not captured,Passport(545977004),,,kennedy,john,finbarr,11/12/1976,male,Not captured,Not captured,Not captured,Not captured,Not captured,Not captured,Not captured,Not captured,Not captured,Not captured,Not captured,Not captured,Not captured,,,Not captured,Not captured,Not captured,Not captured,214 Rio Terra,,venice,Florida,34285,8014198492,,Not captured,Not captured,barrykennedy@gmail.com,Not captured,701941250,,Not captured,Not captured,Not captured,Not captured,Not captured,Not captured,
Not captured,Not captured,10/07/2019,Not captured,Not captured,863949,020,00072,ARS-01-0053041,Beacon International,Not captured,Not captured,Not captured,,,,Applegrad,Meir,,10/18/2005,male,Not captured,Not captured,Not captured,Not captured,Not captured,Not captured,Not captured,Not captured,Not captured,Not captured,Not captured,Not captured,Not captured,,,Not captured,Not captured,Not captured,Not captured,37 Newberry Ct,,Lakewood,New Jersey,08701,732-8652197,,Not captured,Not captured,dapplegrad@gmail.com,Not captured,701941316,,Not captured,Not captured,Not captured,Not captured,Not captured,Not captured,
Not captured,Not captured,10/07/2019,Not captured,Not captured,863949,020,00072,ARS-02-0053040,Beacon America,Not captured,Not captured,Not captured,,,,Hansen,Charisse,L,07/29/1965,female,Not captured,Not captured,Not captured,Not captured,Not captured,Not captured,Not captured,Not captured,Not captured,Not captured,Not captured,Not captured,Not captured,,,Not captured,Not captured,Not captured,Not captured,8 Begonia,,Sedgefield,,6573,,,Not captured,Not captured,olar4947@gmail.com,Not captured,701941311,,Not captured,Not captured,Not captured,Not captured,Not captured,Not captured,
Not captured,Not captured,10/07/2019,Not captured,Not captured,863949,020,00072,ARS-01-0053038,Beacon International,Not captured,Not captured,Not captured,,,,Amsel,Meir ,,11/07/2002,male,Not captured,Not captured,Not captured,Not captured,Not captured,Not captured,Not captured,Not captured,Not captured,Not captured,Not captured,Not captured,Not captured,,,Not captured,Not captured,Not captured,Not captured,5 Junipar lane,,Lakewood,New Jersey,08701,646-457-0655,,Not captured,Not captured,yeshivamanangement@gmail.com,Not captured,701941309,,Not captured,Not captured,Not captured,Not captured,Not captured,Not captured,
Not captured,Not captured,10/07/2019,Not captured,Not captured,863949,020,00072,ARS-01-0053036,Beacon International,Not captured,Not captured,Not captured,,,,Freeman,Tammy,,10/15/1979,female,Not captured,Not captured,Not captured,Not captured,Not captured,Not captured,Not captured,Not captured,Not captured,Not captured,Not captured,Not captured,Not captured,,,Not captured,Not captured,Not captured,Not captured,11398 Aegean Terr,,Woodbridge,Virginia,22192,,,Not captured,Not captured,tcfreeman@hotmail.com,Not captured,701941307,,Not captured,Not captured,Not captured,Not captured,Not captured,Not captured,
Not captured,Not captured,10/08/2019,Not captured,Not captured,863949,020,00072,OVI-28-0053035,OverseasCare Visitors Insurance Plan,Not captured,Not captured,Not captured,Passport(J3086074),,,Prosper Linus,Anusuya Catherine,,12/14/1990,female,Not captured,Not captured,Not captured,Not captured,Not captured,Not captured,Not captured,Not captured,Not captured,Not captured,Not captured,Not captured,Not captured,,,Not captured,Not captured,Not captured,Not captured,1042 Reed Terrace,,Sunnyvale,California,94086,4083003797,,Not captured,Not captured,anuprosper@gmail.com,Not captured,701941306,,Not captured,Not captured,Not captured,Not captured,Not captured,Not captured,
Not captured,Not captured,10/05/2019,Not captured,Not captured,863949,020,00072,ARS-01-0053029,Beacon International,Not captured,Not captured,Not captured,,,,Thomason,Hope,,10/16/1991,female,Not captured,Not captured,Not captured,Not captured,Not captured,Not captured,Not captured,Not captured,Not captured,Not captured,Not captured,Not captured,Not captured,,,Not captured,Not captured,Not captured,Not captured,175 Carlton Ave apt. 1,,Brooklyn,New York,11205,,,Not captured,Not captured,hthomason16@gmail.com,Not captured,701941298,,Not captured,Not captured,Not captured,Not captured,Not captured,Not captured,
Not captured,Not captured,10/05/2019,Not captured,Not captured,863949,020,00072,ARS-01-0053028,Beacon International,Not captured,Not captured,Not captured,,,,Macedo,Kate,,03/20/1989,female,Not captured,Not captured,Not captured,Not captured,Not captured,Not captured,Not captured,Not captured,Not captured,Not captured,Not captured,Not captured,Not captured,,,Not captured,Not captured,Not captured,Not captured,175 Carlton Avenue,,Brooklyn,New York,11205,,,Not captured,Not captured,kmacedo1@gmail.com,Not captured,701941297,,Not captured,Not captured,Not captured,Not captured,Not captured,Not captured,
Not captured,Not captured,10/05/2019,Not captured,Not captured,863949,020,00072,ARS-01-0053027,Beacon International,Not captured,Not captured,Not captured,,,,Acciavatti,Lauren,,07/15/1987,female,Not captured,Not captured,Not captured,Not captured,Not captured,Not captured,Not captured,Not captured,Not captured,Not captured,Not captured,Not captured,Not captured,,,Not captured,Not captured,Not captured,Not captured,1646 W Byron Apt 3F,,Chicago,Illinois,60613,,,Not captured,Not captured,lauren.acciavatti@gmail.com,Not captured,701941296,,Not captured,Not captured,Not captured,Not captured,Not captured,Not captured,
Not captured,Not captured,10/06/2019,Not captured,Not captured,863949,020,00072,ARS-01-0053010,Beacon International,Not captured,Not captured,Not captured,,,,Brezel,Tzvi,,06/06/2019,male,Not captured,Not captured,Not captured,Not captured,Not captured,Not captured,Not captured,Not captured,Not captured,Not captured,Not captured,Not captured,Not captured,,,Not captured,Not captured,Not captured,Not captured,2 Bartanura road,,Toms River,New Jersey,07752,732-364-2118,,Not captured,Not captured,miriambrezel@gmail.com,Not captured,701941248,,Not captured,Not captured,Not captured,Not captured,Not captured,Not captured,
Not captured,Not captured,10/06/2019,Not captured,Not captured,863949,020,00072,ARS-01-0053009,Beacon International,Not captured,Not captured,Not captured,,,,Brexel,Mordechai,,07/12/2017,male,Not captured,Not captured,Not captured,Not captured,Not captured,Not captured,Not captured,Not captured,Not captured,Not captured,Not captured,Not captured,Not captured,,,Not captured,Not captured,Not captured,Not captured,2 Bartanura road,,Toms River,New Jersey,07752,732-364-2118,,Not captured,Not captured,miriambrezel@gmail.com,Not captured,701941247,,Not captured,Not captured,Not captured,Not captured,Not captured,Not captured,
Not captured,Not captured,10/06/2019,Not captured,Not captured,863949,020,00072,ARS-01-0053008,Beacon International,Not captured,Not captured,Not captured,,,,brezel,Simcha,,07/06/2015,male,Not captured,Not captured,Not captured,Not captured,Not captured,Not captured,Not captured,Not captured,Not captured,Not captured,Not captured,Not captured,Not captured,,,Not captured,Not captured,Not captured,Not captured,2 Bartanura road,,Toms River,New Jersey,07752,732-364-2118,,Not captured,Not captured,miriambrezel@gmail.com,Not captured,701941246,,Not captured,Not captured,Not captured,Not captured,Not captured,Not captured,
Not captured,Not captured,10/06/2019,Not captured,Not captured,863949,020,00072,ARS-01-0053007,Beacon International,Not captured,Not captured,Not captured,,,,Brezel,Chesky,,11/06/2013,male,Not captured,Not captured,Not captured,Not captured,Not captured,Not captured,Not captured,Not captured,Not captured,Not captured,Not captured,Not captured,Not captured,,,Not captured,Not captured,Not captured,Not captured,2 Bartanura road,,Toms River,New Jersey,07752,732-364-2118,,Not captured,Not captured,miriambrezel@gmail.com,Not captured,701941245,,Not captured,Not captured,Not captured,Not captured,Not captured,Not captured,
Not captured,Not captured,10/06/2019,Not captured,Not captured,863949,020,00072,ARS-01-0053006,Beacon International,Not captured,Not captured,Not captured,,,,Brezel,Shlomo,,02/05/2012,male,Not captured,Not captured,Not captured,Not captured,Not captured,Not captured,Not captured,Not captured,Not captured,Not captured,Not captured,Not captured,Not captured,,,Not captured,Not captured,Not captured,Not captured,2 Bartanura road,,Toms River,New Jersey,07752,732-364-2118,,Not captured,Not captured,miriambrezel@gmail.com,Not captured,701941244,,Not captured,Not captured,Not captured,Not captured,Not captured,Not captured,
Not captured,Not captured,10/06/2019,Not captured,Not captured,863949,020,00072,ARS-01-0053005,Beacon International,Not captured,Not captured,Not captured,,,,Kruger,Miriam,,10/03/1990,female,Not captured,Not captured,Not captured,Not captured,Not captured,Not captured,Not captured,Not captured,Not captured,Not captured,Not captured,Not captured,Not captured,,,Not captured,Not captured,Not captured,Not captured,2 Bartanura road,,Toms River,New Jersey,07752,732-364-2118,,Not captured,Not captured,miriambrezel@gmail.com,Not captured,701941243,,Not captured,Not captured,Not captured,Not captured,Not captured,Not captured,
Not captured,Not captured,10/06/2019,Not captured,Not captured,863949,020,00072,ARS-01-0053004,Beacon International,Not captured,Not captured,Not captured,,,,Brezel,Yaakov,,08/01/1989,male,Not captured,Not captured,Not captured,Not captured,Not captured,Not captured,Not captured,Not captured,Not captured,Not captured,Not captured,Not captured,Not captured,,,Not captured,Not captured,Not captured,Not captured,2 Bartanura road,,Toms River,New Jersey,07752,732-364-2118,,Not captured,Not captured,miriambrezel@gmail.com,Not captured,701941242,,Not captured,Not captured,Not captured,Not captured,Not captured,Not captured,
Not captured,Not captured,10/07/2019,Not captured,Not captured,863949,020,00072,ARS-01-0052987,Beacon International,Not captured,Not captured,Not captured,,,,BAE,MESUNG,K,10/19/1973,male,Not captured,Not captured,Not captured,Not captured,Not captured,Not captured,Not captured,Not captured,Not captured,Not captured,Not captured,Not captured,Not captured,,,Not captured,Not captured,Not captured,Not captured,258 BROAD AVE,,LEONIA,New Jersey,07605,,,Not captured,Not captured,M6225S@HOTMAIL.COM,Not captured,701941215,,Not captured,Not captured,Not captured,Not captured,Not captured,Not captured,
Not captured,Not captured,10/07/2019,Not captured,Not captured,863949,020,00072,ARS-02-0052981,Beacon America,Not captured,Not captured,Not captured,,,,Caumette,Phoenix,A,01/25/2018,male,Not captured,Not captured,Not captured,Not captured,Not captured,Not captured,Not captured,Not captured,Not captured,Not captured,Not captured,Not captured,Not captured,,,Not captured,Not captured,Not captured,Not captured,44 Louis Landry Rd,,Grand Barachois,New Brunswick,E4P 8X1,,,Not captured,Not captured,searsba@gmail.com,Not captured,701941192,,Not captured,Not captured,Not captured,Not captured,Not captured,Not captured,
Not captured,Not captured,10/07/2019,Not captured,Not captured,863949,020,00072,ARS-02-0052980,Beacon America,Not captured,Not captured,Not captured,,,,Caumette,Brittany,A,06/26/1984,female,Not captured,Not captured,Not captured,Not captured,Not captured,Not captured,Not captured,Not captured,Not captured,Not captured,Not captured,Not captured,Not captured,,,Not captured,Not captured,Not captured,Not captured,44 Louis Landry Rd,,Grand Barachois,New Brunswick,E4P 8X1,,,Not captured,Not captured,searsba@gmail.com,Not captured,701941191,,Not captured,Not captured,Not captured,Not captured,Not captured,Not captured,
Not captured,Not captured,10/06/2019,Not captured,Not captured,863949,020,00072,ARS-01-0052975,Beacon International,Not captured,Not captured,Not captured,,,,MUJICA KEPP,ROGER ENRIQUE,,08/30/1995,male,Not captured,Not captured,Not captured,Not captured,Not captured,Not captured,Not captured,Not captured,Not captured,Not captured,Not captured,Not captured,Not captured,MIGUEL MARQUEZ,PRIMO,Not captured,Not captured,Not captured,Not captured,lesbiamoreno1@gmail.com,,pto ordaz,Bolivar,8050,00582763478190,00584144594171,Not captured,Not captured,LESBIAMORENO1@GMAIL.COM,Not captured,701941186,,Not captured,Not captured,Not captured,Not captured,Not captured,Not captured,
Not captured,Not captured,10/05/2019,Not captured,Not captured,863949,020,00072,ARS-02-0052958,Beacon America,Not captured,Not captured,Not captured,Passport(N00664179),,,Chan,Sothea,,08/01/1982,male,Not captured,Not captured,Not captured,Not captured,Not captured,Not captured,Not captured,Not captured,Not captured,Not captured,Not captured,Not captured,Not captured,,,Not captured,Not captured,Not captured,Not captured,12647 Olive Boulevard,,St Louis,Missouri,63141,3147541304,,Not captured,Not captured,edemerit@soy.org,Not captured,701941147,,Not captured,Not captured,Not captured,Not captured,Not captured,Not captured,