EE Transaction Type,Dependent Transaction Type,Effective Date,EE Signature,EE Signature Date,Control,Suffix,Account,Plan Number,Plan Name,Claim Office,Network ID Number,Customer Code,EE SSN,Dependent SSN,Dependent Relationship,Last Name,First Name,Middle Initial,DOB,Gender,Ethnicity,PCP/PCD,PCP/PCD Current Patient,Provider Cap Office Number,COB,Dep Student Indicator,Dep OOA Indicator,EE Prior Coverage Indicator,EE Late Entrant,EE Language Indicator,Hire Date,Earnings,Earnings Frequency,Beneficiary (Last Name First Name MI),Beneficiary Relationship,Continuation of Coverage Expiration Date,Continuation of Coverage Event Date,Continuation of Coverage Length of Coverage,Work Location Zip Code,Street Address Line 1,Street Address Line 2,City,State,Zip Code,Home Phone Number,Work Phone Number,Accept Code,Evidence Code,EE Email Address,Communication Disability Code,EE Alternate ID,Dep Alternate ID,Old Control,Old Suffix,Old Account,New Control,New Suffix,New Account,
Not captured,Not captured,10/05/2019,Not captured,Not captured,863949,020,00072,ARS-01-0053029,Beacon International,Not captured,Not captured,Not captured,,,,Thomason,Hope,,10/16/1991,female,Not captured,Not captured,Not captured,Not captured,Not captured,Not captured,Not captured,Not captured,Not captured,Not captured,Not captured,Not captured,Not captured,,,Not captured,Not captured,Not captured,Not captured,175 Carlton Ave apt. 1,,Brooklyn,New York,11205,,,Not captured,Not captured,hthomason16@gmail.com,Not captured,701941298,,Not captured,Not captured,Not captured,Not captured,Not captured,Not captured,
Not captured,Not captured,10/05/2019,Not captured,Not captured,863949,020,00072,ARS-01-0053028,Beacon International,Not captured,Not captured,Not captured,,,,Macedo,Kate,,03/20/1989,female,Not captured,Not captured,Not captured,Not captured,Not captured,Not captured,Not captured,Not captured,Not captured,Not captured,Not captured,Not captured,Not captured,,,Not captured,Not captured,Not captured,Not captured,175 Carlton Avenue,,Brooklyn,New York,11205,,,Not captured,Not captured,kmacedo1@gmail.com,Not captured,701941297,,Not captured,Not captured,Not captured,Not captured,Not captured,Not captured,
Not captured,Not captured,10/05/2019,Not captured,Not captured,863949,020,00072,ARS-01-0053027,Beacon International,Not captured,Not captured,Not captured,,,,Acciavatti,Lauren,,07/15/1987,female,Not captured,Not captured,Not captured,Not captured,Not captured,Not captured,Not captured,Not captured,Not captured,Not captured,Not captured,Not captured,Not captured,,,Not captured,Not captured,Not captured,Not captured,1646 W Byron Apt 3F,,Chicago,Illinois,60613,,,Not captured,Not captured,lauren.acciavatti@gmail.com,Not captured,701941296,,Not captured,Not captured,Not captured,Not captured,Not captured,Not captured,
Not captured,Not captured,10/04/2019,Not captured,Not captured,863949,020,00072,ARS-01-0053026,Beacon International,Not captured,Not captured,Not captured,,,,Doherty,Kevin,L,09/26/1960,male,Not captured,Not captured,Not captured,Not captured,Not captured,Not captured,Not captured,Not captured,Not captured,Not captured,Not captured,Not captured,Not captured,,,Not captured,Not captured,Not captured,Not captured,1155 C Arnold Drive,,Martinez,California,94553,,,Not captured,Not captured,kevnrn@yahoo.com,Not captured,701941295,,Not captured,Not captured,Not captured,Not captured,Not captured,Not captured,
Not captured,Not captured,10/04/2019,Not captured,Not captured,863949,020,00072,ARS-01-0053025,Beacon International,Not captured,Not captured,Not captured,,,,Sylvester,Abigail,E,01/19/1982,female,Not captured,Not captured,Not captured,Not captured,Not captured,Not captured,Not captured,Not captured,Not captured,Not captured,Not captured,Not captured,Not captured,,,Not captured,Not captured,Not captured,Not captured,5255 Halapepe St,,Honolulu,Hawaii,96821,,,Not captured,Not captured,abidelia@gmail.com,Not captured,701941294,,Not captured,Not captured,Not captured,Not captured,Not captured,Not captured,
Not captured,Not captured,10/04/2019,Not captured,Not captured,863949,020,00072,ARS-01-0053024,Beacon International,Not captured,Not captured,Not captured,,,,Fleischman,Shmuel,,11/15/1989,male,Not captured,Not captured,Not captured,Not captured,Not captured,Not captured,Not captured,Not captured,Not captured,Not captured,Not captured,Not captured,Not captured,Blima Fleischman ,Spouse,Not captured,Not captured,Not captured,Not captured,180 locust street,,Lakewood,New Jersey,08701,7323637323,,Not captured,Not captured,Shmulyf15@gmail.com,Not captured,701941262,,Not captured,Not captured,Not captured,Not captured,Not captured,Not captured,
Not captured,Not captured,10/04/2019,Not captured,Not captured,863949,020,00072,ARS-01-0053023,Beacon International,Not captured,Not captured,Not captured,,,,Mallon,Claire,,08/29/1995,female,Not captured,Not captured,Not captured,Not captured,Not captured,Not captured,Not captured,Not captured,Not captured,Not captured,Not captured,Not captured,Not captured,,,Not captured,Not captured,Not captured,Not captured,1731 Ford Ave,,Redondo Beach,California,90278,,,Not captured,Not captured,claire.e.mallon@gmail.com,Not captured,701941261,,Not captured,Not captured,Not captured,Not captured,Not captured,Not captured,
Not captured,Not captured,10/04/2019,Not captured,Not captured,863949,020,00072,ARS-01-0053022,Beacon International,Not captured,Not captured,Not captured,,,,Soltau,Olaf,J,02/10/1970,male,Not captured,Not captured,Not captured,Not captured,Not captured,Not captured,Not captured,Not captured,Not captured,Not captured,Not captured,Not captured,Not captured,,,Not captured,Not captured,Not captured,Not captured,201 W 16th Street,,NEW YORK,New York,10011,,,Not captured,Not captured,osoltau1@gmail.com,Not captured,701941260,,Not captured,Not captured,Not captured,Not captured,Not captured,Not captured,
Not captured,Not captured,10/04/2019,Not captured,Not captured,863949,020,00072,ARS-02-0053020,Beacon America,Not captured,Not captured,Not captured,,,,Sleiman Montagna,Indhira Victoria,,03/13/2000,female,Not captured,Not captured,Not captured,Not captured,Not captured,Not captured,Not captured,Not captured,Not captured,Not captured,Not captured,Not captured,Not captured,Carlos Sleiman,Conyuge,Not captured,Not captured,Not captured,Not captured,CALLE 14 NRO 21-81,,SAN CRISTOBAL,Tachira,5001,+584147069647,,Not captured,Not captured,oficinafg2011@hotmail.com,Not captured,701941258,,Not captured,Not captured,Not captured,Not captured,Not captured,Not captured,
Not captured,Not captured,10/04/2019,Not captured,Not captured,863949,020,00072,ARS-02-0053019,Beacon America,Not captured,Not captured,Not captured,,,,Sleiman Montagna ,Randa Victoria ,,10/10/2008,female,Not captured,Not captured,Not captured,Not captured,Not captured,Not captured,Not captured,Not captured,Not captured,Not captured,Not captured,Not captured,Not captured,Carlos Sleiman,Conyuge,Not captured,Not captured,Not captured,Not captured,CALLE 14 NRO 21-81,,SAN CRISTOBAL,Tachira,5001,+584147069647,,Not captured,Not captured,oficinafg2011@hotmail.com,Not captured,701941257,,Not captured,Not captured,Not captured,Not captured,Not captured,Not captured,
Not captured,Not captured,10/04/2019,Not captured,Not captured,863949,020,00072,ARS-02-0053018,Beacon America,Not captured,Not captured,Not captured,Passport(052635731),,,Montagna Valbuena,Ariadna Isabel,,01/13/1972,female,Not captured,Not captured,Not captured,Not captured,Not captured,Not captured,Not captured,Not captured,Not captured,Not captured,Not captured,Not captured,Not captured,Carlos Sleiman,Conyuge,Not captured,Not captured,Not captured,Not captured,CALLE 14 NRO 21-81,,SAN CRISTOBAL,Tachira,5001,+584147069647,,Not captured,Not captured,oficinafg2011@hotmail.com,Not captured,701941256,,Not captured,Not captured,Not captured,Not captured,Not captured,Not captured,
Not captured,Not captured,10/03/2019,Not captured,Not captured,863949,020,00072,ARS-03-0052050,Essential America,Not captured,Not captured,Not captured,Passport(C3JWJ0367),,,Bauschulte,Matthias,,10/31/1966,male,Not captured,Not captured,Not captured,Not captured,Not captured,Not captured,Not captured,Not captured,Not captured,Not captured,Not captured,Not captured,Not captured,,,Not captured,Not captured,Not captured,Not captured,1651 N 400 E Apt 732,,North Logan,Utah,84341,004915730095104,,Not captured,Not captured,matthias.bauschulte@gmail.com,Not captured,701939437,,Not captured,Not captured,Not captured,Not captured,Not captured,Not captured,
Not captured,Not captured,10/03/2019,Not captured,Not captured,863949,020,00072,ARS-01-0053011,Beacon International,Not captured,Not captured,Not captured,,,,Levitt,Bara,,04/09/1987,female,Not captured,Not captured,Not captured,Not captured,Not captured,Not captured,Not captured,Not captured,Not captured,Not captured,Not captured,Not captured,Not captured,,,Not captured,Not captured,Not captured,Not captured,219 Cerutti Ct,,West Orange,New Jersey,07052,,,Not captured,Not captured,LEVITTBARA@GMAIL.COM,Not captured,701941249,,Not captured,Not captured,Not captured,Not captured,Not captured,Not captured,
Not captured,Not captured,10/03/2019,Not captured,Not captured,863949,020,00072,ARS-01-0053003,Beacon International,Not captured,Not captured,Not captured,,,,Gordon,Matthew,,06/22/2013,male,Not captured,Not captured,Not captured,Not captured,Not captured,Not captured,Not captured,Not captured,Not captured,Not captured,Not captured,Not captured,Not captured,,,Not captured,Not captured,Not captured,Not captured,4530 Greystone Ave,,Bronx,New York,10471,,,Not captured,Not captured,ortal79@yahoo.com,Not captured,701941233,,Not captured,Not captured,Not captured,Not captured,Not captured,Not captured,
Not captured,Not captured,10/03/2019,Not captured,Not captured,863949,020,00072,ARS-01-0053002,Beacon International,Not captured,Not captured,Not captured,,,,Gordon,Frederick,,02/15/1969,male,Not captured,Not captured,Not captured,Not captured,Not captured,Not captured,Not captured,Not captured,Not captured,Not captured,Not captured,Not captured,Not captured,,,Not captured,Not captured,Not captured,Not captured,4530 Greystone Ave,,Bronx,New York,10471,,,Not captured,Not captured,ortal79@yahoo.com,Not captured,701941232,,Not captured,Not captured,Not captured,Not captured,Not captured,Not captured,
Not captured,Not captured,10/02/2019,Not captured,Not captured,863949,020,00072,ARS-01-0052998,Beacon International,Not captured,Not captured,Not captured,,,,McPhee,Bradley,,09/01/1958,male,Not captured,Not captured,Not captured,Not captured,Not captured,Not captured,Not captured,Not captured,Not captured,Not captured,Not captured,Not captured,Not captured,,,Not captured,Not captured,Not captured,Not captured,75 E Ashland St.,,Doylestown,Pennsylvania,18901,,,Not captured,Not captured,pattrealtor@gmail.com,Not captured,701941228,,Not captured,Not captured,Not captured,Not captured,Not captured,Not captured,
Not captured,Not captured,10/02/2019,Not captured,Not captured,863949,020,00072,ARS-01-0052997,Beacon International,Not captured,Not captured,Not captured,,,,Tagliolini,Patricia,,03/25/1961,female,Not captured,Not captured,Not captured,Not captured,Not captured,Not captured,Not captured,Not captured,Not captured,Not captured,Not captured,Not captured,Not captured,,,Not captured,Not captured,Not captured,Not captured,75 E Ashland St.,,Doylestown,Pennsylvania,18901,,,Not captured,Not captured,pattrealtor@gmail.com,Not captured,701941227,,Not captured,Not captured,Not captured,Not captured,Not captured,Not captured,
Not captured,Not captured,10/02/2019,Not captured,Not captured,863949,020,00072,ARS-02-0052996,Beacon America,Not captured,Not captured,Not captured,,,,Nagy,Janice,,11/17/1966,female,Not captured,Not captured,Not captured,Not captured,Not captured,Not captured,Not captured,Not captured,Not captured,Not captured,Not captured,Not captured,Not captured,,,Not captured,Not captured,Not captured,Not captured,1117 Earl Ave,,Schenectady,New York,12309,,,Not captured,Not captured,dirk.nagy@gmail.com,Not captured,701941226,,Not captured,Not captured,Not captured,Not captured,Not captured,Not captured,
Not captured,Not captured,10/02/2019,Not captured,Not captured,863949,020,00072,ARS-02-0052995,Beacon America,Not captured,Not captured,Not captured,,,,Nagy,Dirk,,09/11/1964,male,Not captured,Not captured,Not captured,Not captured,Not captured,Not captured,Not captured,Not captured,Not captured,Not captured,Not captured,Not captured,Not captured,,,Not captured,Not captured,Not captured,Not captured,1117 Earl Ave,,Schenectady,New York,12309,,,Not captured,Not captured,dirk.nagy@gmail.com,Not captured,701941225,,Not captured,Not captured,Not captured,Not captured,Not captured,Not captured,
Not captured,Not captured,10/03/2019,Not captured,Not captured,863949,020,00072,ARS-02-0052992,Beacon America,Not captured,Not captured,Not captured,,,,Jallepalli,Prasanna,,07/11/1979,female,Not captured,Not captured,Not captured,Not captured,Not captured,Not captured,Not captured,Not captured,Not captured,Not captured,Not captured,Not captured,Not captured,Kiran Jallepalli,Brother,Not captured,Not captured,Not captured,Not captured,747 Corralbell way,,Fort mill,South Carolina,29708,9082172629,,Not captured,Not captured,kiran0927@gmail.com,Not captured,701941220,,Not captured,Not captured,Not captured,Not captured,Not captured,Not captured,
Not captured,Not captured,10/03/2019,Not captured,Not captured,863949,020,00072,ARS-02-0052991,Beacon America,Not captured,Not captured,Not captured,,,,jallepalli,sudhakar,Babu,05/10/1971,male,Not captured,Not captured,Not captured,Not captured,Not captured,Not captured,Not captured,Not captured,Not captured,Not captured,Not captured,Not captured,Not captured,Kiran Jallepalli,Brother,Not captured,Not captured,Not captured,Not captured,747 Corralbell way,,Fort mill,South Carolina,29708,9082172629,,Not captured,Not captured,kiran0927@gmail.com,Not captured,701941219,,Not captured,Not captured,Not captured,Not captured,Not captured,Not captured,
Not captured,Not captured,10/02/2019,Not captured,Not captured,863949,020,00072,ARS-02-0052990,Beacon America,Not captured,Not captured,Not captured,,,,Livermore,Kim,,07/20/1960,female,Not captured,Not captured,Not captured,Not captured,Not captured,Not captured,Not captured,Not captured,Not captured,Not captured,Not captured,Not captured,Not captured,,,Not captured,Not captured,Not captured,Not captured,36 COBALT LANE,,WESTBURY,New York,11590,,,Not captured,Not captured,KIMLIVERMORE@GMAIL.COM,Not captured,701941218,,Not captured,Not captured,Not captured,Not captured,Not captured,Not captured,
Not captured,Not captured,10/03/2019,Not captured,Not captured,863949,020,00072,ARS-03-0052907,Essential America,Not captured,Not captured,Not captured,Passport(K9098510),,,Anugu Reddy,Bhargav,,08/12/1990,male,Not captured,Not captured,Not captured,Not captured,Not captured,Not captured,Not captured,Not captured,Not captured,Not captured,Not captured,Not captured,Not captured,,,Not captured,Not captured,Not captured,Not captured,HNO 14 64 Ramnagar,,Telangani,Jammu and Kashmir,508111,9717549891,,Not captured,Not captured,Bharati@VisitorsInsurance.com,Not captured,701941083,,Not captured,Not captured,Not captured,Not captured,Not captured,Not captured,
Not captured,Not captured,10/03/2019,Not captured,Not captured,863949,020,00072,ARS-03-0052907,Essential America,Not captured,Not captured,Not captured,,Passport(N1120281),Dependant,Anusha Reddy,Malgireddy,,04/23/1995,female,Not captured,Not captured,Not captured,Not captured,Not captured,Not captured,Not captured,Not captured,Not captured,Not captured,Not captured,Not captured,Not captured,,,Not captured,Not captured,Not captured,Not captured,HNO 14 64 Ramnagar,,Telangani,Jammu and Kashmir,508111,9717549891,,Not captured,Not captured,Bharati@VisitorsInsurance.com,Not captured,,701941084,Not captured,Not captured,Not captured,Not captured,Not captured,Not captured,
Not captured,Not captured,10/03/2019,Not captured,Not captured,863949,020,00072,ARS-03-0052965,Essential America,Not captured,Not captured,Not captured,Passport(D173202013),,,Gadde,Phanichowdary,,08/18/1992,male,Not captured,Not captured,Not captured,Not captured,Not captured,Not captured,Not captured,Not captured,Not captured,Not captured,Not captured,Not captured,Not captured,,,Not captured,Not captured,Not captured,Not captured,21 11013 Sharadha hasar,,Hyderabad,Haryana,500035,5512477829,,Not captured,Not captured,phanichowdary08@gmail.com,Not captured,701941163,,Not captured,Not captured,Not captured,Not captured,Not captured,Not captured,
Not captured,Not captured,10/02/2019,Not captured,Not captured,863949,020,00072,ARS-01-0052988,Beacon International,Not captured,Not captured,Not captured,,,,Cales,Agnieszka,W,08/01/1978,female,Not captured,Not captured,Not captured,Not captured,Not captured,Not captured,Not captured,Not captured,Not captured,Not captured,Not captured,Not captured,Not captured,,,Not captured,Not captured,Not captured,Not captured,5315 S New England Ave,,Chicago,Illinois,60638,,,Not captured,Not captured,agnieszkacierpisz@yahoo.com,Not captured,701941216,,Not captured,Not captured,Not captured,Not captured,Not captured,Not captured,
Not captured,Not captured,10/03/2019,Not captured,Not captured,863949,020,00072,ARS-03-0052967,Essential International,Not captured,Not captured,Not captured,SSN(248085679),,,Smeltz,Kevin,Walter,06/11/1971,male,Not captured,Not captured,Not captured,Not captured,Not captured,Not captured,Not captured,Not captured,Not captured,Not captured,Not captured,Not captured,Not captured,,,Not captured,Not captured,Not captured,Not captured,2285 wintermers Point Dr.,,Winter Garoon,Florida,34787,4073127054,,Not captured,Not captured,kevinsmeltz@icloud.com,Not captured,701941165,,Not captured,Not captured,Not captured,Not captured,Not captured,Not captured,
Not captured,Not captured,10/02/2019,Not captured,Not captured,863949,020,00072,ARS-02-0052986,Beacon America,Not captured,Not captured,Not captured,,,,Yang,Bicheng,,08/28/1970,male,Not captured,Not captured,Not captured,Not captured,Not captured,Not captured,Not captured,Not captured,Not captured,Not captured,Not captured,Not captured,Not captured,,,Not captured,Not captured,Not captured,Not captured,7-1-2402 Qianxi Xuefuyuan,,Taiyuan Shanxi Province,,030006,,,Not captured,Not captured,malingzh@gmail.com,Not captured,701941214,,Not captured,Not captured,Not captured,Not captured,Not captured,Not captured,
Not captured,Not captured,10/02/2019,Not captured,Not captured,863949,020,00072,ARS-01-0052984,Beacon International,Not captured,Not captured,Not captured,,,,Nayman,Solomom,,01/08/1946,male,Not captured,Not captured,Not captured,Not captured,Not captured,Not captured,Not captured,Not captured,Not captured,Not captured,Not captured,Not captured,Not captured,,,Not captured,Not captured,Not captured,Not captured,3 Beechwood Dr,,Lawrence,New York,11559,516-6808443,,Not captured,Not captured,S.J.nayman@gmail.com,Not captured,701941195,,Not captured,Not captured,Not captured,Not captured,Not captured,Not captured,
Not captured,Not captured,10/03/2019,Not captured,Not captured,863949,020,00072,ARS-01-0052982,Beacon International,Not captured,Not captured,Not captured,,,,Twerski,Dovid,,06/23/2011,male,Not captured,Not captured,Not captured,Not captured,Not captured,Not captured,Not captured,Not captured,Not captured,Not captured,Not captured,Not captured,Not captured,,,Not captured,Not captured,Not captured,Not captured,6 cole Lane,,Lakewood,New Jersey,08701,848-706-7101,,Not captured,Not captured,twerski675@gmail.com,Not captured,701941193,,Not captured,Not captured,Not captured,Not captured,Not captured,Not captured,
Not captured,Not captured,10/02/2019,Not captured,Not captured,863949,020,00072,ARS-01-0052979,Beacon International,Not captured,Not captured,Not captured,,,,Cuyvers,Ann-Sofie,,08/17/1990,female,Not captured,Not captured,Not captured,Not captured,Not captured,Not captured,Not captured,Not captured,Not captured,Not captured,Not captured,Not captured,Not captured,,,Not captured,Not captured,Not captured,Not captured,Al Samaya Building 213,,Dubai,,9999,,,Not captured,Not captured,cuyvers.annsofie@gmail.com,Not captured,701941190,,Not captured,Not captured,Not captured,Not captured,Not captured,Not captured,
Not captured,Not captured,10/01/2019,Not captured,Not captured,863949,020,00072,ARS-01-0052976,Beacon International,Not captured,Not captured,Not captured,,,,Sarchet,Brian,L,07/03/1964,male,Not captured,Not captured,Not captured,Not captured,Not captured,Not captured,Not captured,Not captured,Not captured,Not captured,Not captured,Not captured,Not captured,,,Not captured,Not captured,Not captured,Not captured,15252 Seneca Rd. Spc. 182,,Victorville,California,92392,,,Not captured,Not captured,briansarchet@yahoo.com,Not captured,701941187,,Not captured,Not captured,Not captured,Not captured,Not captured,Not captured,
Not captured,Not captured,10/03/2019,Not captured,Not captured,863949,020,00072,ARS-02-0052974,Beacon America,Not captured,Not captured,Not captured,,,,Festa,Ginevra,M,10/16/2014,female,Not captured,Not captured,Not captured,Not captured,Not captured,Not captured,Not captured,Not captured,Not captured,Not captured,Not captured,Not captured,Not captured,Roberto Festa,Brother In-law,Not captured,Not captured,Not captured,Not captured,19063 Park Ridge St.,,Weston,Florida,33332,9546818089,,Not captured,Not captured,miroman.corp@hotmail.com,Not captured,701941184,,Not captured,Not captured,Not captured,Not captured,Not captured,Not captured,
Not captured,Not captured,10/03/2019,Not captured,Not captured,863949,020,00072,ARS-02-0052973,Beacon America,Not captured,Not captured,Not captured,,,,Festa,Ciro,,04/19/1975,male,Not captured,Not captured,Not captured,Not captured,Not captured,Not captured,Not captured,Not captured,Not captured,Not captured,Not captured,Not captured,Not captured,Roberto Festa,Brother In-law,Not captured,Not captured,Not captured,Not captured,19063 Park Ridge St.,,Weston,Florida,33332,9546818089,,Not captured,Not captured,miroman.corp@hotmail.com,Not captured,701941183,,Not captured,Not captured,Not captured,Not captured,Not captured,Not captured,
Not captured,Not captured,10/03/2019,Not captured,Not captured,863949,020,00072,ARS-02-0052972,Beacon America,Not captured,Not captured,Not captured,Passport(YB5652739),,,Coco,Rosalba,,04/08/1981,female,Not captured,Not captured,Not captured,Not captured,Not captured,Not captured,Not captured,Not captured,Not captured,Not captured,Not captured,Not captured,Not captured,Roberto Festa,Brother In-law,Not captured,Not captured,Not captured,Not captured,19063 Park Ridge St.,,Weston,Florida,33332,9546818089,,Not captured,Not captured,miroman.corp@hotmail.com,Not captured,701941182,,Not captured,Not captured,Not captured,Not captured,Not captured,Not captured,
Not captured,Not captured,10/01/2019,Not captured,Not captured,863949,020,00072,ARS-01-0052970,Beacon International,Not captured,Not captured,Not captured,,,,Vechik,Terry,L,02/04/1957,male,Not captured,Not captured,Not captured,Not captured,Not captured,Not captured,Not captured,Not captured,Not captured,Not captured,Not captured,Not captured,Not captured,,,Not captured,Not captured,Not captured,Not captured,2460 Wood Court,,Claremont,California,91711,,,Not captured,Not captured,greenfuelguy@gmail.com,Not captured,701941180,,Not captured,Not captured,Not captured,Not captured,Not captured,Not captured,