EE Transaction Type,Dependent Transaction Type,Effective Date,EE Signature,EE Signature Date,Control,Suffix,Account,Plan Number,Plan Name,Claim Office,Network ID Number,Customer Code,EE SSN,Dependent SSN,Dependent Relationship,Last Name,First Name,Middle Initial,DOB,Gender,Ethnicity,PCP/PCD,PCP/PCD Current Patient,Provider Cap Office Number,COB,Dep Student Indicator,Dep OOA Indicator,EE Prior Coverage Indicator,EE Late Entrant,EE Language Indicator,Hire Date,Earnings,Earnings Frequency,Beneficiary (Last Name First Name MI),Beneficiary Relationship,Continuation of Coverage Expiration Date,Continuation of Coverage Event Date,Continuation of Coverage Length of Coverage,Work Location Zip Code,Street Address Line 1,Street Address Line 2,City,State,Zip Code,Home Phone Number,Work Phone Number,Accept Code,Evidence Code,EE Email Address,Communication Disability Code,EE Alternate ID,Dep Alternate ID,Old Control,Old Suffix,Old Account,New Control,New Suffix,New Account,
Not captured,Not captured,10/01/2019,Not captured,Not captured,863949,020,00072,ARS-01-0052976,Beacon International,Not captured,Not captured,Not captured,,,,Sarchet,Brian,L,07/03/1964,male,Not captured,Not captured,Not captured,Not captured,Not captured,Not captured,Not captured,Not captured,Not captured,Not captured,Not captured,Not captured,Not captured,,,Not captured,Not captured,Not captured,Not captured,15252 Seneca Rd. Spc. 182,,Victorville,California,92392,,,Not captured,Not captured,briansarchet@yahoo.com,Not captured,701941187,,Not captured,Not captured,Not captured,Not captured,Not captured,Not captured,
Not captured,Not captured,10/01/2019,Not captured,Not captured,863949,020,00072,ARS-01-0052970,Beacon International,Not captured,Not captured,Not captured,,,,Vechik,Terry,L,02/04/1957,male,Not captured,Not captured,Not captured,Not captured,Not captured,Not captured,Not captured,Not captured,Not captured,Not captured,Not captured,Not captured,Not captured,,,Not captured,Not captured,Not captured,Not captured,2460 Wood Court,,Claremont,California,91711,,,Not captured,Not captured,greenfuelguy@gmail.com,Not captured,701941180,,Not captured,Not captured,Not captured,Not captured,Not captured,Not captured,
Not captured,Not captured,10/01/2019,Not captured,Not captured,863949,020,00072,ARS-03-0052961,Essential International,Not captured,Not captured,Not captured,Passport(LT689678),,,Lilord,Xavier,Stuart Leon,07/10/2019,male,Not captured,Not captured,Not captured,Not captured,Not captured,Not captured,Not captured,Not captured,Not captured,Not captured,Not captured,Not captured,Not captured,,,Not captured,Not captured,Not captured,Not captured,PO Box 434,,Luganville,Santo,0000,6785577755,,Not captured,Not captured,maxine@upandupministries.org,Not captured,701941159,,Not captured,Not captured,Not captured,Not captured,Not captured,Not captured,
Not captured,Not captured,09/30/2019,Not captured,Not captured,863949,020,00072,ARS-01-0052968,Beacon International,Not captured,Not captured,Not captured,Passport(516958148),,,Skahan,Erin,,01/23/1980,female,Not captured,Not captured,Not captured,Not captured,Not captured,Not captured,Not captured,Not captured,Not captured,Not captured,Not captured,Not captured,Not captured,Debbie Skahan,Mother,Not captured,Not captured,Not captured,Not captured,2977 West Cantebury,,Springfield,Missouri,65810,3035861295,,Not captured,Not captured,erinskahan@gmail.com,Not captured,701941178,,Not captured,Not captured,Not captured,Not captured,Not captured,Not captured,
Not captured,Not captured,09/30/2019,Not captured,Not captured,863949,020,00072,ARS-01-0052960,Beacon International,Not captured,Not captured,Not captured,,,,Batzel,Jared,W,06/25/1985,male,Not captured,Not captured,Not captured,Not captured,Not captured,Not captured,Not captured,Not captured,Not captured,Not captured,Not captured,Not captured,Not captured,,,Not captured,Not captured,Not captured,Not captured,2943 Kalakaua Ave,,Honolulu,Hawaii,96815,,,Not captured,Not captured,jared.batzel@gmail.com,Not captured,701941158,,Not captured,Not captured,Not captured,Not captured,Not captured,Not captured,
Not captured,Not captured,09/30/2019,Not captured,Not captured,863949,020,00072,ARS-03-0052863,Essential International,Not captured,Not captured,Not captured,Passport(NA),,,MORRIS,GARY,,03/01/1961,male,Not captured,Not captured,Not captured,Not captured,Not captured,Not captured,Not captured,Not captured,Not captured,Not captured,Not captured,Not captured,Not captured,,,Not captured,Not captured,Not captured,Not captured,436 VASQUEZ CT APT 3,,SUNNYDALE,California,94086,7073340218,,Not captured,Not captured,garyatadvance@aol.com,Not captured,701941003,,Not captured,Not captured,Not captured,Not captured,Not captured,Not captured,
Not captured,Not captured,10/01/2019,Not captured,Not captured,863949,020,00072,ARS-02-0052957,Beacon America,Not captured,Not captured,Not captured,Passport(EB393905),,,Agbodzalou,Louis,,03/22/1974,male,Not captured,Not captured,Not captured,Not captured,Not captured,Not captured,Not captured,Not captured,Not captured,Not captured,Not captured,Not captured,Not captured,Equip International,other,Not captured,Not captured,Not captured,Not captured,126 Rockhouse,,Marion,North Carolina,28752,828 738 3414,,Not captured,Not captured,brendaandlouis1@gmail.com,Not captured,701941146,,Not captured,Not captured,Not captured,Not captured,Not captured,Not captured,
Not captured,Not captured,10/01/2019,Not captured,Not captured,863949,020,00072,ARS-01-0052953,Beacon International,Not captured,Not captured,Not captured,,,,Wells,Carrie,D,10/08/1967,female,Not captured,Not captured,Not captured,Not captured,Not captured,Not captured,Not captured,Not captured,Not captured,Not captured,Not captured,Not captured,Not captured,Bryce Wells,son,Not captured,Not captured,Not captured,Not captured,4219 N Church Way Apt 6,,Louisville,Kentucky,40207,502-873-7808,,Not captured,Not captured,dwells@reachingandteaching.org,Not captured,701941142,,Not captured,Not captured,Not captured,Not captured,Not captured,Not captured,
Not captured,Not captured,10/01/2019,Not captured,Not captured,863949,020,00072,ARS-01-0052952,Beacon International,Not captured,Not captured,Not captured,Passport(567431452),,,Wells,David,L,01/19/1966,male,Not captured,Not captured,Not captured,Not captured,Not captured,Not captured,Not captured,Not captured,Not captured,Not captured,Not captured,Not captured,Not captured,Bryce Wells,son,Not captured,Not captured,Not captured,Not captured,4219 N Church Way Apt 6,,Louisville,Kentucky,40207,502-873-7808,,Not captured,Not captured,dwells@reachingandteaching.org,Not captured,701941141,,Not captured,Not captured,Not captured,Not captured,Not captured,Not captured,
Not captured,Not captured,09/29/2019,Not captured,Not captured,863949,020,00072,ARS-01-0052951,Beacon International,Not captured,Not captured,Not captured,,,,MacDonald,Kelly,,01/18/1977,female,Not captured,Not captured,Not captured,Not captured,Not captured,Not captured,Not captured,Not captured,Not captured,Not captured,Not captured,Not captured,Not captured,Kelly Shumway,Wife,Not captured,Not captured,Not captured,Not captured,6037 E Mountain Court,,Cave Creek,Arizona,85331,8165089011,,Not captured,Not captured,Steve@blackmountainpartners.com,Not captured,701941140,,Not captured,Not captured,Not captured,Not captured,Not captured,Not captured,
Not captured,Not captured,09/29/2019,Not captured,Not captured,863949,020,00072,ARS-01-0052950,Beacon International,Not captured,Not captured,Not captured,Passport(505574881),,,Anderson,Steve,,08/07/1966,male,Not captured,Not captured,Not captured,Not captured,Not captured,Not captured,Not captured,Not captured,Not captured,Not captured,Not captured,Not captured,Not captured,Kelly Shumway,Wife,Not captured,Not captured,Not captured,Not captured,6037 E Mountain Court,,Cave Creek,Arizona,85331,8165089011,,Not captured,Not captured,Steve@blackmountainpartners.com,Not captured,701941139,,Not captured,Not captured,Not captured,Not captured,Not captured,Not captured,
Not captured,Not captured,09/29/2019,Not captured,Not captured,863949,020,00072,ARS-01-0052949,Beacon International,Not captured,Not captured,Not captured,,,,Gomez,Jose,,11/16/1972,male,Not captured,Not captured,Not captured,Not captured,Not captured,Not captured,Not captured,Not captured,Not captured,Not captured,Not captured,Not captured,Not captured,,,Not captured,Not captured,Not captured,Not captured,8764 West 76th Ave,,Arvada,Colorado,80005,,,Not captured,Not captured,joe.gomez72@gmail.com,Not captured,701941138,,Not captured,Not captured,Not captured,Not captured,Not captured,Not captured,
Not captured,Not captured,09/29/2019,Not captured,Not captured,863949,020,00072,OVI-28-0052946,OverseasCare Visitors Insurance Plan,Not captured,Not captured,Not captured,Passport(J0041039),,,SONI,YUDHISHTAR,R,11/12/1932,male,Not captured,Not captured,Not captured,Not captured,Not captured,Not captured,Not captured,Not captured,Not captured,Not captured,Not captured,Not captured,Not captured,sanjay r soni,SON,Not captured,Not captured,Not captured,Not captured,290 Stonebrier Ln,,Alpharetta,Georgia,30004,6094892428,,Not captured,Not captured,sanjayrajsoni@gmail.com,Not captured,701941135,,Not captured,Not captured,Not captured,Not captured,Not captured,Not captured,
Not captured,Not captured,09/29/2019,Not captured,Not captured,863949,020,00072,ARS-01-0052944,Beacon International,Not captured,Not captured,Not captured,,,,Avery,Charles,,09/28/1962,male,Not captured,Not captured,Not captured,Not captured,Not captured,Not captured,Not captured,Not captured,Not captured,Not captured,Not captured,Not captured,Not captured,,,Not captured,Not captured,Not captured,Not captured,1753 Mathews Manor Drive,,Jacksonville,Florida,32211,,,Not captured,Not captured,braveryusa@gmail.com,Not captured,701941133,,Not captured,Not captured,Not captured,Not captured,Not captured,Not captured,
Not captured,Not captured,10/01/2019,Not captured,Not captured,863949,020,00072,OVI-28-0052943,OverseasCare Visitors Insurance Plan,Not captured,Not captured,Not captured,Passport(M6577120),,,Sharma,Aparna,Janardhan,02/14/1958,female,Not captured,Not captured,Not captured,Not captured,Not captured,Not captured,Not captured,Not captured,Not captured,Not captured,Not captured,Not captured,Not captured,Sowmya Sharma,Daughter,Not captured,Not captured,Not captured,Not captured,3950 N Lakeshore Dr,,Chicago,Illinois,60613,3126199839,,Not captured,Not captured,sowmyajs@gmail.com,Not captured,701941132,,Not captured,Not captured,Not captured,Not captured,Not captured,Not captured,
Not captured,Not captured,09/28/2019,Not captured,Not captured,863949,020,00072,ARS-01-0052942,Beacon International,Not captured,Not captured,Not captured,Passport(578420560),,,Semmel,Jenny,,04/01/1970,female,Not captured,Not captured,Not captured,Not captured,Not captured,Not captured,Not captured,Not captured,Not captured,Not captured,Not captured,Not captured,Not captured,Jane Semmel,Mother,Not captured,Not captured,Not captured,Not captured,251 W. 121st St. Apt 3,,New York,New York,10027,9172798600,,Not captured,Not captured,Semmelina@yahoo.com,Not captured,701941131,,Not captured,Not captured,Not captured,Not captured,Not captured,Not captured,
Not captured,Not captured,09/28/2019,Not captured,Not captured,863949,020,00072,ARS-01-0052941,Beacon International,Not captured,Not captured,Not captured,,,,Clark,Sean,,08/03/1978,male,Not captured,Not captured,Not captured,Not captured,Not captured,Not captured,Not captured,Not captured,Not captured,Not captured,Not captured,Not captured,Not captured,,,Not captured,Not captured,Not captured,Not captured,630 Meadow Wood Circle,,Dillon,Colorado,80435,,,Not captured,Not captured,jenloisphil@gmail.com,Not captured,701941130,,Not captured,Not captured,Not captured,Not captured,Not captured,Not captured,
Not captured,Not captured,09/28/2019,Not captured,Not captured,863949,020,00072,ARS-01-0052940,Beacon International,Not captured,Not captured,Not captured,,,,Phillips,Jennifer,,03/10/1984,female,Not captured,Not captured,Not captured,Not captured,Not captured,Not captured,Not captured,Not captured,Not captured,Not captured,Not captured,Not captured,Not captured,,,Not captured,Not captured,Not captured,Not captured,630 Meadow Wood Circle,,Dillon,Colorado,80435,,,Not captured,Not captured,jenloisphil@gmail.com,Not captured,701941129,,Not captured,Not captured,Not captured,Not captured,Not captured,Not captured,
Not captured,Not captured,09/28/2019,Not captured,Not captured,863949,020,00072,ARS-01-0052939,Beacon International,Not captured,Not captured,Not captured,,,,Smith,Patricia,,02/13/1962,female,Not captured,Not captured,Not captured,Not captured,Not captured,Not captured,Not captured,Not captured,Not captured,Not captured,Not captured,Not captured,Not captured,,,Not captured,Not captured,Not captured,Not captured,18 Cala D Or,,Laguna Niguel,California,92677,,,Not captured,Not captured,pattyjsmith8@gmail.com,Not captured,701941128,,Not captured,Not captured,Not captured,Not captured,Not captured,Not captured,
Not captured,Not captured,09/30/2019,Not captured,Not captured,863949,020,00072,OVI-28-0052938,OverseasCare Visitors Insurance Plan,Not captured,Not captured,Not captured,Passport(S5152771),,,Naidu,Vasanti,,05/13/1942,male,Not captured,Not captured,Not captured,Not captured,Not captured,Not captured,Not captured,Not captured,Not captured,Not captured,Not captured,Not captured,Not captured,Devendra Naidu,Son,Not captured,Not captured,Not captured,Not captured,2435 Rapollo Drive,,Kissimmee,Florida,34741,6313555630,,Not captured,Not captured,naidum19@gmail.com,Not captured,701941127,,Not captured,Not captured,Not captured,Not captured,Not captured,Not captured,
Not captured,Not captured,09/28/2019,Not captured,Not captured,863949,020,00072,ARS-02-0052936,Beacon America,Not captured,Not captured,Not captured,,,,Cao,Trang Minh Tu,,01/01/1980,male,Not captured,Not captured,Not captured,Not captured,Not captured,Not captured,Not captured,Not captured,Not captured,Not captured,Not captured,Not captured,Not captured,,,Not captured,Not captured,Not captured,Not captured,6595 Fleming st,,Vancouver,British Columbia,V5p3h3,,,Not captured,Not captured,tucaotrang@gmail.com,Not captured,701941125,,Not captured,Not captured,Not captured,Not captured,Not captured,Not captured,
Not captured,Not captured,09/29/2019,Not captured,Not captured,863949,020,00072,ARS-02-0052934,Beacon America,Not captured,Not captured,Not captured,Passport(AB069620),,,HESS,TRACY LANQING,,10/19/1970,female,Not captured,Not captured,Not captured,Not captured,Not captured,Not captured,Not captured,Not captured,Not captured,Not captured,Not captured,Not captured,Not captured,,,Not captured,Not captured,Not captured,Not captured,7137 165TH ST,,FRESH MEADOWS,New York,11365,9176646685,,Not captured,Not captured,lu_llx@msn.com,Not captured,701941123,,Not captured,Not captured,Not captured,Not captured,Not captured,Not captured,
Not captured,Not captured,09/29/2019,Not captured,Not captured,863949,020,00072,ARS-02-0052933,Beacon America,Not captured,Not captured,Not captured,Passport(HP427554),,,ZHANG,JICHENG,,05/13/1967,male,Not captured,Not captured,Not captured,Not captured,Not captured,Not captured,Not captured,Not captured,Not captured,Not captured,Not captured,Not captured,Not captured,,,Not captured,Not captured,Not captured,Not captured,7137 165TH ST,,FRESH MEADOWS,New York,11365,9176646685,,Not captured,Not captured,lu_llx@msn.com,Not captured,701941122,,Not captured,Not captured,Not captured,Not captured,Not captured,Not captured,
Not captured,Not captured,09/29/2019,Not captured,Not captured,863949,020,00072,ARS-02-0052932,Beacon America,Not captured,Not captured,Not captured,Passport(MA01470163),,,ZHONG,SHAN TOMMY,,11/14/1969,male,Not captured,Not captured,Not captured,Not captured,Not captured,Not captured,Not captured,Not captured,Not captured,Not captured,Not captured,Not captured,Not captured,,,Not captured,Not captured,Not captured,Not captured,7137 165TH ST,,FRESH MEADOWS,New York,11365,9176646685,,Not captured,Not captured,lu_llx@msn.com,Not captured,701941121,,Not captured,Not captured,Not captured,Not captured,Not captured,Not captured,
Not captured,Not captured,09/29/2019,Not captured,Not captured,863949,020,00072,ARS-02-0052931,Beacon America,Not captured,Not captured,Not captured,Passport(18AD04105),,,CLAMENS,ROBIN,,10/10/1997,male,Not captured,Not captured,Not captured,Not captured,Not captured,Not captured,Not captured,Not captured,Not captured,Not captured,Not captured,Not captured,Not captured,,,Not captured,Not captured,Not captured,Not captured,7137 165TH ST,,FRESH MEADOWS,New York,11365,9176646685,,Not captured,Not captured,lu_llx@msn.com,Not captured,701941120,,Not captured,Not captured,Not captured,Not captured,Not captured,Not captured,
Not captured,Not captured,09/29/2019,Not captured,Not captured,863949,020,00072,ARS-02-0052930,Beacon America,Not captured,Not captured,Not captured,Passport(18CC95578),,,MATTEO,LHOMMEAU,,09/17/1998,male,Not captured,Not captured,Not captured,Not captured,Not captured,Not captured,Not captured,Not captured,Not captured,Not captured,Not captured,Not captured,Not captured,,,Not captured,Not captured,Not captured,Not captured,7137 165TH ST,,FRESH MEADOWS,New York,11365,9176646685,,Not captured,Not captured,lu_llx@msn.com,Not captured,701941119,,Not captured,Not captured,Not captured,Not captured,Not captured,Not captured,
Not captured,Not captured,09/29/2019,Not captured,Not captured,863949,020,00072,ARS-02-0052929,Beacon America,Not captured,Not captured,Not captured,Passport(116386752),,,ALONZO RODRIGO,EZCURRA SILVA,,08/24/1992,male,Not captured,Not captured,Not captured,Not captured,Not captured,Not captured,Not captured,Not captured,Not captured,Not captured,Not captured,Not captured,Not captured,,,Not captured,Not captured,Not captured,Not captured,7137 165TH ST,,FRESH MEADOWS,New York,11365,9176646685,,Not captured,Not captured,lu_llx@msn.com,Not captured,701941118,,Not captured,Not captured,Not captured,Not captured,Not captured,Not captured,
Not captured,Not captured,09/29/2019,Not captured,Not captured,863949,020,00072,ARS-02-0052928,Beacon America,Not captured,Not captured,Not captured,Passport(PAB483324),,,ROGER SOLE,CAMATS,,06/30/1995,male,Not captured,Not captured,Not captured,Not captured,Not captured,Not captured,Not captured,Not captured,Not captured,Not captured,Not captured,Not captured,Not captured,,,Not captured,Not captured,Not captured,Not captured,7137 165TH ST,,FRESH MEADOWS,New York,11365,9176646685,,Not captured,Not captured,lu_llx@msn.com,Not captured,701941117,,Not captured,Not captured,Not captured,Not captured,Not captured,Not captured,
Not captured,Not captured,09/29/2019,Not captured,Not captured,863949,020,00072,ARS-02-0052927,Beacon America,Not captured,Not captured,Not captured,Passport(17IA20061),,,HAAS WILLIAM,NICOLAS,,11/01/1996,male,Not captured,Not captured,Not captured,Not captured,Not captured,Not captured,Not captured,Not captured,Not captured,Not captured,Not captured,Not captured,Not captured,,,Not captured,Not captured,Not captured,Not captured,7137 165TH ST,,FRESH MEADOWS,New York,11365,9176646685,,Not captured,Not captured,lu_llx@msn.com,Not captured,701941116,,Not captured,Not captured,Not captured,Not captured,Not captured,Not captured,
Not captured,Not captured,09/29/2019,Not captured,Not captured,863949,020,00072,ARS-02-0052926,Beacon America,Not captured,Not captured,Not captured,Passport(312431577),,,WU,TSUNG CHUN,,06/02/1996,male,Not captured,Not captured,Not captured,Not captured,Not captured,Not captured,Not captured,Not captured,Not captured,Not captured,Not captured,Not captured,Not captured,,,Not captured,Not captured,Not captured,Not captured,7137 165TH ST,,FRESH MEADOWS,New York,11365,9176646685,,Not captured,Not captured,lu_llx@msn.com,Not captured,701941115,,Not captured,Not captured,Not captured,Not captured,Not captured,Not captured,
Not captured,Not captured,09/29/2019,Not captured,Not captured,863949,020,00072,ARS-02-0052925,Beacon America,Not captured,Not captured,Not captured,Passport(350103328),,,HUNG,JUI SHENG,,05/15/1994,male,Not captured,Not captured,Not captured,Not captured,Not captured,Not captured,Not captured,Not captured,Not captured,Not captured,Not captured,Not captured,Not captured,,,Not captured,Not captured,Not captured,Not captured,7137 165TH ST,,FRESH MEADOWS,New York,11365,9176646685,,Not captured,Not captured,lu_llx@msn.com,Not captured,701941114,,Not captured,Not captured,Not captured,Not captured,Not captured,Not captured,
Not captured,Not captured,09/28/2019,Not captured,Not captured,863949,020,00072,ARS-02-0052924,Beacon America,Not captured,Not captured,Not captured,,,,Perrotto,Linda,,02/13/1948,female,Not captured,Not captured,Not captured,Not captured,Not captured,Not captured,Not captured,Not captured,Not captured,Not captured,Not captured,Not captured,Not captured,,,Not captured,Not captured,Not captured,Not captured,1074 South Street,,Roslindale,Massachusetts,02131,,,Not captured,Not captured,linda.perrotto@umb.edu,Not captured,701941113,,Not captured,Not captured,Not captured,Not captured,Not captured,Not captured,
Not captured,Not captured,10/01/2019,Not captured,Not captured,863949,020,00072,ARS-02-0052923,Beacon America,Not captured,Not captured,Not captured,Passport( Z2466468),,,Ramanathan,Krishnamurthy,,02/26/1948,male,Not captured,Not captured,Not captured,Not captured,Not captured,Not captured,Not captured,Not captured,Not captured,Not captured,Not captured,Not captured,Not captured,,,Not captured,Not captured,Not captured,Not captured,4336 Benton Elm Dr,,Plano,Texas,75024,9724158998,,Not captured,Not captured,karadikp@yahoo.com,Not captured,701941112,,Not captured,Not captured,Not captured,Not captured,Not captured,Not captured,
Not captured,Not captured,09/27/2019,Not captured,Not captured,863949,020,00072,ARS-01-0052922,Beacon International,Not captured,Not captured,Not captured,,,,Amora,Edna,C,01/24/1955,female,Not captured,Not captured,Not captured,Not captured,Not captured,Not captured,Not captured,Not captured,Not captured,Not captured,Not captured,Not captured,Not captured,,,Not captured,Not captured,Not captured,Not captured,186 Wilshire Avenue,,Daly City,California,94015,,,Not captured,Not captured,louy186@yahoo.com,Not captured,701941111,,Not captured,Not captured,Not captured,Not captured,Not captured,Not captured,
Not captured,Not captured,09/27/2019,Not captured,Not captured,863949,020,00072,ARS-01-0052921,Beacon International,Not captured,Not captured,Not captured,,,,Amora,Maria,L,02/11/1954,female,Not captured,Not captured,Not captured,Not captured,Not captured,Not captured,Not captured,Not captured,Not captured,Not captured,Not captured,Not captured,Not captured,,,Not captured,Not captured,Not captured,Not captured,186 Wilshire Avenue,,Daly City,California,94015,,,Not captured,Not captured,louy186@yahoo.com,Not captured,701941110,,Not captured,Not captured,Not captured,Not captured,Not captured,Not captured,
Not captured,Not captured,09/27/2019,Not captured,Not captured,863949,020,00072,ARS-02-0052920,Beacon America,Not captured,Not captured,Not captured,,,,Tomassen,David,J,09/26/1981,male,Not captured,Not captured,Not captured,Not captured,Not captured,Not captured,Not captured,Not captured,Not captured,Not captured,Not captured,Not captured,Not captured,,,Not captured,Not captured,Not captured,Not captured,1620 Gerity Rd,,Bellingham,Washington,98229,,,Not captured,Not captured,geneva.faulkner@gmail.com,Not captured,701941098,,Not captured,Not captured,Not captured,Not captured,Not captured,Not captured,