EE Transaction Type,Dependent Transaction Type,Effective Date,EE Signature,EE Signature Date,Control,Suffix,Account,Plan Number,Plan Name,Claim Office,Network ID Number,Customer Code,EE SSN,Dependent SSN,Dependent Relationship,Last Name,First Name,Middle Initial,DOB,Gender,Ethnicity,PCP/PCD,PCP/PCD Current Patient,Provider Cap Office Number,COB,Dep Student Indicator,Dep OOA Indicator,EE Prior Coverage Indicator,EE Late Entrant,EE Language Indicator,Hire Date,Earnings,Earnings Frequency,Beneficiary (Last Name First Name MI),Beneficiary Relationship,Continuation of Coverage Expiration Date,Continuation of Coverage Event Date,Continuation of Coverage Length of Coverage,Work Location Zip Code,Street Address Line 1,Street Address Line 2,City,State,Zip Code,Home Phone Number,Work Phone Number,Accept Code,Evidence Code,EE Email Address,Communication Disability Code,EE Alternate ID,Dep Alternate ID,Old Control,Old Suffix,Old Account,New Control,New Suffix,New Account,
Not captured,Not captured,10/03/2019,Not captured,Not captured,863949,020,00072,ARS-03-0052050,Essential America,Not captured,Not captured,Not captured,Passport(C3JWJ0367),,,Bauschulte,Matthias,,10/31/1966,male,Not captured,Not captured,Not captured,Not captured,Not captured,Not captured,Not captured,Not captured,Not captured,Not captured,Not captured,Not captured,Not captured,,,Not captured,Not captured,Not captured,Not captured,1651 N 400 E Apt 732,,North Logan,Utah,84341,004915730095104,,Not captured,Not captured,matthias.bauschulte@gmail.com,Not captured,701939437,,Not captured,Not captured,Not captured,Not captured,Not captured,Not captured,
Not captured,Not captured,10/03/2019,Not captured,Not captured,863949,020,00072,ARS-01-0053011,Beacon International,Not captured,Not captured,Not captured,,,,Levitt,Bara,,04/09/1987,female,Not captured,Not captured,Not captured,Not captured,Not captured,Not captured,Not captured,Not captured,Not captured,Not captured,Not captured,Not captured,Not captured,,,Not captured,Not captured,Not captured,Not captured,219 Cerutti Ct,,West Orange,New Jersey,07052,,,Not captured,Not captured,LEVITTBARA@GMAIL.COM,Not captured,701941249,,Not captured,Not captured,Not captured,Not captured,Not captured,Not captured,
Not captured,Not captured,10/03/2019,Not captured,Not captured,863949,020,00072,ARS-01-0053003,Beacon International,Not captured,Not captured,Not captured,,,,Gordon,Matthew,,06/22/2013,male,Not captured,Not captured,Not captured,Not captured,Not captured,Not captured,Not captured,Not captured,Not captured,Not captured,Not captured,Not captured,Not captured,,,Not captured,Not captured,Not captured,Not captured,4530 Greystone Ave,,Bronx,New York,10471,,,Not captured,Not captured,ortal79@yahoo.com,Not captured,701941233,,Not captured,Not captured,Not captured,Not captured,Not captured,Not captured,
Not captured,Not captured,10/03/2019,Not captured,Not captured,863949,020,00072,ARS-01-0053002,Beacon International,Not captured,Not captured,Not captured,,,,Gordon,Frederick,,02/15/1969,male,Not captured,Not captured,Not captured,Not captured,Not captured,Not captured,Not captured,Not captured,Not captured,Not captured,Not captured,Not captured,Not captured,,,Not captured,Not captured,Not captured,Not captured,4530 Greystone Ave,,Bronx,New York,10471,,,Not captured,Not captured,ortal79@yahoo.com,Not captured,701941232,,Not captured,Not captured,Not captured,Not captured,Not captured,Not captured,
Not captured,Not captured,10/02/2019,Not captured,Not captured,863949,020,00072,ARS-01-0052998,Beacon International,Not captured,Not captured,Not captured,,,,McPhee,Bradley,,09/01/1958,male,Not captured,Not captured,Not captured,Not captured,Not captured,Not captured,Not captured,Not captured,Not captured,Not captured,Not captured,Not captured,Not captured,,,Not captured,Not captured,Not captured,Not captured,75 E Ashland St.,,Doylestown,Pennsylvania,18901,,,Not captured,Not captured,pattrealtor@gmail.com,Not captured,701941228,,Not captured,Not captured,Not captured,Not captured,Not captured,Not captured,
Not captured,Not captured,10/02/2019,Not captured,Not captured,863949,020,00072,ARS-01-0052997,Beacon International,Not captured,Not captured,Not captured,,,,Tagliolini,Patricia,,03/25/1961,female,Not captured,Not captured,Not captured,Not captured,Not captured,Not captured,Not captured,Not captured,Not captured,Not captured,Not captured,Not captured,Not captured,,,Not captured,Not captured,Not captured,Not captured,75 E Ashland St.,,Doylestown,Pennsylvania,18901,,,Not captured,Not captured,pattrealtor@gmail.com,Not captured,701941227,,Not captured,Not captured,Not captured,Not captured,Not captured,Not captured,
Not captured,Not captured,10/02/2019,Not captured,Not captured,863949,020,00072,ARS-02-0052996,Beacon America,Not captured,Not captured,Not captured,,,,Nagy,Janice,,11/17/1966,female,Not captured,Not captured,Not captured,Not captured,Not captured,Not captured,Not captured,Not captured,Not captured,Not captured,Not captured,Not captured,Not captured,,,Not captured,Not captured,Not captured,Not captured,1117 Earl Ave,,Schenectady,New York,12309,,,Not captured,Not captured,dirk.nagy@gmail.com,Not captured,701941226,,Not captured,Not captured,Not captured,Not captured,Not captured,Not captured,
Not captured,Not captured,10/02/2019,Not captured,Not captured,863949,020,00072,ARS-02-0052995,Beacon America,Not captured,Not captured,Not captured,,,,Nagy,Dirk,,09/11/1964,male,Not captured,Not captured,Not captured,Not captured,Not captured,Not captured,Not captured,Not captured,Not captured,Not captured,Not captured,Not captured,Not captured,,,Not captured,Not captured,Not captured,Not captured,1117 Earl Ave,,Schenectady,New York,12309,,,Not captured,Not captured,dirk.nagy@gmail.com,Not captured,701941225,,Not captured,Not captured,Not captured,Not captured,Not captured,Not captured,
Not captured,Not captured,10/03/2019,Not captured,Not captured,863949,020,00072,ARS-02-0052992,Beacon America,Not captured,Not captured,Not captured,,,,Jallepalli,Prasanna,,07/11/1979,female,Not captured,Not captured,Not captured,Not captured,Not captured,Not captured,Not captured,Not captured,Not captured,Not captured,Not captured,Not captured,Not captured,Kiran Jallepalli,Brother,Not captured,Not captured,Not captured,Not captured,747 Corralbell way,,Fort mill,South Carolina,29708,9082172629,,Not captured,Not captured,kiran0927@gmail.com,Not captured,701941220,,Not captured,Not captured,Not captured,Not captured,Not captured,Not captured,
Not captured,Not captured,10/03/2019,Not captured,Not captured,863949,020,00072,ARS-02-0052991,Beacon America,Not captured,Not captured,Not captured,,,,jallepalli,sudhakar,Babu,05/10/1971,male,Not captured,Not captured,Not captured,Not captured,Not captured,Not captured,Not captured,Not captured,Not captured,Not captured,Not captured,Not captured,Not captured,Kiran Jallepalli,Brother,Not captured,Not captured,Not captured,Not captured,747 Corralbell way,,Fort mill,South Carolina,29708,9082172629,,Not captured,Not captured,kiran0927@gmail.com,Not captured,701941219,,Not captured,Not captured,Not captured,Not captured,Not captured,Not captured,
Not captured,Not captured,10/02/2019,Not captured,Not captured,863949,020,00072,ARS-02-0052990,Beacon America,Not captured,Not captured,Not captured,,,,Livermore,Kim,,07/20/1960,female,Not captured,Not captured,Not captured,Not captured,Not captured,Not captured,Not captured,Not captured,Not captured,Not captured,Not captured,Not captured,Not captured,,,Not captured,Not captured,Not captured,Not captured,36 COBALT LANE,,WESTBURY,New York,11590,,,Not captured,Not captured,KIMLIVERMORE@GMAIL.COM,Not captured,701941218,,Not captured,Not captured,Not captured,Not captured,Not captured,Not captured,
Not captured,Not captured,10/03/2019,Not captured,Not captured,863949,020,00072,ARS-03-0052907,Essential America,Not captured,Not captured,Not captured,Passport(K9098510),,,Anugu Reddy,Bhargav,,08/12/1990,male,Not captured,Not captured,Not captured,Not captured,Not captured,Not captured,Not captured,Not captured,Not captured,Not captured,Not captured,Not captured,Not captured,,,Not captured,Not captured,Not captured,Not captured,HNO 14 64 Ramnagar,,Telangani,Jammu and Kashmir,508111,9717549891,,Not captured,Not captured,Bharati@VisitorsInsurance.com,Not captured,701941083,,Not captured,Not captured,Not captured,Not captured,Not captured,Not captured,
Not captured,Not captured,10/03/2019,Not captured,Not captured,863949,020,00072,ARS-03-0052907,Essential America,Not captured,Not captured,Not captured,,Passport(N1120281),Dependant,Anusha Reddy,Malgireddy,,04/23/1995,female,Not captured,Not captured,Not captured,Not captured,Not captured,Not captured,Not captured,Not captured,Not captured,Not captured,Not captured,Not captured,Not captured,,,Not captured,Not captured,Not captured,Not captured,HNO 14 64 Ramnagar,,Telangani,Jammu and Kashmir,508111,9717549891,,Not captured,Not captured,Bharati@VisitorsInsurance.com,Not captured,,701941084,Not captured,Not captured,Not captured,Not captured,Not captured,Not captured,
Not captured,Not captured,10/03/2019,Not captured,Not captured,863949,020,00072,ARS-03-0052965,Essential America,Not captured,Not captured,Not captured,Passport(D173202013),,,Gadde,Phanichowdary,,08/18/1992,male,Not captured,Not captured,Not captured,Not captured,Not captured,Not captured,Not captured,Not captured,Not captured,Not captured,Not captured,Not captured,Not captured,,,Not captured,Not captured,Not captured,Not captured,21 11013 Sharadha hasar,,Hyderabad,Haryana,500035,5512477829,,Not captured,Not captured,phanichowdary08@gmail.com,Not captured,701941163,,Not captured,Not captured,Not captured,Not captured,Not captured,Not captured,
Not captured,Not captured,10/02/2019,Not captured,Not captured,863949,020,00072,ARS-01-0052988,Beacon International,Not captured,Not captured,Not captured,,,,Cales,Agnieszka,W,08/01/1978,female,Not captured,Not captured,Not captured,Not captured,Not captured,Not captured,Not captured,Not captured,Not captured,Not captured,Not captured,Not captured,Not captured,,,Not captured,Not captured,Not captured,Not captured,5315 S New England Ave,,Chicago,Illinois,60638,,,Not captured,Not captured,agnieszkacierpisz@yahoo.com,Not captured,701941216,,Not captured,Not captured,Not captured,Not captured,Not captured,Not captured,
Not captured,Not captured,10/03/2019,Not captured,Not captured,863949,020,00072,ARS-03-0052967,Essential International,Not captured,Not captured,Not captured,SSN(248085679),,,Smeltz,Kevin,Walter,06/11/1971,male,Not captured,Not captured,Not captured,Not captured,Not captured,Not captured,Not captured,Not captured,Not captured,Not captured,Not captured,Not captured,Not captured,,,Not captured,Not captured,Not captured,Not captured,2285 wintermers Point Dr.,,Winter Garoon,Florida,34787,4073127054,,Not captured,Not captured,kevinsmeltz@icloud.com,Not captured,701941165,,Not captured,Not captured,Not captured,Not captured,Not captured,Not captured,
Not captured,Not captured,10/02/2019,Not captured,Not captured,863949,020,00072,ARS-02-0052986,Beacon America,Not captured,Not captured,Not captured,,,,Yang,Bicheng,,08/28/1970,male,Not captured,Not captured,Not captured,Not captured,Not captured,Not captured,Not captured,Not captured,Not captured,Not captured,Not captured,Not captured,Not captured,,,Not captured,Not captured,Not captured,Not captured,7-1-2402 Qianxi Xuefuyuan,,Taiyuan Shanxi Province,,030006,,,Not captured,Not captured,malingzh@gmail.com,Not captured,701941214,,Not captured,Not captured,Not captured,Not captured,Not captured,Not captured,
Not captured,Not captured,10/02/2019,Not captured,Not captured,863949,020,00072,ARS-01-0052984,Beacon International,Not captured,Not captured,Not captured,,,,Nayman,Solomom,,01/08/1946,male,Not captured,Not captured,Not captured,Not captured,Not captured,Not captured,Not captured,Not captured,Not captured,Not captured,Not captured,Not captured,Not captured,,,Not captured,Not captured,Not captured,Not captured,3 Beechwood Dr,,Lawrence,New York,11559,516-6808443,,Not captured,Not captured,S.J.nayman@gmail.com,Not captured,701941195,,Not captured,Not captured,Not captured,Not captured,Not captured,Not captured,
Not captured,Not captured,10/03/2019,Not captured,Not captured,863949,020,00072,ARS-01-0052982,Beacon International,Not captured,Not captured,Not captured,,,,Twerski,Dovid,,06/23/2011,male,Not captured,Not captured,Not captured,Not captured,Not captured,Not captured,Not captured,Not captured,Not captured,Not captured,Not captured,Not captured,Not captured,,,Not captured,Not captured,Not captured,Not captured,6 cole Lane,,Lakewood,New Jersey,08701,848-706-7101,,Not captured,Not captured,twerski675@gmail.com,Not captured,701941193,,Not captured,Not captured,Not captured,Not captured,Not captured,Not captured,
Not captured,Not captured,10/02/2019,Not captured,Not captured,863949,020,00072,ARS-01-0052979,Beacon International,Not captured,Not captured,Not captured,,,,Cuyvers,Ann-Sofie,,08/17/1990,female,Not captured,Not captured,Not captured,Not captured,Not captured,Not captured,Not captured,Not captured,Not captured,Not captured,Not captured,Not captured,Not captured,,,Not captured,Not captured,Not captured,Not captured,Al Samaya Building 213,,Dubai,,9999,,,Not captured,Not captured,cuyvers.annsofie@gmail.com,Not captured,701941190,,Not captured,Not captured,Not captured,Not captured,Not captured,Not captured,
Not captured,Not captured,10/01/2019,Not captured,Not captured,863949,020,00072,ARS-01-0052976,Beacon International,Not captured,Not captured,Not captured,,,,Sarchet,Brian,L,07/03/1964,male,Not captured,Not captured,Not captured,Not captured,Not captured,Not captured,Not captured,Not captured,Not captured,Not captured,Not captured,Not captured,Not captured,,,Not captured,Not captured,Not captured,Not captured,15252 Seneca Rd. Spc. 182,,Victorville,California,92392,,,Not captured,Not captured,briansarchet@yahoo.com,Not captured,701941187,,Not captured,Not captured,Not captured,Not captured,Not captured,Not captured,
Not captured,Not captured,10/03/2019,Not captured,Not captured,863949,020,00072,ARS-02-0052974,Beacon America,Not captured,Not captured,Not captured,,,,Festa,Ginevra,M,10/16/2014,female,Not captured,Not captured,Not captured,Not captured,Not captured,Not captured,Not captured,Not captured,Not captured,Not captured,Not captured,Not captured,Not captured,Roberto Festa,Brother In-law,Not captured,Not captured,Not captured,Not captured,19063 Park Ridge St.,,Weston,Florida,33332,9546818089,,Not captured,Not captured,miroman.corp@hotmail.com,Not captured,701941184,,Not captured,Not captured,Not captured,Not captured,Not captured,Not captured,
Not captured,Not captured,10/03/2019,Not captured,Not captured,863949,020,00072,ARS-02-0052973,Beacon America,Not captured,Not captured,Not captured,,,,Festa,Ciro,,04/19/1975,male,Not captured,Not captured,Not captured,Not captured,Not captured,Not captured,Not captured,Not captured,Not captured,Not captured,Not captured,Not captured,Not captured,Roberto Festa,Brother In-law,Not captured,Not captured,Not captured,Not captured,19063 Park Ridge St.,,Weston,Florida,33332,9546818089,,Not captured,Not captured,miroman.corp@hotmail.com,Not captured,701941183,,Not captured,Not captured,Not captured,Not captured,Not captured,Not captured,
Not captured,Not captured,10/03/2019,Not captured,Not captured,863949,020,00072,ARS-02-0052972,Beacon America,Not captured,Not captured,Not captured,Passport(YB5652739),,,Coco,Rosalba,,04/08/1981,female,Not captured,Not captured,Not captured,Not captured,Not captured,Not captured,Not captured,Not captured,Not captured,Not captured,Not captured,Not captured,Not captured,Roberto Festa,Brother In-law,Not captured,Not captured,Not captured,Not captured,19063 Park Ridge St.,,Weston,Florida,33332,9546818089,,Not captured,Not captured,miroman.corp@hotmail.com,Not captured,701941182,,Not captured,Not captured,Not captured,Not captured,Not captured,Not captured,
Not captured,Not captured,10/01/2019,Not captured,Not captured,863949,020,00072,ARS-01-0052970,Beacon International,Not captured,Not captured,Not captured,,,,Vechik,Terry,L,02/04/1957,male,Not captured,Not captured,Not captured,Not captured,Not captured,Not captured,Not captured,Not captured,Not captured,Not captured,Not captured,Not captured,Not captured,,,Not captured,Not captured,Not captured,Not captured,2460 Wood Court,,Claremont,California,91711,,,Not captured,Not captured,greenfuelguy@gmail.com,Not captured,701941180,,Not captured,Not captured,Not captured,Not captured,Not captured,Not captured,
Not captured,Not captured,10/01/2019,Not captured,Not captured,863949,020,00072,ARS-03-0052961,Essential International,Not captured,Not captured,Not captured,Passport(LT689678),,,Lilord,Xavier,Stuart Leon,07/10/2019,male,Not captured,Not captured,Not captured,Not captured,Not captured,Not captured,Not captured,Not captured,Not captured,Not captured,Not captured,Not captured,Not captured,,,Not captured,Not captured,Not captured,Not captured,PO Box 434,,Luganville,Santo,0000,6785577755,,Not captured,Not captured,maxine@upandupministries.org,Not captured,701941159,,Not captured,Not captured,Not captured,Not captured,Not captured,Not captured,
Not captured,Not captured,09/30/2019,Not captured,Not captured,863949,020,00072,ARS-01-0052968,Beacon International,Not captured,Not captured,Not captured,Passport(516958148),,,Skahan,Erin,,01/23/1980,female,Not captured,Not captured,Not captured,Not captured,Not captured,Not captured,Not captured,Not captured,Not captured,Not captured,Not captured,Not captured,Not captured,Debbie Skahan,Mother,Not captured,Not captured,Not captured,Not captured,2977 West Cantebury,,Springfield,Missouri,65810,3035861295,,Not captured,Not captured,erinskahan@gmail.com,Not captured,701941178,,Not captured,Not captured,Not captured,Not captured,Not captured,Not captured,
Not captured,Not captured,10/02/2019,Not captured,Not captured,863949,020,00072,ARS-01-0052964,Beacon International,Not captured,Not captured,Not captured,Passport(NA),,,ALEJANDRO GONZALEZ,JULIAN,,03/06/1972,male,Not captured,Not captured,Not captured,Not captured,Not captured,Not captured,Not captured,Not captured,Not captured,Not captured,Not captured,Not captured,Not captured,daniella robert,friend,Not captured,Not captured,Not captured,Not captured,7003 LA VISTA DFR,,DALLAS,Texas,75214,9565721725,,Not captured,Not captured,aer4090@yahoo.com,Not captured,701941162,,Not captured,Not captured,Not captured,Not captured,Not captured,Not captured,
Not captured,Not captured,10/02/2019,Not captured,Not captured,863949,020,00072,ARS-01-0052963,Beacon International,Not captured,Not captured,Not captured,,,,THAO NAHN ROBERT,TORI,,10/09/1974,female,Not captured,Not captured,Not captured,Not captured,Not captured,Not captured,Not captured,Not captured,Not captured,Not captured,Not captured,Not captured,Not captured,daniella robert,daughter,Not captured,Not captured,Not captured,Not captured,7003 LA VISTA DFR,,DALLAS,Texas,75214,9565721725,,Not captured,Not captured,aer4090@yahoo.com,Not captured,701941161,,Not captured,Not captured,Not captured,Not captured,Not captured,Not captured,
Not captured,Not captured,10/02/2019,Not captured,Not captured,863949,020,00072,ARS-01-0052962,Beacon International,Not captured,Not captured,Not captured,Passport(NA),,,ROBERT,ANDRE,,07/10/1971,male,Not captured,Not captured,Not captured,Not captured,Not captured,Not captured,Not captured,Not captured,Not captured,Not captured,Not captured,Not captured,Not captured,daniella robert,daughter,Not captured,Not captured,Not captured,Not captured,7003 LA VISTA DFR,,DALLAS,Texas,75214,9565721725,,Not captured,Not captured,aer4090@yahoo.com,Not captured,701941160,,Not captured,Not captured,Not captured,Not captured,Not captured,Not captured,
Not captured,Not captured,09/30/2019,Not captured,Not captured,863949,020,00072,ARS-01-0052960,Beacon International,Not captured,Not captured,Not captured,,,,Batzel,Jared,W,06/25/1985,male,Not captured,Not captured,Not captured,Not captured,Not captured,Not captured,Not captured,Not captured,Not captured,Not captured,Not captured,Not captured,Not captured,,,Not captured,Not captured,Not captured,Not captured,2943 Kalakaua Ave,,Honolulu,Hawaii,96815,,,Not captured,Not captured,jared.batzel@gmail.com,Not captured,701941158,,Not captured,Not captured,Not captured,Not captured,Not captured,Not captured,
Not captured,Not captured,09/30/2019,Not captured,Not captured,863949,020,00072,ARS-03-0052863,Essential International,Not captured,Not captured,Not captured,Passport(NA),,,MORRIS,GARY,,03/01/1961,male,Not captured,Not captured,Not captured,Not captured,Not captured,Not captured,Not captured,Not captured,Not captured,Not captured,Not captured,Not captured,Not captured,,,Not captured,Not captured,Not captured,Not captured,436 VASQUEZ CT APT 3,,SUNNYDALE,California,94086,7073340218,,Not captured,Not captured,garyatadvance@aol.com,Not captured,701941003,,Not captured,Not captured,Not captured,Not captured,Not captured,Not captured,
Not captured,Not captured,10/01/2019,Not captured,Not captured,863949,020,00072,ARS-02-0052957,Beacon America,Not captured,Not captured,Not captured,Passport(EB393905),,,Agbodzalou,Louis,,03/22/1974,male,Not captured,Not captured,Not captured,Not captured,Not captured,Not captured,Not captured,Not captured,Not captured,Not captured,Not captured,Not captured,Not captured,Equip International,other,Not captured,Not captured,Not captured,Not captured,126 Rockhouse,,Marion,North Carolina,28752,828 738 3414,,Not captured,Not captured,brendaandlouis1@gmail.com,Not captured,701941146,,Not captured,Not captured,Not captured,Not captured,Not captured,Not captured,
Not captured,Not captured,10/01/2019,Not captured,Not captured,863949,020,00072,ARS-01-0052953,Beacon International,Not captured,Not captured,Not captured,,,,Wells,Carrie,D,10/08/1967,female,Not captured,Not captured,Not captured,Not captured,Not captured,Not captured,Not captured,Not captured,Not captured,Not captured,Not captured,Not captured,Not captured,Bryce Wells,son,Not captured,Not captured,Not captured,Not captured,4219 N Church Way Apt 6,,Louisville,Kentucky,40207,502-873-7808,,Not captured,Not captured,dwells@reachingandteaching.org,Not captured,701941142,,Not captured,Not captured,Not captured,Not captured,Not captured,Not captured,
Not captured,Not captured,10/01/2019,Not captured,Not captured,863949,020,00072,ARS-01-0052952,Beacon International,Not captured,Not captured,Not captured,Passport(567431452),,,Wells,David,L,01/19/1966,male,Not captured,Not captured,Not captured,Not captured,Not captured,Not captured,Not captured,Not captured,Not captured,Not captured,Not captured,Not captured,Not captured,Bryce Wells,son,Not captured,Not captured,Not captured,Not captured,4219 N Church Way Apt 6,,Louisville,Kentucky,40207,502-873-7808,,Not captured,Not captured,dwells@reachingandteaching.org,Not captured,701941141,,Not captured,Not captured,Not captured,Not captured,Not captured,Not captured,
Not captured,Not captured,09/29/2019,Not captured,Not captured,863949,020,00072,ARS-01-0052951,Beacon International,Not captured,Not captured,Not captured,,,,MacDonald,Kelly,,01/18/1977,female,Not captured,Not captured,Not captured,Not captured,Not captured,Not captured,Not captured,Not captured,Not captured,Not captured,Not captured,Not captured,Not captured,Kelly Shumway,Wife,Not captured,Not captured,Not captured,Not captured,6037 E Mountain Court,,Cave Creek,Arizona,85331,8165089011,,Not captured,Not captured,Steve@blackmountainpartners.com,Not captured,701941140,,Not captured,Not captured,Not captured,Not captured,Not captured,Not captured,