EE Transaction Type,Dependent Transaction Type,Effective Date,EE Signature,EE Signature Date,Control,Suffix,Account,Plan Number,Plan Name,Claim Office,Network ID Number,Customer Code,EE SSN,Dependent SSN,Dependent Relationship,Last Name,First Name,Middle Initial,DOB,Gender,Ethnicity,PCP/PCD,PCP/PCD Current Patient,Provider Cap Office Number,COB,Dep Student Indicator,Dep OOA Indicator,EE Prior Coverage Indicator,EE Late Entrant,EE Language Indicator,Hire Date,Earnings,Earnings Frequency,Beneficiary (Last Name First Name MI),Beneficiary Relationship,Continuation of Coverage Expiration Date,Continuation of Coverage Event Date,Continuation of Coverage Length of Coverage,Work Location Zip Code,Street Address Line 1,Street Address Line 2,City,State,Zip Code,Home Phone Number,Work Phone Number,Accept Code,Evidence Code,EE Email Address,Communication Disability Code,EE Alternate ID,Dep Alternate ID,Old Control,Old Suffix,Old Account,New Control,New Suffix,New Account,
Not captured,Not captured,09/27/2019,Not captured,Not captured,863949,020,00072,ARS-01-0052922,Beacon International,Not captured,Not captured,Not captured,,,,Amora,Edna,C,01/24/1955,female,Not captured,Not captured,Not captured,Not captured,Not captured,Not captured,Not captured,Not captured,Not captured,Not captured,Not captured,Not captured,Not captured,,,Not captured,Not captured,Not captured,Not captured,186 Wilshire Avenue,,Daly City,California,94015,,,Not captured,Not captured,louy186@yahoo.com,Not captured,701941111,,Not captured,Not captured,Not captured,Not captured,Not captured,Not captured,
Not captured,Not captured,09/27/2019,Not captured,Not captured,863949,020,00072,ARS-01-0052921,Beacon International,Not captured,Not captured,Not captured,,,,Amora,Maria,L,02/11/1954,female,Not captured,Not captured,Not captured,Not captured,Not captured,Not captured,Not captured,Not captured,Not captured,Not captured,Not captured,Not captured,Not captured,,,Not captured,Not captured,Not captured,Not captured,186 Wilshire Avenue,,Daly City,California,94015,,,Not captured,Not captured,louy186@yahoo.com,Not captured,701941110,,Not captured,Not captured,Not captured,Not captured,Not captured,Not captured,
Not captured,Not captured,09/27/2019,Not captured,Not captured,863949,020,00072,ARS-02-0052920,Beacon America,Not captured,Not captured,Not captured,,,,Tomassen,David,J,09/26/1981,male,Not captured,Not captured,Not captured,Not captured,Not captured,Not captured,Not captured,Not captured,Not captured,Not captured,Not captured,Not captured,Not captured,,,Not captured,Not captured,Not captured,Not captured,1620 Gerity Rd,,Bellingham,Washington,98229,,,Not captured,Not captured,geneva.faulkner@gmail.com,Not captured,701941098,,Not captured,Not captured,Not captured,Not captured,Not captured,Not captured,
Not captured,Not captured,09/27/2019,Not captured,Not captured,863949,020,00072,ARS-02-0052919,Beacon America,Not captured,Not captured,Not captured,,,,Faulkner,Geneva,A,01/04/1989,female,Not captured,Not captured,Not captured,Not captured,Not captured,Not captured,Not captured,Not captured,Not captured,Not captured,Not captured,Not captured,Not captured,,,Not captured,Not captured,Not captured,Not captured,1620 Gerity Rd,,Bellingham,Washington,98229,,,Not captured,Not captured,geneva.faulkner@gmail.com,Not captured,701941097,,Not captured,Not captured,Not captured,Not captured,Not captured,Not captured,
Not captured,Not captured,09/27/2019,Not captured,Not captured,863949,020,00072,ARS-02-0052911,Beacon America,Not captured,Not captured,Not captured,,,,Rose,Ben,,12/05/1989,male,Not captured,Not captured,Not captured,Not captured,Not captured,Not captured,Not captured,Not captured,Not captured,Not captured,Not captured,Not captured,Not captured,,,Not captured,Not captured,Not captured,Not captured,Apt 408 Yasmine 2b,,Abu Dhabi,,00000,,,Not captured,Not captured,benjrose89@gmail.com,Not captured,701941088,,Not captured,Not captured,Not captured,Not captured,Not captured,Not captured,
Not captured,Not captured,09/26/2019,Not captured,Not captured,863949,020,00072,ARS-01-0052910,Beacon International,Not captured,Not captured,Not captured,,,,Bleier,Joel,,03/31/1980,male,Not captured,Not captured,Not captured,Not captured,Not captured,Not captured,Not captured,Not captured,Not captured,Not captured,Not captured,Not captured,Not captured,,,Not captured,Not captured,Not captured,Not captured,52 Herrick Ave,,Spring Valley,New York,10977,,,Not captured,Not captured,bleierjoel@gmail.com,Not captured,701941087,,Not captured,Not captured,Not captured,Not captured,Not captured,Not captured,
Not captured,Not captured,09/26/2019,Not captured,Not captured,863949,020,00072,ARS-01-0052909,Beacon International,Not captured,Not captured,Not captured,,,,Schwartz,Aron,,06/27/1991,male,Not captured,Not captured,Not captured,Not captured,Not captured,Not captured,Not captured,Not captured,Not captured,Not captured,Not captured,Not captured,Not captured,,,Not captured,Not captured,Not captured,Not captured,246 Lych Street,,Brooklyn,New York,11206,,,Not captured,Not captured,aronschw@gmail.com,Not captured,701941086,,Not captured,Not captured,Not captured,Not captured,Not captured,Not captured,
Not captured,Not captured,09/27/2019,Not captured,Not captured,863949,020,00072,ARS-02-0052908,Beacon America,Not captured,Not captured,Not captured,,,,Friedman,Chana,,09/18/1998,female,Not captured,Not captured,Not captured,Not captured,Not captured,Not captured,Not captured,Not captured,Not captured,Not captured,Not captured,Not captured,Not captured,,,Not captured,Not captured,Not captured,Not captured,4 Plymouth Pl,,Airmont,,10952,845-354-4188,,Not captured,Not captured,devorah222@gmail.com,Not captured,701941085,,Not captured,Not captured,Not captured,Not captured,Not captured,Not captured,
Not captured,Not captured,09/26/2019,Not captured,Not captured,863949,020,00072,ARS-02-0052904,Beacon America,Not captured,Not captured,Not captured,,,,Huys,Hailey,A,12/31/2018,female,Not captured,Not captured,Not captured,Not captured,Not captured,Not captured,Not captured,Not captured,Not captured,Not captured,Not captured,Not captured,Not captured,,,Not captured,Not captured,Not captured,Not captured,2254 NW 19 LANE,,GAINESVILLE,Florida,32605,,,Not captured,Not captured,j.huys@usask.ca,Not captured,701941080,,Not captured,Not captured,Not captured,Not captured,Not captured,Not captured,
Not captured,Not captured,09/26/2019,Not captured,Not captured,863949,020,00072,ARS-02-0052903,Beacon America,Not captured,Not captured,Not captured,,,,Huys,Jennifer,L,07/16/1985,female,Not captured,Not captured,Not captured,Not captured,Not captured,Not captured,Not captured,Not captured,Not captured,Not captured,Not captured,Not captured,Not captured,,,Not captured,Not captured,Not captured,Not captured,2254 NW 19 LANE,,GAINESVILLE,Florida,32605,,,Not captured,Not captured,j.huys@usask.ca,Not captured,701941079,,Not captured,Not captured,Not captured,Not captured,Not captured,Not captured,
Not captured,Not captured,09/26/2019,Not captured,Not captured,863949,020,00072,ARS-01-0052901,Beacon International,Not captured,Not captured,Not captured,,,,Martin,Keshia-Lee,D,10/27/1989,female,Not captured,Not captured,Not captured,Not captured,Not captured,Not captured,Not captured,Not captured,Not captured,Not captured,Not captured,Not captured,Not captured,,,Not captured,Not captured,Not captured,Not captured,3525 Davenport Street NW,,Washington,Dist. of Columbia,20008,,,Not captured,Not captured,keshialeemartin@gmail.com,Not captured,701941077,,Not captured,Not captured,Not captured,Not captured,Not captured,Not captured,
Not captured,Not captured,09/26/2019,Not captured,Not captured,863949,020,00072,ARS-01-0052900,Beacon International,Not captured,Not captured,Not captured,,,,Rommel,Kathleen,,04/01/1986,female,Not captured,Not captured,Not captured,Not captured,Not captured,Not captured,Not captured,Not captured,Not captured,Not captured,Not captured,Not captured,Not captured,,,Not captured,Not captured,Not captured,Not captured,232 Jackson St,,Brooklyn,New York,11211,,,Not captured,Not captured,kathleenrommel@gmail.com,Not captured,701941076,,Not captured,Not captured,Not captured,Not captured,Not captured,Not captured,
Not captured,Not captured,09/25/2019,Not captured,Not captured,863949,020,00072,ARS-02-0052897,Beacon America,Not captured,Not captured,Not captured,,,,Cvetkovic,Jelena,,03/28/1983,female,Not captured,Not captured,Not captured,Not captured,Not captured,Not captured,Not captured,Not captured,Not captured,Not captured,Not captured,Not captured,Not captured,,,Not captured,Not captured,Not captured,Not captured,500 Race St,,San Jose,California,95126,,,Not captured,Not captured,yanie.nicole@gmail.com,Not captured,701941073,,Not captured,Not captured,Not captured,Not captured,Not captured,Not captured,
Not captured,Not captured,09/25/2019,Not captured,Not captured,863949,020,00072,ARS-01-0052896,Beacon International,Not captured,Not captured,Not captured,,,,Mendlowitz,Moshe,Y,01/04/2013,male,Not captured,Not captured,Not captured,Not captured,Not captured,Not captured,Not captured,Not captured,Not captured,Not captured,Not captured,Not captured,Not captured,,,Not captured,Not captured,Not captured,Not captured,49 Skillman st,,Brooklyn,New York,11205,,,Not captured,Not captured,Joelmendlowitz@gmail.com,Not captured,701941072,,Not captured,Not captured,Not captured,Not captured,Not captured,Not captured,
Not captured,Not captured,09/25/2019,Not captured,Not captured,863949,020,00072,ARS-01-0052895,Beacon International,Not captured,Not captured,Not captured,,,,Mendlowitz,Joel,,04/23/1990,male,Not captured,Not captured,Not captured,Not captured,Not captured,Not captured,Not captured,Not captured,Not captured,Not captured,Not captured,Not captured,Not captured,,,Not captured,Not captured,Not captured,Not captured,49 Skillman st,,Brooklyn,New York,11205,,,Not captured,Not captured,Joelmendlowitz@gmail.com,Not captured,701941071,,Not captured,Not captured,Not captured,Not captured,Not captured,Not captured,
Not captured,Not captured,09/26/2019,Not captured,Not captured,863949,020,00072,ARS-01-0052894,Beacon International,Not captured,Not captured,Not captured,,,,Alago,Tina,M,11/30/1961,female,Not captured,Not captured,Not captured,Not captured,Not captured,Not captured,Not captured,Not captured,Not captured,Not captured,Not captured,Not captured,Not captured,,,Not captured,Not captured,Not captured,Not captured,1900 Chapman Ave.,,Rockville,Maryland,20852-1972,,,Not captured,Not captured,saved310ta@gmail.com,Not captured,701941070,,Not captured,Not captured,Not captured,Not captured,Not captured,Not captured,
Not captured,Not captured,09/26/2019,Not captured,Not captured,863949,020,00072,ARS-01-0052893,Beacon International,Not captured,Not captured,Not captured,,,,Alago,Angel,E,10/01/1969,male,Not captured,Not captured,Not captured,Not captured,Not captured,Not captured,Not captured,Not captured,Not captured,Not captured,Not captured,Not captured,Not captured,,,Not captured,Not captured,Not captured,Not captured,1900 Chapman Ave.,,Rockville,Maryland,20852-1972,,,Not captured,Not captured,saved310ta@gmail.com,Not captured,701941069,,Not captured,Not captured,Not captured,Not captured,Not captured,Not captured,
Not captured,Not captured,09/25/2019,Not captured,Not captured,863949,020,00072,ARS-02-0052892,Beacon America,Not captured,Not captured,Not captured,Passport(A01830575),,,Britz,Janet,,08/08/1993,female,Not captured,Not captured,Not captured,Not captured,Not captured,Not captured,Not captured,Not captured,Not captured,Not captured,Not captured,Not captured,Not captured,,,Not captured,Not captured,Not captured,Not captured,2000 Lee drive,,Denton,Texas,76209,9405952129,,Not captured,Not captured,janetbritz08@gmail.com,Not captured,701941068,,Not captured,Not captured,Not captured,Not captured,Not captured,Not captured,
Not captured,Not captured,09/25/2019,Not captured,Not captured,863949,020,00072,ARS-01-0052891,Beacon International,Not captured,Not captured,Not captured,,,,Truong,Darline,,11/13/1957,female,Not captured,Not captured,Not captured,Not captured,Not captured,Not captured,Not captured,Not captured,Not captured,Not captured,Not captured,Not captured,Not captured,,,Not captured,Not captured,Not captured,Not captured,2323 E Kelton Ln,,Phoenix,Arizona,85022,,,Not captured,Not captured,darline.truong@yahoo.com,Not captured,701941067,,Not captured,Not captured,Not captured,Not captured,Not captured,Not captured,
Not captured,Not captured,09/25/2019,Not captured,Not captured,863949,020,00072,ARS-01-0052888,Beacon International,Not captured,Not captured,Not captured,,,,Leibovitz,Israel,,11/08/1988,male,Not captured,Not captured,Not captured,Not captured,Not captured,Not captured,Not captured,Not captured,Not captured,Not captured,Not captured,Not captured,Not captured,,,Not captured,Not captured,Not captured,Not captured,1433 42nd street,,Brooklyn,New York,11219,,,Not captured,Not captured,srulikny@gmail.com,Not captured,701941051,,Not captured,Not captured,Not captured,Not captured,Not captured,Not captured,
Not captured,Not captured,09/25/2019,Not captured,Not captured,863949,020,00072,ARS-01-0052887,Beacon International,Not captured,Not captured,Not captured,,,,March,Yisroel,,10/06/1999,male,Not captured,Not captured,Not captured,Not captured,Not captured,Not captured,Not captured,Not captured,Not captured,Not captured,Not captured,Not captured,Not captured,,,Not captured,Not captured,Not captured,Not captured,7 Yomeh Ct,,Lakewood,New Jersey,08701,908-9104391,,Not captured,Not captured,yshgraphics@gmail.com,Not captured,701941050,,Not captured,Not captured,Not captured,Not captured,Not captured,Not captured,
Not captured,Not captured,09/25/2019,Not captured,Not captured,863949,020,00072,ARS-01-0052886,Beacon International,Not captured,Not captured,Not captured,,,,March,Yaakov,,09/29/1976,male,Not captured,Not captured,Not captured,Not captured,Not captured,Not captured,Not captured,Not captured,Not captured,Not captured,Not captured,Not captured,Not captured,,,Not captured,Not captured,Not captured,Not captured,7 Yomeh Ct,,Lakewood,New Jersey,08701,908-9104391,,Not captured,Not captured,yshgraphics@gmail.com,Not captured,701941049,,Not captured,Not captured,Not captured,Not captured,Not captured,Not captured,
Not captured,Not captured,09/25/2019,Not captured,Not captured,863949,020,00072,ARS-01-0052884,Beacon International,Not captured,Not captured,Not captured,Passport(GC020111),,,Cutbill,Jesse,E R ,01/15/1992,male,Not captured,Not captured,Not captured,Not captured,Not captured,Not captured,Not captured,Not captured,Not captured,Not captured,Not captured,Not captured,Not captured,Maria Lisikova,Spouse,Not captured,Not captured,Not captured,Not captured,6421 Nevilane Drive,,Duncan,British Columbia,V9l5s6,2507010771,,Not captured,Not captured,jessecutbill@gmail.com,Not captured,701941047,,Not captured,Not captured,Not captured,Not captured,Not captured,Not captured,
Not captured,Not captured,09/25/2019,Not captured,Not captured,863949,020,00072,ARS-01-0052878,Beacon International,Not captured,Not captured,Not captured,,,,Appel,Zev,,07/15/1994,male,Not captured,Not captured,Not captured,Not captured,Not captured,Not captured,Not captured,Not captured,Not captured,Not captured,Not captured,Not captured,Not captured,,,Not captured,Not captured,Not captured,Not captured,1846 54th Street,,Brooklyn,New York,11204,,,Not captured,Not captured,appelchaim@gmail.com,Not captured,701941021,,Not captured,Not captured,Not captured,Not captured,Not captured,Not captured,
Not captured,Not captured,09/25/2019,Not captured,Not captured,863949,020,00072,ARS-01-0052877,Beacon International,Not captured,Not captured,Not captured,,,,Appel,Chaim,,01/06/1973,male,Not captured,Not captured,Not captured,Not captured,Not captured,Not captured,Not captured,Not captured,Not captured,Not captured,Not captured,Not captured,Not captured,,,Not captured,Not captured,Not captured,Not captured,1846 54th Street,,Brooklyn,New York,11204,,,Not captured,Not captured,appelchaim@gmail.com,Not captured,701941020,,Not captured,Not captured,Not captured,Not captured,Not captured,Not captured,
Not captured,Not captured,09/26/2019,Not captured,Not captured,863949,020,00072,OVI-28-0052874,OverseasCare Visitors Insurance Plan,Not captured,Not captured,Not captured,,,,BHASKARABATLA,SUGANDHA,,01/01/1949,female,Not captured,Not captured,Not captured,Not captured,Not captured,Not captured,Not captured,Not captured,Not captured,Not captured,Not captured,Not captured,Not captured,JYOTHI GUDIPALLI,DAUGHTER,Not captured,Not captured,Not captured,Not captured,1404 Parsons Ave,,Campbell,California,95008,5103969339,,Not captured,Not captured,PRIESTSRINIVAS@GMAIL.COM,Not captured,701941016,,Not captured,Not captured,Not captured,Not captured,Not captured,Not captured,
Not captured,Not captured,09/25/2019,Not captured,Not captured,863949,020,00072,OVI-28-0052871,OverseasCare Visitors Insurance Plan,Not captured,Not captured,Not captured,,,,Ponnamma,Chandramoney Amma,,05/10/1959,female,Not captured,Not captured,Not captured,Not captured,Not captured,Not captured,Not captured,Not captured,Not captured,Not captured,Not captured,Not captured,Not captured,Anoop,Son,Not captured,Not captured,Not captured,Not captured,27610 Sunny Creek Dr,,valencia,California,91354,949-243-2147,,Not captured,Not captured,chandramoneyamma@gmail.com,Not captured,701941013,,Not captured,Not captured,Not captured,Not captured,Not captured,Not captured,
Not captured,Not captured,09/24/2019,Not captured,Not captured,863949,020,00072,ARS-01-0052869,Beacon International,Not captured,Not captured,Not captured,,,,Ubnoske,Jonathan,,12/29/1989,male,Not captured,Not captured,Not captured,Not captured,Not captured,Not captured,Not captured,Not captured,Not captured,Not captured,Not captured,Not captured,Not captured,,,Not captured,Not captured,Not captured,Not captured,23 Palomino Drive,,North Andover,Massachusetts,01845,,,Not captured,Not captured,jubnoske08@gmail.com,Not captured,701941009,,Not captured,Not captured,Not captured,Not captured,Not captured,Not captured,
Not captured,Not captured,09/24/2019,Not captured,Not captured,863949,020,00072,ARS-01-0052868,Beacon International,Not captured,Not captured,Not captured,,,,Aparicio Zafra,Maria Paula,,11/17/1992,female,Not captured,Not captured,Not captured,Not captured,Not captured,Not captured,Not captured,Not captured,Not captured,Not captured,Not captured,Not captured,Not captured,,,Not captured,Not captured,Not captured,Not captured,6242 rockwell street,,oakland,,94618,,,Not captured,Not captured,paulaapariciozafra@gmail.com,Not captured,701941008,,Not captured,Not captured,Not captured,Not captured,Not captured,Not captured,
Not captured,Not captured,09/24/2019,Not captured,Not captured,863949,020,00072,ARS-01-0052865,Beacon International,Not captured,Not captured,Not captured,,,,Mayobre,Maria,,11/01/1976,female,Not captured,Not captured,Not captured,Not captured,Not captured,Not captured,Not captured,Not captured,Not captured,Not captured,Not captured,Not captured,Not captured,,,Not captured,Not captured,Not captured,Not captured,7 Maude Terrace,,Watertown,Massachusetts,02472,,,Not captured,Not captured,memayobre@gmail.com,Not captured,701941005,,Not captured,Not captured,Not captured,Not captured,Not captured,Not captured,
Not captured,Not captured,09/24/2019,Not captured,Not captured,863949,020,00072,ARS-01-0052864,Beacon International,Not captured,Not captured,Not captured,,,,Rubin,Elliot,J,09/12/1954,male,Not captured,Not captured,Not captured,Not captured,Not captured,Not captured,Not captured,Not captured,Not captured,Not captured,Not captured,Not captured,Not captured,,,Not captured,Not captured,Not captured,Not captured,178 S Sycamore Ave,,Los Angeles,California,90036,,,Not captured,Not captured,elliotjrubin@gmail.com,Not captured,701941004,,Not captured,Not captured,Not captured,Not captured,Not captured,Not captured,
Not captured,Not captured,09/24/2019,Not captured,Not captured,863949,020,00072,ARS-01-0052859,Beacon International,Not captured,Not captured,Not captured,,,,McKeachie,James,N,10/29/1994,male,Not captured,Not captured,Not captured,Not captured,Not captured,Not captured,Not captured,Not captured,Not captured,Not captured,Not captured,Not captured,Not captured,,,Not captured,Not captured,Not captured,Not captured,70 Woodford Street,,Charleston,South Carolina,29492,,,Not captured,Not captured,jnoble213@gmail.com,Not captured,701940999,,Not captured,Not captured,Not captured,Not captured,Not captured,Not captured,
Not captured,Not captured,09/24/2019,Not captured,Not captured,863949,020,00072,ARS-01-0052846,Beacon International,Not captured,Not captured,Not captured,,,,WETZLER,LAZER,,12/22/2004,male,Not captured,Not captured,Not captured,Not captured,Not captured,Not captured,Not captured,Not captured,Not captured,Not captured,Not captured,Not captured,Not captured,,,Not captured,Not captured,Not captured,Not captured,47 South 8th Street,,Brooklyn,New York,11249,,,Not captured,Not captured,sew@mechonbelz.com,Not captured,701940986,,Not captured,Not captured,Not captured,Not captured,Not captured,Not captured,
Not captured,Not captured,09/24/2019,Not captured,Not captured,863949,020,00072,ARS-01-0052843,Beacon International,Not captured,Not captured,Not captured,,,,Notter,Katherine,,09/11/1960,female,Not captured,Not captured,Not captured,Not captured,Not captured,Not captured,Not captured,Not captured,Not captured,Not captured,Not captured,Not captured,Not captured,,,Not captured,Not captured,Not captured,Not captured,71 S WHITNEY ST,,GRAYSLAKE,Illinois,60030,,,Not captured,Not captured,nk1109@yahoo.com,Not captured,701940983,,Not captured,Not captured,Not captured,Not captured,Not captured,Not captured,
Not captured,Not captured,09/26/2019,Not captured,Not captured,863949,020,00072,ARS-01-0052839,Beacon International,Not captured,Not captured,Not captured,,,,Soler Sandoval,Daniel,,01/29/1994,male,Not captured,Not captured,Not captured,Not captured,Not captured,Not captured,Not captured,Not captured,Not captured,Not captured,Not captured,Not captured,Not captured,,,Not captured,Not captured,Not captured,Not captured,Via Privata Treviso 31,,Milan,,20127,,,Not captured,Not captured,danielsoler94@gmail.com,Not captured,701940979,,Not captured,Not captured,Not captured,Not captured,Not captured,Not captured,
Not captured,Not captured,09/25/2019,Not captured,Not captured,863949,020,00072,ARS-02-0052838,Beacon America,Not captured,Not captured,Not captured,Passport(TB204843),,,Prevatt,Lancelot,I,06/14/1947,male,Not captured,Not captured,Not captured,Not captured,Not captured,Not captured,Not captured,Not captured,Not captured,Not captured,Not captured,Not captured,Not captured,Liselle Prevatt,Daughter,Not captured,Not captured,Not captured,Not captured,3 Fitt Street,,Port of Spain,Trinidad and Tobago,00000,1 8687532282,,Not captured,Not captured,liprevatt@gmail.com,Not captured,701940978,,Not captured,Not captured,Not captured,Not captured,Not captured,Not captured,
Not captured,Not captured,09/25/2019,Not captured,Not captured,863949,020,00072,OVI-28-0052837,OverseasCare Visitors Insurance Plan,Not captured,Not captured,Not captured,Passport(K3939644 ),,,Bhargava,Shakuntala,,04/28/1946,female,Not captured,Not captured,Not captured,Not captured,Not captured,Not captured,Not captured,Not captured,Not captured,Not captured,Not captured,Not captured,Not captured,Puneet Bhargava,Son,Not captured,Not captured,Not captured,Not captured,15104 Kestrelrise Drive,,Lithia,Florida,33547,8136063801,8136066827,Not captured,Not captured,puneetb11@live.com,Not captured,701940977,,Not captured,Not captured,Not captured,Not captured,Not captured,Not captured,