EE Transaction Type,Dependent Transaction Type,Effective Date,EE Signature,EE Signature Date,Control,Suffix,Account,Plan Number,Plan Name,Claim Office,Network ID Number,Customer Code,EE SSN,Dependent SSN,Dependent Relationship,Last Name,First Name,Middle Initial,DOB,Gender,Ethnicity,PCP/PCD,PCP/PCD Current Patient,Provider Cap Office Number,COB,Dep Student Indicator,Dep OOA Indicator,EE Prior Coverage Indicator,EE Late Entrant,EE Language Indicator,Hire Date,Earnings,Earnings Frequency,Beneficiary (Last Name First Name MI),Beneficiary Relationship,Continuation of Coverage Expiration Date,Continuation of Coverage Event Date,Continuation of Coverage Length of Coverage,Work Location Zip Code,Street Address Line 1,Street Address Line 2,City,State,Zip Code,Home Phone Number,Work Phone Number,Accept Code,Evidence Code,EE Email Address,Communication Disability Code,EE Alternate ID,Dep Alternate ID,Old Control,Old Suffix,Old Account,New Control,New Suffix,New Account,
Not captured,Not captured,09/25/2019,Not captured,Not captured,863949,020,00072,ARS-02-0052897,Beacon America,Not captured,Not captured,Not captured,,,,Cvetkovic,Jelena,,03/28/1983,female,Not captured,Not captured,Not captured,Not captured,Not captured,Not captured,Not captured,Not captured,Not captured,Not captured,Not captured,Not captured,Not captured,,,Not captured,Not captured,Not captured,Not captured,500 Race St,,San Jose,California,95126,,,Not captured,Not captured,yanie.nicole@gmail.com,Not captured,701941073,,Not captured,Not captured,Not captured,Not captured,Not captured,Not captured,
Not captured,Not captured,09/25/2019,Not captured,Not captured,863949,020,00072,ARS-01-0052896,Beacon International,Not captured,Not captured,Not captured,,,,Mendlowitz,Moshe,Y,01/04/2013,male,Not captured,Not captured,Not captured,Not captured,Not captured,Not captured,Not captured,Not captured,Not captured,Not captured,Not captured,Not captured,Not captured,,,Not captured,Not captured,Not captured,Not captured,49 Skillman st,,Brooklyn,New York,11205,,,Not captured,Not captured,Joelmendlowitz@gmail.com,Not captured,701941072,,Not captured,Not captured,Not captured,Not captured,Not captured,Not captured,
Not captured,Not captured,09/25/2019,Not captured,Not captured,863949,020,00072,ARS-01-0052895,Beacon International,Not captured,Not captured,Not captured,,,,Mendlowitz,Joel,,04/23/1990,male,Not captured,Not captured,Not captured,Not captured,Not captured,Not captured,Not captured,Not captured,Not captured,Not captured,Not captured,Not captured,Not captured,,,Not captured,Not captured,Not captured,Not captured,49 Skillman st,,Brooklyn,New York,11205,,,Not captured,Not captured,Joelmendlowitz@gmail.com,Not captured,701941071,,Not captured,Not captured,Not captured,Not captured,Not captured,Not captured,
Not captured,Not captured,09/25/2019,Not captured,Not captured,863949,020,00072,ARS-02-0052892,Beacon America,Not captured,Not captured,Not captured,Passport(A01830575),,,Britz,Janet,,08/08/1993,female,Not captured,Not captured,Not captured,Not captured,Not captured,Not captured,Not captured,Not captured,Not captured,Not captured,Not captured,Not captured,Not captured,,,Not captured,Not captured,Not captured,Not captured,2000 Lee drive,,Denton,Texas,76209,9405952129,,Not captured,Not captured,janetbritz08@gmail.com,Not captured,701941068,,Not captured,Not captured,Not captured,Not captured,Not captured,Not captured,
Not captured,Not captured,09/25/2019,Not captured,Not captured,863949,020,00072,ARS-01-0052891,Beacon International,Not captured,Not captured,Not captured,,,,Truong,Darline,,11/13/1957,female,Not captured,Not captured,Not captured,Not captured,Not captured,Not captured,Not captured,Not captured,Not captured,Not captured,Not captured,Not captured,Not captured,,,Not captured,Not captured,Not captured,Not captured,2323 E Kelton Ln,,Phoenix,Arizona,85022,,,Not captured,Not captured,darline.truong@yahoo.com,Not captured,701941067,,Not captured,Not captured,Not captured,Not captured,Not captured,Not captured,
Not captured,Not captured,09/25/2019,Not captured,Not captured,863949,020,00072,ARS-01-0052888,Beacon International,Not captured,Not captured,Not captured,,,,Leibovitz,Israel,,11/08/1988,male,Not captured,Not captured,Not captured,Not captured,Not captured,Not captured,Not captured,Not captured,Not captured,Not captured,Not captured,Not captured,Not captured,,,Not captured,Not captured,Not captured,Not captured,1433 42nd street,,Brooklyn,New York,11219,,,Not captured,Not captured,srulikny@gmail.com,Not captured,701941051,,Not captured,Not captured,Not captured,Not captured,Not captured,Not captured,
Not captured,Not captured,09/25/2019,Not captured,Not captured,863949,020,00072,ARS-01-0052887,Beacon International,Not captured,Not captured,Not captured,,,,March,Yisroel,,10/06/1999,male,Not captured,Not captured,Not captured,Not captured,Not captured,Not captured,Not captured,Not captured,Not captured,Not captured,Not captured,Not captured,Not captured,,,Not captured,Not captured,Not captured,Not captured,7 Yomeh Ct,,Lakewood,New Jersey,08701,908-9104391,,Not captured,Not captured,yshgraphics@gmail.com,Not captured,701941050,,Not captured,Not captured,Not captured,Not captured,Not captured,Not captured,
Not captured,Not captured,09/25/2019,Not captured,Not captured,863949,020,00072,ARS-01-0052886,Beacon International,Not captured,Not captured,Not captured,,,,March,Yaakov,,09/29/1976,male,Not captured,Not captured,Not captured,Not captured,Not captured,Not captured,Not captured,Not captured,Not captured,Not captured,Not captured,Not captured,Not captured,,,Not captured,Not captured,Not captured,Not captured,7 Yomeh Ct,,Lakewood,New Jersey,08701,908-9104391,,Not captured,Not captured,yshgraphics@gmail.com,Not captured,701941049,,Not captured,Not captured,Not captured,Not captured,Not captured,Not captured,
Not captured,Not captured,09/25/2019,Not captured,Not captured,863949,020,00072,ARS-01-0052884,Beacon International,Not captured,Not captured,Not captured,Passport(GC020111),,,Cutbill,Jesse,E R ,01/15/1992,male,Not captured,Not captured,Not captured,Not captured,Not captured,Not captured,Not captured,Not captured,Not captured,Not captured,Not captured,Not captured,Not captured,Maria Lisikova,Spouse,Not captured,Not captured,Not captured,Not captured,6421 Nevilane Drive,,Duncan,British Columbia,V9l5s6,2507010771,,Not captured,Not captured,jessecutbill@gmail.com,Not captured,701941047,,Not captured,Not captured,Not captured,Not captured,Not captured,Not captured,
Not captured,Not captured,09/25/2019,Not captured,Not captured,863949,020,00072,ARS-01-0052878,Beacon International,Not captured,Not captured,Not captured,,,,Appel,Zev,,07/15/1994,male,Not captured,Not captured,Not captured,Not captured,Not captured,Not captured,Not captured,Not captured,Not captured,Not captured,Not captured,Not captured,Not captured,,,Not captured,Not captured,Not captured,Not captured,1846 54th Street,,Brooklyn,New York,11204,,,Not captured,Not captured,appelchaim@gmail.com,Not captured,701941021,,Not captured,Not captured,Not captured,Not captured,Not captured,Not captured,
Not captured,Not captured,09/25/2019,Not captured,Not captured,863949,020,00072,ARS-01-0052877,Beacon International,Not captured,Not captured,Not captured,,,,Appel,Chaim,,01/06/1973,male,Not captured,Not captured,Not captured,Not captured,Not captured,Not captured,Not captured,Not captured,Not captured,Not captured,Not captured,Not captured,Not captured,,,Not captured,Not captured,Not captured,Not captured,1846 54th Street,,Brooklyn,New York,11204,,,Not captured,Not captured,appelchaim@gmail.com,Not captured,701941020,,Not captured,Not captured,Not captured,Not captured,Not captured,Not captured,
Not captured,Not captured,09/25/2019,Not captured,Not captured,863949,020,00072,OVI-28-0052871,OverseasCare Visitors Insurance Plan,Not captured,Not captured,Not captured,,,,Ponnamma,Chandramoney Amma,,05/10/1959,female,Not captured,Not captured,Not captured,Not captured,Not captured,Not captured,Not captured,Not captured,Not captured,Not captured,Not captured,Not captured,Not captured,Anoop,Son,Not captured,Not captured,Not captured,Not captured,27610 Sunny Creek Dr,,valencia,California,91354,949-243-2147,,Not captured,Not captured,chandramoneyamma@gmail.com,Not captured,701941013,,Not captured,Not captured,Not captured,Not captured,Not captured,Not captured,
Not captured,Not captured,09/24/2019,Not captured,Not captured,863949,020,00072,ARS-01-0052869,Beacon International,Not captured,Not captured,Not captured,,,,Ubnoske,Jonathan,,12/29/1989,male,Not captured,Not captured,Not captured,Not captured,Not captured,Not captured,Not captured,Not captured,Not captured,Not captured,Not captured,Not captured,Not captured,,,Not captured,Not captured,Not captured,Not captured,23 Palomino Drive,,North Andover,Massachusetts,01845,,,Not captured,Not captured,jubnoske08@gmail.com,Not captured,701941009,,Not captured,Not captured,Not captured,Not captured,Not captured,Not captured,
Not captured,Not captured,09/24/2019,Not captured,Not captured,863949,020,00072,ARS-01-0052868,Beacon International,Not captured,Not captured,Not captured,,,,Aparicio Zafra,Maria Paula,,11/17/1992,female,Not captured,Not captured,Not captured,Not captured,Not captured,Not captured,Not captured,Not captured,Not captured,Not captured,Not captured,Not captured,Not captured,,,Not captured,Not captured,Not captured,Not captured,6242 rockwell street,,oakland,,94618,,,Not captured,Not captured,paulaapariciozafra@gmail.com,Not captured,701941008,,Not captured,Not captured,Not captured,Not captured,Not captured,Not captured,
Not captured,Not captured,09/24/2019,Not captured,Not captured,863949,020,00072,ARS-01-0052865,Beacon International,Not captured,Not captured,Not captured,,,,Mayobre,Maria,,11/01/1976,female,Not captured,Not captured,Not captured,Not captured,Not captured,Not captured,Not captured,Not captured,Not captured,Not captured,Not captured,Not captured,Not captured,,,Not captured,Not captured,Not captured,Not captured,7 Maude Terrace,,Watertown,Massachusetts,02472,,,Not captured,Not captured,memayobre@gmail.com,Not captured,701941005,,Not captured,Not captured,Not captured,Not captured,Not captured,Not captured,
Not captured,Not captured,09/24/2019,Not captured,Not captured,863949,020,00072,ARS-01-0052864,Beacon International,Not captured,Not captured,Not captured,,,,Rubin,Elliot,J,09/12/1954,male,Not captured,Not captured,Not captured,Not captured,Not captured,Not captured,Not captured,Not captured,Not captured,Not captured,Not captured,Not captured,Not captured,,,Not captured,Not captured,Not captured,Not captured,178 S Sycamore Ave,,Los Angeles,California,90036,,,Not captured,Not captured,elliotjrubin@gmail.com,Not captured,701941004,,Not captured,Not captured,Not captured,Not captured,Not captured,Not captured,
Not captured,Not captured,09/24/2019,Not captured,Not captured,863949,020,00072,ARS-01-0052859,Beacon International,Not captured,Not captured,Not captured,,,,McKeachie,James,N,10/29/1994,male,Not captured,Not captured,Not captured,Not captured,Not captured,Not captured,Not captured,Not captured,Not captured,Not captured,Not captured,Not captured,Not captured,,,Not captured,Not captured,Not captured,Not captured,70 Woodford Street,,Charleston,South Carolina,29492,,,Not captured,Not captured,jnoble213@gmail.com,Not captured,701940999,,Not captured,Not captured,Not captured,Not captured,Not captured,Not captured,
Not captured,Not captured,09/24/2019,Not captured,Not captured,863949,020,00072,ARS-01-0052846,Beacon International,Not captured,Not captured,Not captured,,,,WETZLER,LAZER,,12/22/2004,male,Not captured,Not captured,Not captured,Not captured,Not captured,Not captured,Not captured,Not captured,Not captured,Not captured,Not captured,Not captured,Not captured,,,Not captured,Not captured,Not captured,Not captured,47 South 8th Street,,Brooklyn,New York,11249,,,Not captured,Not captured,sew@mechonbelz.com,Not captured,701940986,,Not captured,Not captured,Not captured,Not captured,Not captured,Not captured,
Not captured,Not captured,09/24/2019,Not captured,Not captured,863949,020,00072,ARS-01-0052843,Beacon International,Not captured,Not captured,Not captured,,,,Notter,Katherine,,09/11/1960,female,Not captured,Not captured,Not captured,Not captured,Not captured,Not captured,Not captured,Not captured,Not captured,Not captured,Not captured,Not captured,Not captured,,,Not captured,Not captured,Not captured,Not captured,71 S WHITNEY ST,,GRAYSLAKE,Illinois,60030,,,Not captured,Not captured,nk1109@yahoo.com,Not captured,701940983,,Not captured,Not captured,Not captured,Not captured,Not captured,Not captured,
Not captured,Not captured,09/25/2019,Not captured,Not captured,863949,020,00072,ARS-02-0052838,Beacon America,Not captured,Not captured,Not captured,Passport(TB204843),,,Prevatt,Lancelot,I,06/14/1947,male,Not captured,Not captured,Not captured,Not captured,Not captured,Not captured,Not captured,Not captured,Not captured,Not captured,Not captured,Not captured,Not captured,Liselle Prevatt,Daughter,Not captured,Not captured,Not captured,Not captured,3 Fitt Street,,Port of Spain,Trinidad and Tobago,00000,1 8687532282,,Not captured,Not captured,liprevatt@gmail.com,Not captured,701940978,,Not captured,Not captured,Not captured,Not captured,Not captured,Not captured,
Not captured,Not captured,09/25/2019,Not captured,Not captured,863949,020,00072,OVI-28-0052837,OverseasCare Visitors Insurance Plan,Not captured,Not captured,Not captured,Passport(K3939644 ),,,Bhargava,Shakuntala,,04/28/1946,female,Not captured,Not captured,Not captured,Not captured,Not captured,Not captured,Not captured,Not captured,Not captured,Not captured,Not captured,Not captured,Not captured,Puneet Bhargava,Son,Not captured,Not captured,Not captured,Not captured,15104 Kestrelrise Drive,,Lithia,Florida,33547,8136063801,8136066827,Not captured,Not captured,puneetb11@live.com,Not captured,701940977,,Not captured,Not captured,Not captured,Not captured,Not captured,Not captured,
Not captured,Not captured,09/25/2019,Not captured,Not captured,863949,020,00072,OVI-28-0052836,OverseasCare Visitors Insurance Plan,Not captured,Not captured,Not captured,Passport(K3939644 ),,,Bhargava,Subhash,Chander,11/14/1943,male,Not captured,Not captured,Not captured,Not captured,Not captured,Not captured,Not captured,Not captured,Not captured,Not captured,Not captured,Not captured,Not captured,Puneet Bhargava,Son,Not captured,Not captured,Not captured,Not captured,15104 Kestrelrise Drive,,Lithia,Florida,33547,8136063801,8136066827,Not captured,Not captured,puneetb11@live.com,Not captured,701940976,,Not captured,Not captured,Not captured,Not captured,Not captured,Not captured,
Not captured,Not captured,09/23/2019,Not captured,Not captured,863949,020,00072,ARS-02-0052833,Beacon America,Not captured,Not captured,Not captured,,,,DENG,LUQI,,08/10/1989,female,Not captured,Not captured,Not captured,Not captured,Not captured,Not captured,Not captured,Not captured,Not captured,Not captured,Not captured,Not captured,Not captured,,,Not captured,Not captured,Not captured,Not captured,550 MORELAND WAY,,SANTA CLARA,CA,95054,4082102404,,Not captured,Not captured,DLQ11223344556677@163.COM,Not captured,701940971,,Not captured,Not captured,Not captured,Not captured,Not captured,Not captured,
Not captured,Not captured,09/24/2019,Not captured,Not captured,863949,020,00072,ARS-01-0052829,Beacon International,Not captured,Not captured,Not captured,,,,Hacohen,Eli,,08/04/1958,male,Not captured,Not captured,Not captured,Not captured,Not captured,Not captured,Not captured,Not captured,Not captured,Not captured,Not captured,Not captured,Not captured,,,Not captured,Not captured,Not captured,Not captured,1555 48th Street,,Brooklyn,New York,11219,646-417-3864,,Not captured,Not captured,sheller186@yahoo.com,Not captured,701940964,,Not captured,Not captured,Not captured,Not captured,Not captured,Not captured,
Not captured,Not captured,09/24/2019,Not captured,Not captured,863949,020,00072,ARS-01-0052828,Beacon International,Not captured,Not captured,Not captured,,,,Cohen,Vivian,,04/05/1957,male,Not captured,Not captured,Not captured,Not captured,Not captured,Not captured,Not captured,Not captured,Not captured,Not captured,Not captured,Not captured,Not captured,,,Not captured,Not captured,Not captured,Not captured,1555 48th Street,,Brooklyn,New York,11219,646-417-3864,,Not captured,Not captured,sheller186@yahoo.com,Not captured,701940963,,Not captured,Not captured,Not captured,Not captured,Not captured,Not captured,
Not captured,Not captured,09/23/2019,Not captured,Not captured,863949,020,00072,ARS-03-0052782,Essential America,Not captured,Not captured,Not captured,Passport(463800111),,,Alexander,Shana,Ryan,08/25/1979,female,Not captured,Not captured,Not captured,Not captured,Not captured,Not captured,Not captured,Not captured,Not captured,Not captured,Not captured,Not captured,Not captured,,,Not captured,Not captured,Not captured,Not captured,Quintas Callejas,,Chinandega,Chinandega,,+505 7532 2223,,Not captured,Not captured,alexander.r.shana@gmail.com,Not captured,701940871,,Not captured,Not captured,Not captured,Not captured,Not captured,Not captured,
Not captured,Not captured,09/23/2019,Not captured,Not captured,863949,020,00072,ARS-03-0052782,Essential America,Not captured,Not captured,Not captured,,Passport(550440317),Dependant,Alexander,Alivia,May,03/01/2005,female,Not captured,Not captured,Not captured,Not captured,Not captured,Not captured,Not captured,Not captured,Not captured,Not captured,Not captured,Not captured,Not captured,,,Not captured,Not captured,Not captured,Not captured,Quintas Callejas,,Chinandega,Chinandega,,+505 7532 2223,,Not captured,Not captured,alexander.r.shana@gmail.com,Not captured,,701940872,Not captured,Not captured,Not captured,Not captured,Not captured,Not captured,
Not captured,Not captured,09/23/2019,Not captured,Not captured,863949,020,00072,ARS-03-0052782,Essential America,Not captured,Not captured,Not captured,,Passport(566419732),Dependant,Alexander,Anden,Jared,04/03/2009,male,Not captured,Not captured,Not captured,Not captured,Not captured,Not captured,Not captured,Not captured,Not captured,Not captured,Not captured,Not captured,Not captured,,,Not captured,Not captured,Not captured,Not captured,Quintas Callejas,,Chinandega,Chinandega,,+505 7532 2223,,Not captured,Not captured,alexander.r.shana@gmail.com,Not captured,,701940873,Not captured,Not captured,Not captured,Not captured,Not captured,Not captured,
Not captured,Not captured,09/23/2019,Not captured,Not captured,863949,020,00072,ARS-02-0052827,Beacon America,Not captured,Not captured,Not captured,,,,Pirnak,Kimberly,,03/04/1966,female,Not captured,Not captured,Not captured,Not captured,Not captured,Not captured,Not captured,Not captured,Not captured,Not captured,Not captured,Not captured,Not captured,,,Not captured,Not captured,Not captured,Not captured,16303 Rangerider,,San Antonio,Texas,78247,,,Not captured,Not captured,kimpirnak@gmail.com,Not captured,701940961,,Not captured,Not captured,Not captured,Not captured,Not captured,Not captured,
Not captured,Not captured,09/24/2019,Not captured,Not captured,863949,020,00072,ARS-02-0052826,Beacon America,Not captured,Not captured,Not captured,Passport(N010377403),,,Rashidi,Razan,,07/12/1985,female,Not captured,Not captured,Not captured,Not captured,Not captured,Not captured,Not captured,Not captured,Not captured,Not captured,Not captured,Not captured,Not captured,,,Not captured,Not captured,Not captured,Not captured,594 Dean Street,,11238,New York,11238,6463301472,,Not captured,Not captured,rashidirazan@gmail.com,Not captured,701940960,,Not captured,Not captured,Not captured,Not captured,Not captured,Not captured,
Not captured,Not captured,09/24/2019,Not captured,Not captured,863949,020,00072,ARS-01-0052823,Beacon International,Not captured,Not captured,Not captured,Passport(P192491),,,Almeida,Daniel,Luis,09/08/1981,male,Not captured,Not captured,Not captured,Not captured,Not captured,Not captured,Not captured,Not captured,Not captured,Not captured,Not captured,Not captured,Not captured,David Ramos Almeida,My father,Not captured,Not captured,Not captured,Not captured,Rua Banda Amizade,,Aveiro,Aveiro,3810 059,00351234421535,00351969395766,Not captured,Not captured,daniel_dla@netcabo.pt,Not captured,701940956,,Not captured,Not captured,Not captured,Not captured,Not captured,Not captured,
Not captured,Not captured,09/23/2019,Not captured,Not captured,863949,020,00072,ARS-01-0052822,Beacon International,Not captured,Not captured,Not captured,Passport(474360652),,,Osborn,Randall,Eric,02/16/1967,male,Not captured,Not captured,Not captured,Not captured,Not captured,Not captured,Not captured,Not captured,Not captured,Not captured,Not captured,Not captured,Not captured,Marilyn Osborn,Spouse,Not captured,Not captured,Not captured,Not captured,1334 Louray Drive,,Baton Rouge,Louisiana,70808,2256148707,,Not captured,Not captured,randy@sent.as,Not captured,701940955,,Not captured,Not captured,Not captured,Not captured,Not captured,Not captured,
Not captured,Not captured,09/25/2019,Not captured,Not captured,863949,020,00072,ARS-02-0052821,Beacon America,Not captured,Not captured,Not captured,Passport(P9851013),,,BELIYAMOOLA ABDULKHADAR,MOHAMMED,,01/01/1947,male,Not captured,Not captured,Not captured,Not captured,Not captured,Not captured,Not captured,Not captured,Not captured,Not captured,Not captured,Not captured,Not captured,BEEFATHIMA MAHAMOOD,SPOUSE,Not captured,Not captured,Not captured,Not captured,4701 MONTEREY OAKS BLVD 1326,,AUSTIN,Texas,78749,15129199366,,Not captured,Not captured,nissarbm@gmail.com,Not captured,701940954,,Not captured,Not captured,Not captured,Not captured,Not captured,Not captured,
Not captured,Not captured,09/23/2019,Not captured,Not captured,863949,020,00072,ARS-02-0052820,Beacon America,Not captured,Not captured,Not captured,Passport(N12148176),,,Ospanova,Nargiza,,01/30/1992,female,Not captured,Not captured,Not captured,Not captured,Not captured,Not captured,Not captured,Not captured,Not captured,Not captured,Not captured,Not captured,Not captured,Yerzhan Ospanov,spouse,Not captured,Not captured,Not captured,Not captured,12725 S 312th St Apt A304,,Auburn,WA,98092,2533657439,,Not captured,Not captured,nargizon4ik@mail.ru,Not captured,701940953,,Not captured,Not captured,Not captured,Not captured,Not captured,Not captured,
Not captured,Not captured,09/22/2019,Not captured,Not captured,863949,020,00072,ARS-02-0052819,Beacon America,Not captured,Not captured,Not captured,,,,Torres Torres,Veronica,,03/07/1992,female,Not captured,Not captured,Not captured,Not captured,Not captured,Not captured,Not captured,Not captured,Not captured,Not captured,Not captured,Not captured,Not captured,,,Not captured,Not captured,Not captured,Not captured,Cto. Rio Ometepec #21 Col. Paseos de Churubusco,,Mexico City,,09030,,,Not captured,Not captured,verot_t@hotmail.com,Not captured,701940952,,Not captured,Not captured,Not captured,Not captured,Not captured,Not captured,
Not captured,Not captured,09/22/2019,Not captured,Not captured,863949,020,00072,ARS-01-0052818,Beacon International,Not captured,Not captured,Not captured,,,,Mott,Darina,,05/16/1995,female,Not captured,Not captured,Not captured,Not captured,Not captured,Not captured,Not captured,Not captured,Not captured,Not captured,Not captured,Not captured,Not captured,,,Not captured,Not captured,Not captured,Not captured,2174 140th Ave,,St Croix Falls,Wisconsin,54024,,,Not captured,Not captured,darianmott@gmail.com,Not captured,701940951,,Not captured,Not captured,Not captured,Not captured,Not captured,Not captured,