EE Transaction Type,Dependent Transaction Type,Effective Date,EE Signature,EE Signature Date,Control,Suffix,Account,Plan Number,Plan Name,Claim Office,Network ID Number,Customer Code,EE SSN,Dependent SSN,Dependent Relationship,Last Name,First Name,Middle Initial,DOB,Gender,Ethnicity,PCP/PCD,PCP/PCD Current Patient,Provider Cap Office Number,COB,Dep Student Indicator,Dep OOA Indicator,EE Prior Coverage Indicator,EE Late Entrant,EE Language Indicator,Hire Date,Earnings,Earnings Frequency,Beneficiary (Last Name First Name MI),Beneficiary Relationship,Continuation of Coverage Expiration Date,Continuation of Coverage Event Date,Continuation of Coverage Length of Coverage,Work Location Zip Code,Street Address Line 1,Street Address Line 2,City,State,Zip Code,Home Phone Number,Work Phone Number,Accept Code,Evidence Code,EE Email Address,Communication Disability Code,EE Alternate ID,Dep Alternate ID,Old Control,Old Suffix,Old Account,New Control,New Suffix,New Account,
Not captured,Not captured,09/18/2019,Not captured,Not captured,863949,020,00072,ARS-03-0052715,Essential International,Not captured,Not captured,Not captured,Passport(597876898),,,Hosack,Benjamin,,04/22/2019,male,Not captured,Not captured,Not captured,Not captured,Not captured,Not captured,Not captured,Not captured,Not captured,Not captured,Not captured,Not captured,Not captured,,,Not captured,Not captured,Not captured,Not captured,903 Greystone Dr.,,Allen,Texas,75013,9726791618,,Not captured,Not captured,service@azimuthrisk.com,Not captured,701940735,,Not captured,Not captured,Not captured,Not captured,Not captured,Not captured,
Not captured,Not captured,09/20/2019,Not captured,Not captured,863949,020,00072,ARS-01-0052801,Beacon International,Not captured,Not captured,Not captured,,,,Van De Velde,Jacqueline,,04/28/1993,female,Not captured,Not captured,Not captured,Not captured,Not captured,Not captured,Not captured,Not captured,Not captured,Not captured,Not captured,Not captured,Not captured,,,Not captured,Not captured,Not captured,Not captured,103 Bellrain Lane,,Saint Simons Island,Georgia,31522,,,Not captured,Not captured,jacvdvelde@gmail.com,Not captured,701940934,,Not captured,Not captured,Not captured,Not captured,Not captured,Not captured,
Not captured,Not captured,09/20/2019,Not captured,Not captured,863949,020,00072,ARS-01-0052797,Beacon International,Not captured,Not captured,Not captured,,,,Tjon En Fa,Jair,J,10/19/1993,male,Not captured,Not captured,Not captured,Not captured,Not captured,Not captured,Not captured,Not captured,Not captured,Not captured,Not captured,Not captured,Not captured,,,Not captured,Not captured,Not captured,Not captured,14 Mafoengostraat,,Paramaribo,,0000,,,Not captured,Not captured,epfrankel@yahoo.com,Not captured,701940930,,Not captured,Not captured,Not captured,Not captured,Not captured,Not captured,
Not captured,Not captured,09/20/2019,Not captured,Not captured,863949,020,00072,ARS-01-0052796,Beacon International,Not captured,Not captured,Not captured,,,,Reznik,Liron,,07/09/1973,male,Not captured,Not captured,Not captured,Not captured,Not captured,Not captured,Not captured,Not captured,Not captured,Not captured,Not captured,Not captured,Not captured,,,Not captured,Not captured,Not captured,Not captured,146 Pierrepont Street,,Brooklyn,New York,11201,,,Not captured,Not captured,lironreznik@yahoo.com,Not captured,701940891,,Not captured,Not captured,Not captured,Not captured,Not captured,Not captured,
Not captured,Not captured,09/20/2019,Not captured,Not captured,863949,020,00072,ARS-01-0052789,Beacon International,Not captured,Not captured,Not captured,,,,Mackenzie,Kaarina,,06/08/1991,female,Not captured,Not captured,Not captured,Not captured,Not captured,Not captured,Not captured,Not captured,Not captured,Not captured,Not captured,Not captured,Not captured,,,Not captured,Not captured,Not captured,Not captured,475 greenwich st,,Brooklyn,New York,11238,,,Not captured,Not captured,sebastianodell@gmail.com,Not captured,701940881,,Not captured,Not captured,Not captured,Not captured,Not captured,Not captured,
Not captured,Not captured,09/20/2019,Not captured,Not captured,863949,020,00072,ARS-01-0052788,Beacon International,Not captured,Not captured,Not captured,,,,Odell,Sebastian,,03/17/1989,male,Not captured,Not captured,Not captured,Not captured,Not captured,Not captured,Not captured,Not captured,Not captured,Not captured,Not captured,Not captured,Not captured,,,Not captured,Not captured,Not captured,Not captured,475 greenwich st,,Brooklyn,New York,11238,,,Not captured,Not captured,sebastianodell@gmail.com,Not captured,701940880,,Not captured,Not captured,Not captured,Not captured,Not captured,Not captured,
Not captured,Not captured,09/20/2019,Not captured,Not captured,863949,020,00072,ARS-02-0052787,Beacon America,Not captured,Not captured,Not captured,,,,Bartz,Erika,,10/05/1981,female,Not captured,Not captured,Not captured,Not captured,Not captured,Not captured,Not captured,Not captured,Not captured,Not captured,Not captured,Not captured,Not captured,,,Not captured,Not captured,Not captured,Not captured,5131 N Soledad Primera,,Tucson,Arizona,85718,,,Not captured,Not captured,ejbartz@gmail.com,Not captured,701940879,,Not captured,Not captured,Not captured,Not captured,Not captured,Not captured,
Not captured,Not captured,09/19/2019,Not captured,Not captured,863949,020,00072,ARS-01-0052786,Beacon International,Not captured,Not captured,Not captured,,,,Rinaldi-Vielmann,Andrea,A,12/13/1989,female,Not captured,Not captured,Not captured,Not captured,Not captured,Not captured,Not captured,Not captured,Not captured,Not captured,Not captured,Not captured,Not captured,,,Not captured,Not captured,Not captured,Not captured,203 Fingertip Rd,,Abingdon,Maryland,21009,,,Not captured,Not captured,aalexandrarv@gmail.com,Not captured,701940878,,Not captured,Not captured,Not captured,Not captured,Not captured,Not captured,
Not captured,Not captured,09/20/2019,Not captured,Not captured,863949,020,00072,ARS-02-0052785,Beacon America,Not captured,Not captured,Not captured,,,,Brito,&Eacute;rida Maria,b,04/10/1951,female,Not captured,Not captured,Not captured,Not captured,Not captured,Not captured,Not captured,Not captured,Not captured,Not captured,Not captured,Not captured,Not captured,,,Not captured,Not captured,Not captured,Not captured,Av Benjamim Brasil 261,,Fortaleza,,60712-003,,,Not captured,Not captured,jordana_brito@msn.com,Not captured,701940876,,Not captured,Not captured,Not captured,Not captured,Not captured,Not captured,
Not captured,Not captured,09/19/2019,Not captured,Not captured,863949,020,00072,ARS-02-0052783,Beacon America,Not captured,Not captured,Not captured,,,,Grussgut,Emanual,,09/16/1999,male,Not captured,Not captured,Not captured,Not captured,Not captured,Not captured,Not captured,Not captured,Not captured,Not captured,Not captured,Not captured,Not captured,,,Not captured,Not captured,Not captured,Not captured,Tabor strass20/2 1020,,Vienna,Wien,1020,732-961-0637,,Not captured,Not captured,malkafurst@optonline.net,Not captured,701940874,,Not captured,Not captured,Not captured,Not captured,Not captured,Not captured,
Not captured,Not captured,09/19/2019,Not captured,Not captured,863949,020,00072,ARS-03-0052692,Essential America,Not captured,Not captured,Not captured,Passport(642997419),,,Bowman,John ,,07/20/1957,male,Not captured,Not captured,Not captured,Not captured,Not captured,Not captured,Not captured,Not captured,Not captured,Not captured,Not captured,Not captured,Not captured,,,Not captured,Not captured,Not captured,Not captured,5519 White&apos;s Ferry Road,,West Monroe,Louisiana,71291,4433331931,,Not captured,Not captured,bowmanfmly@gmail.com,Not captured,701940687,,Not captured,Not captured,Not captured,Not captured,Not captured,Not captured,
Not captured,Not captured,09/19/2019,Not captured,Not captured,863949,020,00072,ARS-03-0052692,Essential America,Not captured,Not captured,Not captured,,Passport(566260510),Spouse,Bowman,Roycelyn,,01/31/1961,female,Not captured,Not captured,Not captured,Not captured,Not captured,Not captured,Not captured,Not captured,Not captured,Not captured,Not captured,Not captured,Not captured,,,Not captured,Not captured,Not captured,Not captured,5519 White&apos;s Ferry Road,,West Monroe,Louisiana,71291,4433331931,,Not captured,Not captured,bowmanfmly@gmail.com,Not captured,,701940688,Not captured,Not captured,Not captured,Not captured,Not captured,Not captured,
Not captured,Not captured,09/19/2019,Not captured,Not captured,863949,020,00072,ARS-01-0052779,Beacon International,Not captured,Not captured,Not captured,,,,Ball,Vanessa,,01/18/1975,female,Not captured,Not captured,Not captured,Not captured,Not captured,Not captured,Not captured,Not captured,Not captured,Not captured,Not captured,Not captured,Not captured,,,Not captured,Not captured,Not captured,Not captured,1002 Marina View Towers B,,Dubai,,UAE,,,Not captured,Not captured,vanessa_ball_london@yahoo.co.uk,Not captured,701940866,,Not captured,Not captured,Not captured,Not captured,Not captured,Not captured,
Not captured,Not captured,09/19/2019,Not captured,Not captured,863949,020,00072,ARS-01-0052778,Beacon International,Not captured,Not captured,Not captured,,,,bosch,craig,,12/29/1972,male,Not captured,Not captured,Not captured,Not captured,Not captured,Not captured,Not captured,Not captured,Not captured,Not captured,Not captured,Not captured,Not captured,,,Not captured,Not captured,Not captured,Not captured,Flat 110 New Cumberland,,Cape Town,,8001,,,Not captured,Not captured,margie@eco-ventures.org,Not captured,701940857,,Not captured,Not captured,Not captured,Not captured,Not captured,Not captured,
Not captured,Not captured,09/19/2019,Not captured,Not captured,863949,020,00072,ARS-01-0052777,Beacon International,Not captured,Not captured,Not captured,,,,brand,margie,,11/03/1973,female,Not captured,Not captured,Not captured,Not captured,Not captured,Not captured,Not captured,Not captured,Not captured,Not captured,Not captured,Not captured,Not captured,,,Not captured,Not captured,Not captured,Not captured,35 W. Del Ray Avenue,,Alexandria,Virginia,22301,,,Not captured,Not captured,margie@eco-ventures.org,Not captured,701940856,,Not captured,Not captured,Not captured,Not captured,Not captured,Not captured,
Not captured,Not captured,09/20/2019,Not captured,Not captured,863949,020,00072,ARS-02-0052776,Beacon America,Not captured,Not captured,Not captured,Passport(523122437),,,David,Adam,,03/20/1991,male,Not captured,Not captured,Not captured,Not captured,Not captured,Not captured,Not captured,Not captured,Not captured,Not captured,Not captured,Not captured,Not captured,Lynsey David,Wife,Not captured,Not captured,Not captured,Not captured,481 Polk Manor Drive,,GREENWOOD,Indiana,46143,3174124964,,Not captured,Not captured,adammdavid1@gmail.com,Not captured,701940840,,Not captured,Not captured,Not captured,Not captured,Not captured,Not captured,
Not captured,Not captured,09/19/2019,Not captured,Not captured,863949,020,00072,ARS-01-0052775,Beacon International,Not captured,Not captured,Not captured,,,,Golding,Timothy,,03/19/1987,male,Not captured,Not captured,Not captured,Not captured,Not captured,Not captured,Not captured,Not captured,Not captured,Not captured,Not captured,Not captured,Not captured,,,Not captured,Not captured,Not captured,Not captured,33 Hudson Street,,Jersey City,New Jersey,07302,,,Not captured,Not captured,timothy.golding@tiscali.co.uk,Not captured,701940839,,Not captured,Not captured,Not captured,Not captured,Not captured,Not captured,
Not captured,Not captured,09/19/2019,Not captured,Not captured,863949,020,00072,ARS-01-0052773,Beacon International,Not captured,Not captured,Not captured,,,,Kuwabara,Laura,D,03/30/1989,female,Not captured,Not captured,Not captured,Not captured,Not captured,Not captured,Not captured,Not captured,Not captured,Not captured,Not captured,Not captured,Not captured,,,Not captured,Not captured,Not captured,Not captured,1-8-13-203 Nihonbashihoridomecho,,Tokyo-to,,103-0012,,,Not captured,Not captured,yuandlaura@gmail.com,Not captured,701940837,,Not captured,Not captured,Not captured,Not captured,Not captured,Not captured,
Not captured,Not captured,09/19/2019,Not captured,Not captured,863949,020,00072,ARS-01-0052772,Beacon International,Not captured,Not captured,Not captured,,,,Kuwabara,Yu,,11/16/1984,male,Not captured,Not captured,Not captured,Not captured,Not captured,Not captured,Not captured,Not captured,Not captured,Not captured,Not captured,Not captured,Not captured,,,Not captured,Not captured,Not captured,Not captured,1-8-13-203 Nihonbashihoridomecho,,Chuo-Ku,,103-0012,,,Not captured,Not captured,ukuwabara@gmail.com,Not captured,701940836,,Not captured,Not captured,Not captured,Not captured,Not captured,Not captured,
Not captured,Not captured,09/19/2019,Not captured,Not captured,863949,020,00072,ARS-01-0052771,Beacon International,Not captured,Not captured,Not captured,,,,Busby,Brandon,,08/11/1990,male,Not captured,Not captured,Not captured,Not captured,Not captured,Not captured,Not captured,Not captured,Not captured,Not captured,Not captured,Not captured,Not captured,,,Not captured,Not captured,Not captured,Not captured,529 cleek close,,Qualicum beach,British Columbia,V9k1e5,,,Not captured,Not captured,brandon.busby@hotmail.com,Not captured,701940835,,Not captured,Not captured,Not captured,Not captured,Not captured,Not captured,
Not captured,Not captured,09/18/2019,Not captured,Not captured,863949,020,00072,ARS-01-0052767,Beacon International,Not captured,Not captured,Not captured,,,,Wind,Pinchus ,,04/22/1970,male,Not captured,Not captured,Not captured,Not captured,Not captured,Not captured,Not captured,Not captured,Not captured,Not captured,Not captured,Not captured,Not captured,,,Not captured,Not captured,Not captured,Not captured,44 Harmony drive,,Lakewod,New Jersey,08701,917-8045274,,Not captured,Not captured,mwindlakewood44@gmail.com,Not captured,701940805,,Not captured,Not captured,Not captured,Not captured,Not captured,Not captured,
Not captured,Not captured,09/19/2019,Not captured,Not captured,863949,020,00072,ARS-01-0052765,Beacon International,Not captured,Not captured,Not captured,,,,marin solis,Elvis,,04/03/1955,female,Not captured,Not captured,Not captured,Not captured,Not captured,Not captured,Not captured,Not captured,Not captured,Not captured,Not captured,Not captured,Not captured,Luz Figueiredo,daughter,Not captured,Not captured,Not captured,Not captured,2Ashwood Ave,,Summit,New Jersey,07901,9736340609,,Not captured,Not captured,lfig82@yahoo.com,Not captured,701940803,,Not captured,Not captured,Not captured,Not captured,Not captured,Not captured,
Not captured,Not captured,09/18/2019,Not captured,Not captured,863949,020,00072,ARS-02-0052764,Beacon America,Not captured,Not captured,Not captured,,,,KUMARASAMY,MUTHUMANI,,05/02/1970,female,Not captured,Not captured,Not captured,Not captured,Not captured,Not captured,Not captured,Not captured,Not captured,Not captured,Not captured,Not captured,Not captured,Bharathi Kumarasamy,Daughter,Not captured,Not captured,Not captured,Not captured,1907 SW 28TH ST,,BENTONVILLE,Arkansas,72713,4793218811,,Not captured,Not captured,arunssundar@gmail.com,Not captured,701940802,,Not captured,Not captured,Not captured,Not captured,Not captured,Not captured,
Not captured,Not captured,09/18/2019,Not captured,Not captured,863949,020,00072,ARS-03-0052658,Essential America,Not captured,Not captured,Not captured,Passport(110137579),,,Gonzalez,Alberto,Javier,05/07/1970,male,Not captured,Not captured,Not captured,Not captured,Not captured,Not captured,Not captured,Not captured,Not captured,Not captured,Not captured,Not captured,Not captured,,,Not captured,Not captured,Not captured,Not captured,21002 Fairway Bend,,Katy,Texas,77450,8327928140,,Not captured,Not captured,javi70gonzalez@msn.com,Not captured,701940630,,Not captured,Not captured,Not captured,Not captured,Not captured,Not captured,
Not captured,Not captured,09/18/2019,Not captured,Not captured,863949,020,00072,ARS-03-0052658,Essential America,Not captured,Not captured,Not captured,,Passport(112352068),Spouse,Perez,Vanessa,,05/05/1977,female,Not captured,Not captured,Not captured,Not captured,Not captured,Not captured,Not captured,Not captured,Not captured,Not captured,Not captured,Not captured,Not captured,,,Not captured,Not captured,Not captured,Not captured,21002 Fairway Bend,,Katy,Texas,77450,8327928140,,Not captured,Not captured,javi70gonzalez@msn.com,Not captured,,701940631,Not captured,Not captured,Not captured,Not captured,Not captured,Not captured,
Not captured,Not captured,09/18/2019,Not captured,Not captured,863949,020,00072,ARS-03-0052658,Essential America,Not captured,Not captured,Not captured,,Passport(110066102),Dependant,Gonzalez,Santiago,,09/15/2004,male,Not captured,Not captured,Not captured,Not captured,Not captured,Not captured,Not captured,Not captured,Not captured,Not captured,Not captured,Not captured,Not captured,,,Not captured,Not captured,Not captured,Not captured,21002 Fairway Bend,,Katy,Texas,77450,8327928140,,Not captured,Not captured,javi70gonzalez@msn.com,Not captured,,701940632,Not captured,Not captured,Not captured,Not captured,Not captured,Not captured,
Not captured,Not captured,09/18/2019,Not captured,Not captured,863949,020,00072,ARS-03-0052658,Essential America,Not captured,Not captured,Not captured,,Passport(116092131),Dependant,Gonzalez,Amanda,,01/11/2007,female,Not captured,Not captured,Not captured,Not captured,Not captured,Not captured,Not captured,Not captured,Not captured,Not captured,Not captured,Not captured,Not captured,,,Not captured,Not captured,Not captured,Not captured,21002 Fairway Bend,,Katy,Texas,77450,8327928140,,Not captured,Not captured,javi70gonzalez@msn.com,Not captured,,701940633,Not captured,Not captured,Not captured,Not captured,Not captured,Not captured,
Not captured,Not captured,09/18/2019,Not captured,Not captured,863949,020,00072,OVI-28-0052763,OverseasCare Visitors Insurance Plan,Not captured,Not captured,Not captured,Passport(T0747956),,,Sivalingam,Nagarathinam,,01/21/1962,female,Not captured,Not captured,Not captured,Not captured,Not captured,Not captured,Not captured,Not captured,Not captured,Not captured,Not captured,Not captured,Not captured,,,Not captured,Not captured,Not captured,Not captured,2401 SW Illini Ave,,Bentonville,Arkansas,72713,9737230818,,Not captured,Not captured,Kvvnithya@gmail.com,Not captured,701940786,,Not captured,Not captured,Not captured,Not captured,Not captured,Not captured,
Not captured,Not captured,09/18/2019,Not captured,Not captured,863949,020,00072,OVI-28-0052762,OverseasCare Visitors Insurance Plan,Not captured,Not captured,Not captured,Passport(T0747956),,,Vedigounder,Sivalingam,,10/06/1957,male,Not captured,Not captured,Not captured,Not captured,Not captured,Not captured,Not captured,Not captured,Not captured,Not captured,Not captured,Not captured,Not captured,,,Not captured,Not captured,Not captured,Not captured,2401 SW Illini Ave,,Bentonville,Arkansas,72713,9737230818,,Not captured,Not captured,Kvvnithya@gmail.com,Not captured,701940785,,Not captured,Not captured,Not captured,Not captured,Not captured,Not captured,
Not captured,Not captured,09/18/2019,Not captured,Not captured,863949,020,00072,ARS-01-0052761,Beacon International,Not captured,Not captured,Not captured,,,,Lim,Yong Hwa,H,06/06/1997,male,Not captured,Not captured,Not captured,Not captured,Not captured,Not captured,Not captured,Not captured,Not captured,Not captured,Not captured,Not captured,Not captured,,,Not captured,Not captured,Not captured,Not captured,E-03 Friedrich Wilhelm von Steuben Str 90,,Frankfurt am Main,,60488,,,Not captured,Not captured,yonghwa_lim@hotmail.co.uk,Not captured,701940784,,Not captured,Not captured,Not captured,Not captured,Not captured,Not captured,
Not captured,Not captured,09/18/2019,Not captured,Not captured,863949,020,00072,ARS-01-0052749,Beacon International,Not captured,Not captured,Not captured,,,,Godward McGavin,Annelie,B,02/10/1978,female,Not captured,Not captured,Not captured,Not captured,Not captured,Not captured,Not captured,Not captured,Not captured,Not captured,Not captured,Not captured,Not captured,,,Not captured,Not captured,Not captured,Not captured,60-28 69th Avenue,,Flushing,New York,11385,,,Not captured,Not captured,mcgavinprojects@gmail.com,Not captured,701940772,,Not captured,Not captured,Not captured,Not captured,Not captured,Not captured,
Not captured,Not captured,09/19/2019,Not captured,Not captured,863949,020,00072,OVI-28-0052729,OverseasCare Visitors Insurance Plan,Not captured,Not captured,Not captured,Passport(T6933564),,,Yamala,Lakshmi,,03/21/1960,female,Not captured,Not captured,Not captured,Not captured,Not captured,Not captured,Not captured,Not captured,Not captured,Not captured,Not captured,Not captured,Not captured,,,Not captured,Not captured,Not captured,Not captured,172 aurora ave,,San Marcos,California,92078,6194384344,,Not captured,Not captured,prasad9r@gmail.com,Not captured,701940752,,Not captured,Not captured,Not captured,Not captured,Not captured,Not captured,
Not captured,Not captured,09/18/2019,Not captured,Not captured,863949,020,00072,ARS-01-0052728,Beacon International,Not captured,Not captured,Not captured,Passport(105290545),,,Marin Solis,Dinia,,11/11/1959,female,Not captured,Not captured,Not captured,Not captured,Not captured,Not captured,Not captured,Not captured,Not captured,Not captured,Not captured,Not captured,Not captured,Daniel Ramirez,son,Not captured,Not captured,Not captured,Not captured,2 Ashwood Ave.,,Summit,New Jersey,07901,9736340609,,Not captured,Not captured,lfig82@yahoo.com,Not captured,701940751,,Not captured,Not captured,Not captured,Not captured,Not captured,Not captured,
Not captured,Not captured,09/18/2019,Not captured,Not captured,863949,020,00072,ARS-01-0052727,Beacon International,Not captured,Not captured,Not captured,,,,Svigilsky,Sharon,,10/26/1990,female,Not captured,Not captured,Not captured,Not captured,Not captured,Not captured,Not captured,Not captured,Not captured,Not captured,Not captured,Not captured,Not captured,,,Not captured,Not captured,Not captured,Not captured,Los ilanes 86 las condes,,Santiago,,7560384,,,Not captured,Not captured,bcaro361@gmail.com,Not captured,701940750,,Not captured,Not captured,Not captured,Not captured,Not captured,Not captured,
Not captured,Not captured,09/18/2019,Not captured,Not captured,863949,020,00072,ARS-01-0052726,Beacon International,Not captured,Not captured,Not captured,,,,Caro,Benjamin,,09/03/1991,male,Not captured,Not captured,Not captured,Not captured,Not captured,Not captured,Not captured,Not captured,Not captured,Not captured,Not captured,Not captured,Not captured,,,Not captured,Not captured,Not captured,Not captured,Los ilanes 86 las condes,,Santiago,,7560384,,,Not captured,Not captured,bcaro361@gmail.com,Not captured,701940749,,Not captured,Not captured,Not captured,Not captured,Not captured,Not captured,
Not captured,Not captured,09/19/2019,Not captured,Not captured,863949,020,00072,ARS-01-0052688,Beacon International,Not captured,Not captured,Not captured,,,,rai,kuljeet,s,06/01/1960,male,Not captured,Not captured,Not captured,Not captured,Not captured,Not captured,Not captured,Not captured,Not captured,Not captured,Not captured,Not captured,Not captured,kuljeet,kuljeet,Not captured,Not captured,Not captured,Not captured,15000 Los Gatos blvd,,los gatos,California,95032,408-356-3576,408-356-3576,Not captured,Not captured,kuljeetrai@hotmail.com,Not captured,701940683,,Not captured,Not captured,Not captured,Not captured,Not captured,Not captured,