EE Transaction Type,Dependent Transaction Type,Effective Date,EE Signature,EE Signature Date,Control,Suffix,Account,Plan Number,Plan Name,Claim Office,Network ID Number,Customer Code,EE SSN,Dependent SSN,Dependent Relationship,Last Name,First Name,Middle Initial,DOB,Gender,Ethnicity,PCP/PCD,PCP/PCD Current Patient,Provider Cap Office Number,COB,Dep Student Indicator,Dep OOA Indicator,EE Prior Coverage Indicator,EE Late Entrant,EE Language Indicator,Hire Date,Earnings,Earnings Frequency,Beneficiary (Last Name First Name MI),Beneficiary Relationship,Continuation of Coverage Expiration Date,Continuation of Coverage Event Date,Continuation of Coverage Length of Coverage,Work Location Zip Code,Street Address Line 1,Street Address Line 2,City,State,Zip Code,Home Phone Number,Work Phone Number,Accept Code,Evidence Code,EE Email Address,Communication Disability Code,EE Alternate ID,Dep Alternate ID,Old Control,Old Suffix,Old Account,New Control,New Suffix,New Account,
Not captured,Not captured,09/16/2019,Not captured,Not captured,863949,020,00072,ARS-04-0052659,Enhanced America,Not captured,Not captured,Not captured,SSN(003636909),,,Lewis,Keira,,08/17/2019,female,Not captured,Not captured,Not captured,Not captured,Not captured,Not captured,Not captured,Not captured,Not captured,Not captured,Not captured,Not captured,Not captured,,,Not captured,Not captured,Not captured,Not captured,253 Saddle Ridge Dr.,,Davenport,Florida,33896,4075749436,,Not captured,Not captured,service@azimuthrisk.com,Not captured,701940634,,Not captured,Not captured,Not captured,Not captured,Not captured,Not captured,
Not captured,Not captured,09/17/2019,Not captured,Not captured,863949,020,00072,ARS-01-0052723,Beacon International,Not captured,Not captured,Not captured,,,,martin,vanessa,r,06/03/1982,female,Not captured,Not captured,Not captured,Not captured,Not captured,Not captured,Not captured,Not captured,Not captured,Not captured,Not captured,Not captured,Not captured,,,Not captured,Not captured,Not captured,Not captured,405 n wabash ave,,chicago,Illinois,60611,,,Not captured,Not captured,zoneflow@aol.com,Not captured,701940746,,Not captured,Not captured,Not captured,Not captured,Not captured,Not captured,
Not captured,Not captured,09/17/2019,Not captured,Not captured,863949,020,00072,ARS-01-0052722,Beacon International,Not captured,Not captured,Not captured,,,,oberrotman,mark,l,07/16/1955,male,Not captured,Not captured,Not captured,Not captured,Not captured,Not captured,Not captured,Not captured,Not captured,Not captured,Not captured,Not captured,Not captured,,,Not captured,Not captured,Not captured,Not captured,405 n wabash ave,,chicago,Illinois,60611,,,Not captured,Not captured,zoneflow@aol.com,Not captured,701940745,,Not captured,Not captured,Not captured,Not captured,Not captured,Not captured,
Not captured,Not captured,09/17/2019,Not captured,Not captured,863949,020,00072,ARS-01-0052721,Beacon International,Not captured,Not captured,Not captured,,,,Fried,Joel,,03/12/1981,male,Not captured,Not captured,Not captured,Not captured,Not captured,Not captured,Not captured,Not captured,Not captured,Not captured,Not captured,Not captured,Not captured,,,Not captured,Not captured,Not captured,Not captured,113 Lorimer St.,,Brooklyn,New York,11206,,,Not captured,Not captured,joefried@gmail.com,Not captured,701940744,,Not captured,Not captured,Not captured,Not captured,Not captured,Not captured,
Not captured,Not captured,09/17/2019,Not captured,Not captured,863949,020,00072,ARS-02-0052718,Beacon America,Not captured,Not captured,Not captured,,,,Choudhury,Mohsin,,04/05/1983,male,Not captured,Not captured,Not captured,Not captured,Not captured,Not captured,Not captured,Not captured,Not captured,Not captured,Not captured,Not captured,Not captured,,,Not captured,Not captured,Not captured,Not captured,2323 Long Reach Drive,,Sugar Land,Texas,77478,,,Not captured,Not captured,mohsin.choudhury@arundo.com,Not captured,701940741,,Not captured,Not captured,Not captured,Not captured,Not captured,Not captured,
Not captured,Not captured,09/17/2019,Not captured,Not captured,863949,020,00072,ARS-01-0052716,Beacon International,Not captured,Not captured,Not captured,,,,Brown,Joel,,04/21/1987,male,Not captured,Not captured,Not captured,Not captured,Not captured,Not captured,Not captured,Not captured,Not captured,Not captured,Not captured,Not captured,Not captured,,,Not captured,Not captured,Not captured,Not captured,4328 139th PL SE,,Snohomish,Washington,98296,,,Not captured,Not captured,joelbrown212@hotmail.com,Not captured,701940736,,Not captured,Not captured,Not captured,Not captured,Not captured,Not captured,
Not captured,Not captured,09/16/2019,Not captured,Not captured,863949,020,00072,ARS-03-0052694,Essential America,Not captured,Not captured,Not captured,Passport(642985872),,,Roszel,Richard,Alan,10/25/1980,male,Not captured,Not captured,Not captured,Not captured,Not captured,Not captured,Not captured,Not captured,Not captured,Not captured,Not captured,Not captured,Not captured,,,Not captured,Not captured,Not captured,Not captured,Liuhe Spring Apartment,,Hangzhou,Zhejiang,310023,15988809262,,Not captured,Not captured,wanderingroszels@yahoo.com,Not captured,701940708,,Not captured,Not captured,Not captured,Not captured,Not captured,Not captured,
Not captured,Not captured,09/16/2019,Not captured,Not captured,863949,020,00072,ARS-03-0052694,Essential America,Not captured,Not captured,Not captured,,Passport(642988283),Spouse,Roszel,Holli,Jo,07/17/1983,female,Not captured,Not captured,Not captured,Not captured,Not captured,Not captured,Not captured,Not captured,Not captured,Not captured,Not captured,Not captured,Not captured,,,Not captured,Not captured,Not captured,Not captured,Liuhe Spring Apartment,,Hangzhou,Zhejiang,310023,15988809262,,Not captured,Not captured,wanderingroszels@yahoo.com,Not captured,,701940709,Not captured,Not captured,Not captured,Not captured,Not captured,Not captured,
Not captured,Not captured,09/16/2019,Not captured,Not captured,863949,020,00072,ARS-03-0052694,Essential America,Not captured,Not captured,Not captured,,Passport(550084631),Dependant,Roszel,Lillian,Kay,08/24/2009,female,Not captured,Not captured,Not captured,Not captured,Not captured,Not captured,Not captured,Not captured,Not captured,Not captured,Not captured,Not captured,Not captured,,,Not captured,Not captured,Not captured,Not captured,Liuhe Spring Apartment,,Hangzhou,Zhejiang,310023,15988809262,,Not captured,Not captured,wanderingroszels@yahoo.com,Not captured,,701940710,Not captured,Not captured,Not captured,Not captured,Not captured,Not captured,
Not captured,Not captured,09/16/2019,Not captured,Not captured,863949,020,00072,ARS-03-0052694,Essential America,Not captured,Not captured,Not captured,,Passport(55084632),Dependant,Roszelk,Eli,James,06/15/2011,male,Not captured,Not captured,Not captured,Not captured,Not captured,Not captured,Not captured,Not captured,Not captured,Not captured,Not captured,Not captured,Not captured,,,Not captured,Not captured,Not captured,Not captured,Liuhe Spring Apartment,,Hangzhou,Zhejiang,310023,15988809262,,Not captured,Not captured,wanderingroszels@yahoo.com,Not captured,,701940711,Not captured,Not captured,Not captured,Not captured,Not captured,Not captured,
Not captured,Not captured,09/16/2019,Not captured,Not captured,863949,020,00072,ARS-03-0052694,Essential America,Not captured,Not captured,Not captured,,Passport(561278290),Dependant,Roszel,Gideon,Abram,10/24/2017,male,Not captured,Not captured,Not captured,Not captured,Not captured,Not captured,Not captured,Not captured,Not captured,Not captured,Not captured,Not captured,Not captured,,,Not captured,Not captured,Not captured,Not captured,Liuhe Spring Apartment,,Hangzhou,Zhejiang,310023,15988809262,,Not captured,Not captured,wanderingroszels@yahoo.com,Not captured,,701940712,Not captured,Not captured,Not captured,Not captured,Not captured,Not captured,
Not captured,Not captured,09/17/2019,Not captured,Not captured,863949,020,00072,ARS-03-0052662,Essential America,Not captured,Not captured,Not captured,Passport(AE942019),,,Willits,Darin,Lee,06/28/1976,male,Not captured,Not captured,Not captured,Not captured,Not captured,Not captured,Not captured,Not captured,Not captured,Not captured,Not captured,Not captured,Not captured,,,Not captured,Not captured,Not captured,Not captured,777 Bay Street,,Toronto,Ontario,M5G 2C8,5195396666,,Not captured,Not captured,andra@willits.ca,Not captured,701940637,,Not captured,Not captured,Not captured,Not captured,Not captured,Not captured,
Not captured,Not captured,09/17/2019,Not captured,Not captured,863949,020,00072,ARS-03-0052662,Essential America,Not captured,Not captured,Not captured,,Passport(AE942018),Spouse,Willits,Andra,Elizabeth,11/01/1977,female,Not captured,Not captured,Not captured,Not captured,Not captured,Not captured,Not captured,Not captured,Not captured,Not captured,Not captured,Not captured,Not captured,,,Not captured,Not captured,Not captured,Not captured,777 Bay Street,,Toronto,Ontario,M5G 2C8,5195396666,,Not captured,Not captured,andra@willits.ca,Not captured,,701940638,Not captured,Not captured,Not captured,Not captured,Not captured,Not captured,
Not captured,Not captured,09/17/2019,Not captured,Not captured,863949,020,00072,ARS-03-0052662,Essential America,Not captured,Not captured,Not captured,,Passport(AE942017),Dependant,Willits,Catriona,Elizabeth,04/29/2009,female,Not captured,Not captured,Not captured,Not captured,Not captured,Not captured,Not captured,Not captured,Not captured,Not captured,Not captured,Not captured,Not captured,,,Not captured,Not captured,Not captured,Not captured,777 Bay Street,,Toronto,Ontario,M5G 2C8,5195396666,,Not captured,Not captured,andra@willits.ca,Not captured,,701940639,Not captured,Not captured,Not captured,Not captured,Not captured,Not captured,
Not captured,Not captured,09/17/2019,Not captured,Not captured,863949,020,00072,ARS-03-0052662,Essential America,Not captured,Not captured,Not captured,,Passport(AE942016),Dependant,Willits,Gemma,Anne,08/20/2011,female,Not captured,Not captured,Not captured,Not captured,Not captured,Not captured,Not captured,Not captured,Not captured,Not captured,Not captured,Not captured,Not captured,,,Not captured,Not captured,Not captured,Not captured,777 Bay Street,,Toronto,Ontario,M5G 2C8,5195396666,,Not captured,Not captured,andra@willits.ca,Not captured,,701940640,Not captured,Not captured,Not captured,Not captured,Not captured,Not captured,
Not captured,Not captured,09/17/2019,Not captured,Not captured,863949,020,00072,ARS-03-0052662,Essential America,Not captured,Not captured,Not captured,,Passport(AE942011),Dependant,Willits,Lorelei,Brynn,06/10/2014,female,Not captured,Not captured,Not captured,Not captured,Not captured,Not captured,Not captured,Not captured,Not captured,Not captured,Not captured,Not captured,Not captured,,,Not captured,Not captured,Not captured,Not captured,777 Bay Street,,Toronto,Ontario,M5G 2C8,5195396666,,Not captured,Not captured,andra@willits.ca,Not captured,,701940641,Not captured,Not captured,Not captured,Not captured,Not captured,Not captured,
Not captured,Not captured,09/17/2019,Not captured,Not captured,863949,020,00072,ARS-01-0052714,Beacon International,Not captured,Not captured,Not captured,,,,Spira,Simcha b,,01/30/1993,male,Not captured,Not captured,Not captured,Not captured,Not captured,Not captured,Not captured,Not captured,Not captured,Not captured,Not captured,Not captured,Not captured,,,Not captured,Not captured,Not captured,Not captured,608 West Kennedy Blvd,,Lakewood,New Jersey,08701,718-747-4054,,Not captured,Not captured,simchaspira2@gmail.com,Not captured,701940734,,Not captured,Not captured,Not captured,Not captured,Not captured,Not captured,
Not captured,Not captured,09/17/2019,Not captured,Not captured,863949,020,00072,ARS-01-0052710,Beacon International,Not captured,Not captured,Not captured,,,,goldberger,mayer,,01/10/2001,male,Not captured,Not captured,Not captured,Not captured,Not captured,Not captured,Not captured,Not captured,Not captured,Not captured,Not captured,Not captured,Not captured,,,Not captured,Not captured,Not captured,Not captured,19 rozhin rd,,monroe,New York,10950,,,Not captured,Not captured,hersh2253@gmail.com,Not captured,701940728,,Not captured,Not captured,Not captured,Not captured,Not captured,Not captured,
Not captured,Not captured,09/17/2019,Not captured,Not captured,863949,020,00072,ARS-01-0052709,Beacon International,Not captured,Not captured,Not captured,,,,goldberger,lazar,,07/25/1999,male,Not captured,Not captured,Not captured,Not captured,Not captured,Not captured,Not captured,Not captured,Not captured,Not captured,Not captured,Not captured,Not captured,,,Not captured,Not captured,Not captured,Not captured,19 rozhin rd,,monroe,New York,10950,,,Not captured,Not captured,hersh2253@gmail.com,Not captured,701940727,,Not captured,Not captured,Not captured,Not captured,Not captured,Not captured,
Not captured,Not captured,09/17/2019,Not captured,Not captured,863949,020,00072,ARS-01-0052708,Beacon International,Not captured,Not captured,Not captured,,,,goldberger,rachel,,07/07/1979,female,Not captured,Not captured,Not captured,Not captured,Not captured,Not captured,Not captured,Not captured,Not captured,Not captured,Not captured,Not captured,Not captured,,,Not captured,Not captured,Not captured,Not captured,19 rozhin rd,,monroe,New York,10950,,,Not captured,Not captured,hersh2253@gmail.com,Not captured,701940726,,Not captured,Not captured,Not captured,Not captured,Not captured,Not captured,
Not captured,Not captured,09/17/2019,Not captured,Not captured,863949,020,00072,ARS-01-0052707,Beacon International,Not captured,Not captured,Not captured,,,,goldberger,herman,,02/10/1979,male,Not captured,Not captured,Not captured,Not captured,Not captured,Not captured,Not captured,Not captured,Not captured,Not captured,Not captured,Not captured,Not captured,,,Not captured,Not captured,Not captured,Not captured,19 rozhin rd,,monroe,New York,10950,,,Not captured,Not captured,hersh2253@gmail.com,Not captured,701940725,,Not captured,Not captured,Not captured,Not captured,Not captured,Not captured,
Not captured,Not captured,09/17/2019,Not captured,Not captured,863949,020,00072,ARS-01-0052706,Beacon International,Not captured,Not captured,Not captured,,,,werzberger,rosalie,,08/21/1952,female,Not captured,Not captured,Not captured,Not captured,Not captured,Not captured,Not captured,Not captured,Not captured,Not captured,Not captured,Not captured,Not captured,,,Not captured,Not captured,Not captured,Not captured,19 rozhin rd,,monroe,New York,10950,,,Not captured,Not captured,hersh2253@gmail.com,Not captured,701940724,,Not captured,Not captured,Not captured,Not captured,Not captured,Not captured,
Not captured,Not captured,09/17/2019,Not captured,Not captured,863949,020,00072,ARS-01-0052705,Beacon International,Not captured,Not captured,Not captured,,,,Pogue,Gwen,,10/05/1944,female,Not captured,Not captured,Not captured,Not captured,Not captured,Not captured,Not captured,Not captured,Not captured,Not captured,Not captured,Not captured,Not captured,,,Not captured,Not captured,Not captured,Not captured,757 Kaniksu Shores Rd,,Sandpoint,Idaho,83864,,,Not captured,Not captured,gcpogue@frontier.com,Not captured,701940723,,Not captured,Not captured,Not captured,Not captured,Not captured,Not captured,
Not captured,Not captured,09/17/2019,Not captured,Not captured,863949,020,00072,ARS-01-0052704,Beacon International,Not captured,Not captured,Not captured,,,,Black,Andrew,,04/15/1991,male,Not captured,Not captured,Not captured,Not captured,Not captured,Not captured,Not captured,Not captured,Not captured,Not captured,Not captured,Not captured,Not captured,,,Not captured,Not captured,Not captured,Not captured,303 9th street,,Carrollton,Kentucky,41008,,,Not captured,Not captured,andrew.black@nucor.com,Not captured,701940722,,Not captured,Not captured,Not captured,Not captured,Not captured,Not captured,
Not captured,Not captured,09/17/2019,Not captured,Not captured,863949,020,00072,ARS-01-0052703,Beacon International,Not captured,Not captured,Not captured,,,,Stohr,Petr,,10/03/1947,male,Not captured,Not captured,Not captured,Not captured,Not captured,Not captured,Not captured,Not captured,Not captured,Not captured,Not captured,Not captured,Not captured,,,Not captured,Not captured,Not captured,Not captured,6449 s. Van Gordon Str.,,Littleton,Colorado,80127,,,Not captured,Not captured,pstohr47@msn.com,Not captured,701940721,,Not captured,Not captured,Not captured,Not captured,Not captured,Not captured,
Not captured,Not captured,09/16/2019,Not captured,Not captured,863949,020,00072,ARS-01-0052700,Beacon International,Not captured,Not captured,Not captured,,,,Ueno,Aki,,09/21/1972,female,Not captured,Not captured,Not captured,Not captured,Not captured,Not captured,Not captured,Not captured,Not captured,Not captured,Not captured,Not captured,Not captured,,,Not captured,Not captured,Not captured,Not captured,1156 Hamilton Avenue,,Palo Alto,California,94301,,,Not captured,Not captured,akipawlowski@yahoo.com,Not captured,701940718,,Not captured,Not captured,Not captured,Not captured,Not captured,Not captured,
Not captured,Not captured,09/16/2019,Not captured,Not captured,863949,020,00072,ARS-02-0052697,Beacon America,Not captured,Not captured,Not captured,,,,Rajalekshmi,Vijayalekshmi,,12/27/1957,female,Not captured,Not captured,Not captured,Not captured,Not captured,Not captured,Not captured,Not captured,Not captured,Not captured,Not captured,Not captured,Not captured,Viswesh Sankaran,Son,Not captured,Not captured,Not captured,Not captured,2020 Nunes Dr,,San Jose,California,95131,408-597-4970,,Not captured,Not captured,viswesh.vichu@gmail.com,Not captured,701940715,,Not captured,Not captured,Not captured,Not captured,Not captured,Not captured,
Not captured,Not captured,09/16/2019,Not captured,Not captured,863949,020,00072,ARS-03-0052520,Essential America,Not captured,Not captured,Not captured,Passport(F4424796),,,Singh,Surender,,10/08/1981,male,Not captured,Not captured,Not captured,Not captured,Not captured,Not captured,Not captured,Not captured,Not captured,Not captured,Not captured,Not captured,Not captured,,,Not captured,Not captured,Not captured,Not captured,Vasundhra Sechr 25 #935,,na,Uttar Pradesh,617921969,0000000,,Not captured,Not captured,mainstreetins@msn.com,Not captured,701940375,,Not captured,Not captured,Not captured,Not captured,Not captured,Not captured,
Not captured,Not captured,09/16/2019,Not captured,Not captured,863949,020,00072,ARS-03-0052657,Essential America,Not captured,Not captured,Not captured,Passport(H7690166),,,Dacharaju,Srivasthava ,,11/22/1989,male,Not captured,Not captured,Not captured,Not captured,Not captured,Not captured,Not captured,Not captured,Not captured,Not captured,Not captured,Not captured,Not captured,,,Not captured,Not captured,Not captured,Not captured,H.no 231 Vemana colony,,Colony,,500050,4803306271,,Not captured,Not captured,vasu.srivasthav@gmail.com,Not captured,701940629,,Not captured,Not captured,Not captured,Not captured,Not captured,Not captured,
Not captured,Not captured,09/16/2019,Not captured,Not captured,863949,020,00072,ARS-01-0052691,Beacon International,Not captured,Not captured,Not captured,,,,Trangmar,Philip,R,06/24/1964,male,Not captured,Not captured,Not captured,Not captured,Not captured,Not captured,Not captured,Not captured,Not captured,Not captured,Not captured,Not captured,Not captured,,,Not captured,Not captured,Not captured,Not captured,Sea Salt,,Saline,,897133,,,Not captured,Not captured,benthemonkeyrock@hotmail.com,Not captured,701940686,,Not captured,Not captured,Not captured,Not captured,Not captured,Not captured,
Not captured,Not captured,09/16/2019,Not captured,Not captured,863949,020,00072,ARS-01-0052690,Beacon International,Not captured,Not captured,Not captured,Passport(K0388990),,,Tewelde,Helen,Habtegergish,01/17/1989,female,Not captured,Not captured,Not captured,Not captured,Not captured,Not captured,Not captured,Not captured,Not captured,Not captured,Not captured,Not captured,Not captured,,,Not captured,Not captured,Not captured,Not captured,denicapi12@gmail.com,,Asmara,Central (Maekel),5677,05448976546,05448876557,Not captured,Not captured,denicapi12@gmail.com,Not captured,701940685,,Not captured,Not captured,Not captured,Not captured,Not captured,Not captured,
Not captured,Not captured,09/17/2019,Not captured,Not captured,863949,020,00072,ARS-02-0052689,Beacon America,Not captured,Not captured,Not captured,Passport(H8634160),,,Kesiraju,Janaki Devi,,11/01/1950,female,Not captured,Not captured,Not captured,Not captured,Not captured,Not captured,Not captured,Not captured,Not captured,Not captured,Not captured,Not captured,Not captured,Laxminarasimha R Kesiraju,Son,Not captured,Not captured,Not captured,Not captured,1097 Hunterston Pl,,Cupertino,California,95014,4082507031,4085109464,Not captured,Not captured,lnrkesiraju@yahoo.com,Not captured,701940684,,Not captured,Not captured,Not captured,Not captured,Not captured,Not captured,
Not captured,Not captured,09/16/2019,Not captured,Not captured,863949,020,00072,ARS-01-0052684,Beacon International,Not captured,Not captured,Not captured,,,,James,Liam,,08/30/1997,male,Not captured,Not captured,Not captured,Not captured,Not captured,Not captured,Not captured,Not captured,Not captured,Not captured,Not captured,Not captured,Not captured,,,Not captured,Not captured,Not captured,Not captured,9 Upway,,Chalfont St Peter,,SL9 0AS,,,Not captured,Not captured,liamcarter97@gmail.com,Not captured,701940665,,Not captured,Not captured,Not captured,Not captured,Not captured,Not captured,
Not captured,Not captured,09/15/2019,Not captured,Not captured,863949,020,00072,ARS-01-0052682,Beacon International,Not captured,Not captured,Not captured,,,,Bhandari,Shiv,,02/06/1992,male,Not captured,Not captured,Not captured,Not captured,Not captured,Not captured,Not captured,Not captured,Not captured,Not captured,Not captured,Not captured,Not captured,,,Not captured,Not captured,Not captured,Not captured,321 124th PL NE,,Bellevue,Washington,98005,,,Not captured,Not captured,shivbhandari@gmail.com,Not captured,701940663,,Not captured,Not captured,Not captured,Not captured,Not captured,Not captured,
Not captured,Not captured,09/15/2019,Not captured,Not captured,863949,020,00072,ARS-01-0052681,Beacon International,Not captured,Not captured,Not captured,,,,Bhandari,Gauri,,07/27/1956,female,Not captured,Not captured,Not captured,Not captured,Not captured,Not captured,Not captured,Not captured,Not captured,Not captured,Not captured,Not captured,Not captured,,,Not captured,Not captured,Not captured,Not captured,321 124th PL NE,,Bellevue,Washington,98005,,,Not captured,Not captured,shivbhandari@gmail.com,Not captured,701940662,,Not captured,Not captured,Not captured,Not captured,Not captured,Not captured,
Not captured,Not captured,09/14/2019,Not captured,Not captured,863949,020,00072,ARS-02-0052675,Beacon America,Not captured,Not captured,Not captured,,,,moses,robert,w,09/24/1964,male,Not captured,Not captured,Not captured,Not captured,Not captured,Not captured,Not captured,Not captured,Not captured,Not captured,Not captured,Not captured,Not captured,,,Not captured,Not captured,Not captured,Not captured,22022 111 ave sw,,vashon,Washington,98070,,,Not captured,Not captured,netting63@gmail.com,Not captured,701940655,,Not captured,Not captured,Not captured,Not captured,Not captured,Not captured,