EE Transaction Type,Dependent Transaction Type,Effective Date,EE Signature,EE Signature Date,Control,Suffix,Account,Plan Number,Plan Name,Claim Office,Network ID Number,Customer Code,EE SSN,Dependent SSN,Dependent Relationship,Last Name,First Name,Middle Initial,DOB,Gender,Ethnicity,PCP/PCD,PCP/PCD Current Patient,Provider Cap Office Number,COB,Dep Student Indicator,Dep OOA Indicator,EE Prior Coverage Indicator,EE Late Entrant,EE Language Indicator,Hire Date,Earnings,Earnings Frequency,Beneficiary (Last Name First Name MI),Beneficiary Relationship,Continuation of Coverage Expiration Date,Continuation of Coverage Event Date,Continuation of Coverage Length of Coverage,Work Location Zip Code,Street Address Line 1,Street Address Line 2,City,State,Zip Code,Home Phone Number,Work Phone Number,Accept Code,Evidence Code,EE Email Address,Communication Disability Code,EE Alternate ID,Dep Alternate ID,Old Control,Old Suffix,Old Account,New Control,New Suffix,New Account,
Not captured,Not captured,09/11/2019,Not captured,Not captured,863949,020,00072,ARS-03-0052594,Essential America,Not captured,Not captured,Not captured,Passport(642368226),,,Evanson III,Richard,,03/07/2019,male,Not captured,Not captured,Not captured,Not captured,Not captured,Not captured,Not captured,Not captured,Not captured,Not captured,Not captured,Not captured,Not captured,,,Not captured,Not captured,Not captured,Not captured,Turtle Island,,Yasawa,Central,.,6798399524,,Not captured,Not captured,evanson.jr@gmail.com,Not captured,701940509,,Not captured,Not captured,Not captured,Not captured,Not captured,Not captured,
Not captured,Not captured,09/11/2019,Not captured,Not captured,863949,020,00072,ARS-01-0052635,Beacon International,Not captured,Not captured,Not captured,,,,Cohn,Shiya,,02/22/1998,male,Not captured,Not captured,Not captured,Not captured,Not captured,Not captured,Not captured,Not captured,Not captured,Not captured,Not captured,Not captured,Not captured,,,Not captured,Not captured,Not captured,Not captured,4 iron hill plaza #204,,Monroe,New York,10950,,,Not captured,Not captured,faymcon@yahoo.com,Not captured,701940580,,Not captured,Not captured,Not captured,Not captured,Not captured,Not captured,
Not captured,Not captured,09/11/2019,Not captured,Not captured,863949,020,00072,ARS-01-0052634,Beacon International,Not captured,Not captured,Not captured,,,,Barnett,Dononeil,A,06/24/1970,male,Not captured,Not captured,Not captured,Not captured,Not captured,Not captured,Not captured,Not captured,Not captured,Not captured,Not captured,Not captured,Not captured,,,Not captured,Not captured,Not captured,Not captured,5731 West McNab RD,,North Lauderdale,Florida,33068-4641,,,Not captured,Not captured,theresaw830@gmail.com,Not captured,701940579,,Not captured,Not captured,Not captured,Not captured,Not captured,Not captured,
Not captured,Not captured,09/11/2019,Not captured,Not captured,863949,020,00072,ARS-01-0052633,Beacon International,Not captured,Not captured,Not captured,,,,Williams,Theresa,R,08/30/1967,female,Not captured,Not captured,Not captured,Not captured,Not captured,Not captured,Not captured,Not captured,Not captured,Not captured,Not captured,Not captured,Not captured,,,Not captured,Not captured,Not captured,Not captured,5731 West McNab RD,,North Lauderdale,Florida,33068-4641,,,Not captured,Not captured,theresaw830@gmail.com,Not captured,701940578,,Not captured,Not captured,Not captured,Not captured,Not captured,Not captured,
Not captured,Not captured,09/11/2019,Not captured,Not captured,863949,020,00072,ARS-02-0052632,Beacon America,Not captured,Not captured,Not captured,,,,Jain,Parul,,08/26/1990,female,Not captured,Not captured,Not captured,Not captured,Not captured,Not captured,Not captured,Not captured,Not captured,Not captured,Not captured,Not captured,Not captured,,,Not captured,Not captured,Not captured,Not captured,30 Regent St Apt 606,,Jersey City,New Jersey,07302,,,Not captured,Not captured,adityarb88@gmail.com,Not captured,701940577,,Not captured,Not captured,Not captured,Not captured,Not captured,Not captured,
Not captured,Not captured,09/11/2019,Not captured,Not captured,863949,020,00072,ARS-02-0052631,Beacon America,Not captured,Not captured,Not captured,,,,Bhandari,Aditya,R,01/21/1988,male,Not captured,Not captured,Not captured,Not captured,Not captured,Not captured,Not captured,Not captured,Not captured,Not captured,Not captured,Not captured,Not captured,,,Not captured,Not captured,Not captured,Not captured,30 Regent St Apt 606,,Jersey City,New Jersey,07302,,,Not captured,Not captured,adityarb88@gmail.com,Not captured,701940576,,Not captured,Not captured,Not captured,Not captured,Not captured,Not captured,
Not captured,Not captured,09/11/2019,Not captured,Not captured,863949,020,00072,ARS-01-0052629,Beacon International,Not captured,Not captured,Not captured,,,,Joshi,Shriya,R,05/25/1995,female,Not captured,Not captured,Not captured,Not captured,Not captured,Not captured,Not captured,Not captured,Not captured,Not captured,Not captured,Not captured,Not captured,,,Not captured,Not captured,Not captured,Not captured,235 E 95th St. Apt 4C,,NEW YORK,New York,10128,,,Not captured,Not captured,sai.parepally@gmail.com,Not captured,701940563,,Not captured,Not captured,Not captured,Not captured,Not captured,Not captured,
Not captured,Not captured,09/11/2019,Not captured,Not captured,863949,020,00072,ARS-01-0052628,Beacon International,Not captured,Not captured,Not captured,,,,Parepally,Sai,,12/29/1992,male,Not captured,Not captured,Not captured,Not captured,Not captured,Not captured,Not captured,Not captured,Not captured,Not captured,Not captured,Not captured,Not captured,,,Not captured,Not captured,Not captured,Not captured,235 E 95th St. Apt 4C,,NEW YORK,New York,10128,,,Not captured,Not captured,sai.parepally@gmail.com,Not captured,701940562,,Not captured,Not captured,Not captured,Not captured,Not captured,Not captured,
Not captured,Not captured,09/11/2019,Not captured,Not captured,863949,020,00072,ARS-02-0052625,Beacon America,Not captured,Not captured,Not captured,,,,Frade,Gon&ccedil;alo,B,12/11/1987,male,Not captured,Not captured,Not captured,Not captured,Not captured,Not captured,Not captured,Not captured,Not captured,Not captured,Not captured,Not captured,Not captured,,,Not captured,Not captured,Not captured,Not captured,R.Oliveira Martins n&ordm;15 8&ordm;ESQ,,Amadora,,2700-618,,,Not captured,Not captured,goncalofrade08@gmail.com,Not captured,701940559,,Not captured,Not captured,Not captured,Not captured,Not captured,Not captured,
Not captured,Not captured,09/11/2019,Not captured,Not captured,863949,020,00072,ARS-01-0052623,Beacon International,Not captured,Not captured,Not captured,,,,Scarano,Patrick,M,04/21/1978,male,Not captured,Not captured,Not captured,Not captured,Not captured,Not captured,Not captured,Not captured,Not captured,Not captured,Not captured,Not captured,Not captured,,,Not captured,Not captured,Not captured,Not captured,308 S Lincoln St,,Denver,Colorado,80209,,,Not captured,Not captured,bound101@comcast.net,Not captured,701940556,,Not captured,Not captured,Not captured,Not captured,Not captured,Not captured,
Not captured,Not captured,09/11/2019,Not captured,Not captured,863949,020,00072,ARS-01-0052617,Beacon International,Not captured,Not captured,Not captured,,,,Gibbons,Mary,C,05/17/1996,female,Not captured,Not captured,Not captured,Not captured,Not captured,Not captured,Not captured,Not captured,Not captured,Not captured,Not captured,Not captured,Not captured,Wanda Gibbons,mother,Not captured,Not captured,Not captured,Not captured,15 Tanner Woods,,San Antonio,Texas,78248,210-425-3405,,Not captured,Not captured,mgibbons@gibmaric.com,Not captured,701940550,,Not captured,Not captured,Not captured,Not captured,Not captured,Not captured,
Not captured,Not captured,09/10/2019,Not captured,Not captured,863949,020,00072,ARS-02-0052613,Beacon America,Not captured,Not captured,Not captured,,,,Murphy,Melissa,,01/12/1980,female,Not captured,Not captured,Not captured,Not captured,Not captured,Not captured,Not captured,Not captured,Not captured,Not captured,Not captured,Not captured,Not captured,,,Not captured,Not captured,Not captured,Not captured,3217 Seedling Dr,,Redding,California,96001,,,Not captured,Not captured,melissajmurphy1@gmail.com,Not captured,701940542,,Not captured,Not captured,Not captured,Not captured,Not captured,Not captured,
Not captured,Not captured,09/10/2019,Not captured,Not captured,863949,020,00072,ARS-01-0052612,Beacon International,Not captured,Not captured,Not captured,,,,Warren,Doloris,S,04/04/1959,female,Not captured,Not captured,Not captured,Not captured,Not captured,Not captured,Not captured,Not captured,Not captured,Not captured,Not captured,Not captured,Not captured,,,Not captured,Not captured,Not captured,Not captured,5041 Cyrpess Links Blvd,,Elkton,Florida,32033,,,Not captured,Not captured,d.suzette.warren@gmail.com,Not captured,701940541,,Not captured,Not captured,Not captured,Not captured,Not captured,Not captured,
Not captured,Not captured,09/10/2019,Not captured,Not captured,863949,020,00072,ARS-02-0052606,Beacon America,Not captured,Not captured,Not captured,,,,Jones,Sara,L,09/09/1978,female,Not captured,Not captured,Not captured,Not captured,Not captured,Not captured,Not captured,Not captured,Not captured,Not captured,Not captured,Not captured,Not captured,,,Not captured,Not captured,Not captured,Not captured,Calle 34 lote 22 mza 33,,Playa del Carmen Solidaridad,,77710,,,Not captured,Not captured,sljones5@yahoo.com,Not captured,701940535,,Not captured,Not captured,Not captured,Not captured,Not captured,Not captured,
Not captured,Not captured,09/09/2019,Not captured,Not captured,863949,020,00072,ARS-04-0052297,Enhanced America,Not captured,Not captured,Not captured,Passport(C2567501),,,Phan,Van,,02/21/2003,female,Not captured,Not captured,Not captured,Not captured,Not captured,Not captured,Not captured,Not captured,Not captured,Not captured,Not captured,Not captured,Not captured,,,Not captured,Not captured,Not captured,Not captured,317 Bach bang St,,Hoce min,Binh Thuan,700000,8168822292,,Not captured,Not captured,huy.than3891@gmail.com,Not captured,701939868,,Not captured,Not captured,Not captured,Not captured,Not captured,Not captured,
Not captured,Not captured,09/09/2019,Not captured,Not captured,863949,020,00072,ARS-01-0052596,Beacon International,Not captured,Not captured,Not captured,,,,Tannous,Nicole,,09/29/1982,female,Not captured,Not captured,Not captured,Not captured,Not captured,Not captured,Not captured,Not captured,Not captured,Not captured,Not captured,Not captured,Not captured,,,Not captured,Not captured,Not captured,Not captured,4060 HUERFANO Ave. #122,,San Diego,California,92117,,,Not captured,Not captured,nicole.tannous@californiaprep.org,Not captured,701940511,,Not captured,Not captured,Not captured,Not captured,Not captured,Not captured,
Not captured,Not captured,09/09/2019,Not captured,Not captured,863949,020,00072,ARS-01-0052595,Beacon International,Not captured,Not captured,Not captured,,,,Myers,Moriah,,09/22/1987,female,Not captured,Not captured,Not captured,Not captured,Not captured,Not captured,Not captured,Not captured,Not captured,Not captured,Not captured,Not captured,Not captured,,,Not captured,Not captured,Not captured,Not captured,4060 HUERFANO Ave. #122,,San Diego,California,92117,,,Not captured,Not captured,nicole.tannous@californiaprep.org,Not captured,701940510,,Not captured,Not captured,Not captured,Not captured,Not captured,Not captured,
Not captured,Not captured,09/09/2019,Not captured,Not captured,863949,020,00072,ARS-01-0052593,Beacon International,Not captured,Not captured,Not captured,,,,Ferrer,Alessandra,R,08/12/1991,female,Not captured,Not captured,Not captured,Not captured,Not captured,Not captured,Not captured,Not captured,Not captured,Not captured,Not captured,Not captured,Not captured,,,Not captured,Not captured,Not captured,Not captured,Discovery Meinohama South,,Fukuoka,,819-0052,,,Not captured,Not captured,alessandra.ferrer8@yahoo.com,Not captured,701940501,,Not captured,Not captured,Not captured,Not captured,Not captured,Not captured,
Not captured,Not captured,09/09/2019,Not captured,Not captured,863949,020,00072,ARS-02-0052592,Beacon America,Not captured,Not captured,Not captured,,,,Julius,John,S,11/26/1986,male,Not captured,Not captured,Not captured,Not captured,Not captured,Not captured,Not captured,Not captured,Not captured,Not captured,Not captured,Not captured,Not captured,,,Not captured,Not captured,Not captured,Not captured,P.O. Box 3031,,Moshi,,0000,,,Not captured,Not captured,jojusayna@gmail.com,Not captured,701940500,,Not captured,Not captured,Not captured,Not captured,Not captured,Not captured,
Not captured,Not captured,09/09/2019,Not captured,Not captured,863949,020,00072,OVI-28-0052590,OverseasCare Visitors Insurance Plan,Not captured,Not captured,Not captured,Passport(T1462149),,,Bhulyan,Pushpa,,03/28/1927,female,Not captured,Not captured,Not captured,Not captured,Not captured,Not captured,Not captured,Not captured,Not captured,Not captured,Not captured,Not captured,Not captured,Pratishtha Gupta,Daughter,Not captured,Not captured,Not captured,Not captured,5817 W 100th Ter,,Overland Park,Kansas,66207,9134065357,,Not captured,Not captured,theguptas@att.net,Not captured,701940498,,Not captured,Not captured,Not captured,Not captured,Not captured,Not captured,
Not captured,Not captured,09/09/2019,Not captured,Not captured,863949,020,00072,ARS-01-0052589,Beacon International,Not captured,Not captured,Not captured,,,,Plante,Ianik,,10/16/1972,male,Not captured,Not captured,Not captured,Not captured,Not captured,Not captured,Not captured,Not captured,Not captured,Not captured,Not captured,Not captured,Not captured,,,Not captured,Not captured,Not captured,Not captured,13105 imperial shore dr,,Pearland,Texas,77584,,,Not captured,Not captured,IanikPlante@gmail.com,Not captured,701940497,,Not captured,Not captured,Not captured,Not captured,Not captured,Not captured,
Not captured,Not captured,09/09/2019,Not captured,Not captured,863949,020,00072,ARS-02-0052588,Beacon America,Not captured,Not captured,Not captured,,,,RAVIKUMAR,AKANKSHA,,11/23/2008,female,Not captured,Not captured,Not captured,Not captured,Not captured,Not captured,Not captured,Not captured,Not captured,Not captured,Not captured,Not captured,Not captured,Sharada Ramaiah,Mother,Not captured,Not captured,Not captured,Not captured,201 E Genesee Street,,Fayetteville,New York,13066,9014939147,,Not captured,Not captured,h.ravi.k@gmail.com,Not captured,701940496,,Not captured,Not captured,Not captured,Not captured,Not captured,Not captured,
Not captured,Not captured,09/09/2019,Not captured,Not captured,863949,020,00072,ARS-02-0052587,Beacon America,Not captured,Not captured,Not captured,,,,RAVIKUMAR,ADITHYA,,10/01/2004,male,Not captured,Not captured,Not captured,Not captured,Not captured,Not captured,Not captured,Not captured,Not captured,Not captured,Not captured,Not captured,Not captured,Sharada Ramaiah,Mother,Not captured,Not captured,Not captured,Not captured,201 E Genesee Street,,Fayetteville,New York,13066,9014939147,,Not captured,Not captured,h.ravi.k@gmail.com,Not captured,701940495,,Not captured,Not captured,Not captured,Not captured,Not captured,Not captured,
Not captured,Not captured,09/09/2019,Not captured,Not captured,863949,020,00072,ARS-02-0052586,Beacon America,Not captured,Not captured,Not captured,,,,SANTHEMAVATHUR PUTTASWAMAIAH,DEEPA,,03/29/1979,female,Not captured,Not captured,Not captured,Not captured,Not captured,Not captured,Not captured,Not captured,Not captured,Not captured,Not captured,Not captured,Not captured,Sharada Ramaiah,Mother,Not captured,Not captured,Not captured,Not captured,201 E Genesee Street,,Fayetteville,New York,13066,9014939147,,Not captured,Not captured,h.ravi.k@gmail.com,Not captured,701940494,,Not captured,Not captured,Not captured,Not captured,Not captured,Not captured,
Not captured,Not captured,09/09/2019,Not captured,Not captured,863949,020,00072,ARS-02-0052585,Beacon America,Not captured,Not captured,Not captured,Passport(Z4118598),,,HANUMAIAH,RAVIKUMAR,,03/24/1972,male,Not captured,Not captured,Not captured,Not captured,Not captured,Not captured,Not captured,Not captured,Not captured,Not captured,Not captured,Not captured,Not captured,Sharada Ramaiah,Mother,Not captured,Not captured,Not captured,Not captured,201 E Genesee Street,,Fayetteville,New York,13066,9014939147,,Not captured,Not captured,h.ravi.k@gmail.com,Not captured,701940493,,Not captured,Not captured,Not captured,Not captured,Not captured,Not captured,
Not captured,Not captured,09/08/2019,Not captured,Not captured,863949,020,00072,ARS-01-0052584,Beacon International,Not captured,Not captured,Not captured,,,,Giumarra,Marketa,M,03/08/1980,female,Not captured,Not captured,Not captured,Not captured,Not captured,Not captured,Not captured,Not captured,Not captured,Not captured,Not captured,Not captured,Not captured,,,Not captured,Not captured,Not captured,Not captured,1718 Esplanade #511,,Redondo Beach,California,90277,,,Not captured,Not captured,marketa@practicalmba.com,Not captured,701940492,,Not captured,Not captured,Not captured,Not captured,Not captured,Not captured,
Not captured,Not captured,09/09/2019,Not captured,Not captured,863949,020,00072,ARS-01-0052583,Beacon International,Not captured,Not captured,Not captured,,,,RAJOPADHYAYA,SUSMITA,,02/13/1993,female,Not captured,Not captured,Not captured,Not captured,Not captured,Not captured,Not captured,Not captured,Not captured,Not captured,Not captured,Not captured,Not captured,,,Not captured,Not captured,Not captured,Not captured,Kathmandu,,Kathmandu,,44605,,,Not captured,Not captured,yl.mohan.ghimire@gmail.com,Not captured,701940491,,Not captured,Not captured,Not captured,Not captured,Not captured,Not captured,
Not captured,Not captured,09/09/2019,Not captured,Not captured,863949,020,00072,ARS-01-0052582,Beacon International,Not captured,Not captured,Not captured,,,,LAMA,JANGMU,,05/06/1984,female,Not captured,Not captured,Not captured,Not captured,Not captured,Not captured,Not captured,Not captured,Not captured,Not captured,Not captured,Not captured,Not captured,,,Not captured,Not captured,Not captured,Not captured,Kathmandu,,Kathmandu,,44605,,,Not captured,Not captured,yl.mohan.ghimire@gmail.com,Not captured,701940490,,Not captured,Not captured,Not captured,Not captured,Not captured,Not captured,
Not captured,Not captured,09/09/2019,Not captured,Not captured,863949,020,00072,ARS-01-0052581,Beacon International,Not captured,Not captured,Not captured,,,,THAPA,NAVEENA,,03/28/1982,female,Not captured,Not captured,Not captured,Not captured,Not captured,Not captured,Not captured,Not captured,Not captured,Not captured,Not captured,Not captured,Not captured,,,Not captured,Not captured,Not captured,Not captured,Kathmandu,,Kathmandu,,44605,,,Not captured,Not captured,yl.mohan.ghimire@gmail.com,Not captured,701940489,,Not captured,Not captured,Not captured,Not captured,Not captured,Not captured,
Not captured,Not captured,09/09/2019,Not captured,Not captured,863949,020,00072,ARS-01-0052580,Beacon International,Not captured,Not captured,Not captured,,,,BHATTARAI BHUSAL,PRAGATI,,03/26/1991,female,Not captured,Not captured,Not captured,Not captured,Not captured,Not captured,Not captured,Not captured,Not captured,Not captured,Not captured,Not captured,Not captured,,,Not captured,Not captured,Not captured,Not captured,Kathmandu,,Kathmandu,,44605,,,Not captured,Not captured,yl.mohan.ghimire@gmail.com,Not captured,701940488,,Not captured,Not captured,Not captured,Not captured,Not captured,Not captured,
Not captured,Not captured,09/08/2019,Not captured,Not captured,863949,020,00072,ARS-01-0052579,Beacon International,Not captured,Not captured,Not captured,,,,Ng,Pui Fong,,06/21/1953,female,Not captured,Not captured,Not captured,Not captured,Not captured,Not captured,Not captured,Not captured,Not captured,Not captured,Not captured,Not captured,Not captured,,,Not captured,Not captured,Not captured,Not captured,216.5 6th St Unit 3,,Jersey City,New Jersey,07302,,,Not captured,Not captured,stephenmak729@yahoo.com,Not captured,701940487,,Not captured,Not captured,Not captured,Not captured,Not captured,Not captured,
Not captured,Not captured,09/07/2019,Not captured,Not captured,863949,020,00072,ARS-01-0052577,Beacon International,Not captured,Not captured,Not captured,,,,Garcia,Celia,,09/24/1991,female,Not captured,Not captured,Not captured,Not captured,Not captured,Not captured,Not captured,Not captured,Not captured,Not captured,Not captured,Not captured,Not captured,,,Not captured,Not captured,Not captured,Not captured,66-545 Kamehameha hwy,,Haleiwa,Hawaii,96712,,,Not captured,Not captured,cgarcia33753@gmail.com,Not captured,701940485,,Not captured,Not captured,Not captured,Not captured,Not captured,Not captured,
Not captured,Not captured,09/10/2019,Not captured,Not captured,863949,020,00072,ARS-02-0052576,Beacon America,Not captured,Not captured,Not captured,Passport(TB204843),,,Prevatt,Ian,L,06/14/1947,male,Not captured,Not captured,Not captured,Not captured,Not captured,Not captured,Not captured,Not captured,Not captured,Not captured,Not captured,Not captured,Not captured,Liselle Prevatt,Daughter,Not captured,Not captured,Not captured,Not captured,3 Fitt Street,,Port of Spain,00000,00000,8687532282,,Not captured,Not captured,liprevatt@gmail.com,Not captured,701940484,,Not captured,Not captured,Not captured,Not captured,Not captured,Not captured,
Not captured,Not captured,09/09/2019,Not captured,Not captured,863949,020,00072,ARS-02-0052575,Beacon America,Not captured,Not captured,Not captured,,,,Twisdale,Heather,M,08/13/1974,female,Not captured,Not captured,Not captured,Not captured,Not captured,Not captured,Not captured,Not captured,Not captured,Not captured,Not captured,Not captured,Not captured,Morgan Tanner,daughter,Not captured,Not captured,Not captured,Not captured,420 sawmill rd,,brighton,Tennessee,38011,9014751969,9015531483,Not captured,Not captured,kevin.twisdale@yahoo.com,Not captured,701940483,,Not captured,Not captured,Not captured,Not captured,Not captured,Not captured,
Not captured,Not captured,09/09/2019,Not captured,Not captured,863949,020,00072,ARS-02-0052574,Beacon America,Not captured,Not captured,Not captured,Passport(546088601),,,Twisdale,Kevin,J,09/30/1971,female,Not captured,Not captured,Not captured,Not captured,Not captured,Not captured,Not captured,Not captured,Not captured,Not captured,Not captured,Not captured,Not captured,Morgan Tanner,daughter,Not captured,Not captured,Not captured,Not captured,420 sawmill rd,,brighton,Tennessee,38011,9014751969,9015531483,Not captured,Not captured,kevin.twisdale@yahoo.com,Not captured,701940482,,Not captured,Not captured,Not captured,Not captured,Not captured,Not captured,
Not captured,Not captured,09/07/2019,Not captured,Not captured,863949,020,00072,ARS-02-0052571,Beacon America,Not captured,Not captured,Not captured,,,,Choudhuri,Arka Rai,,05/19/1992,male,Not captured,Not captured,Not captured,Not captured,Not captured,Not captured,Not captured,Not captured,Not captured,Not captured,Not captured,Not captured,Not captured,,,Not captured,Not captured,Not captured,Not captured,3100 Saint Paul Street,,Baltimore,Maryland,21218,,,Not captured,Not captured,arkarai.choudhuri@gmail.com,Not captured,701940479,,Not captured,Not captured,Not captured,Not captured,Not captured,Not captured,