EE Transaction Type,Dependent Transaction Type,Effective Date,EE Signature,EE Signature Date,Control,Suffix,Account,Plan Number,Plan Name,Claim Office,Network ID Number,Customer Code,EE SSN,Dependent SSN,Dependent Relationship,Last Name,First Name,Middle Initial,DOB,Gender,Ethnicity,PCP/PCD,PCP/PCD Current Patient,Provider Cap Office Number,COB,Dep Student Indicator,Dep OOA Indicator,EE Prior Coverage Indicator,EE Late Entrant,EE Language Indicator,Hire Date,Earnings,Earnings Frequency,Beneficiary (Last Name First Name MI),Beneficiary Relationship,Continuation of Coverage Expiration Date,Continuation of Coverage Event Date,Continuation of Coverage Length of Coverage,Work Location Zip Code,Street Address Line 1,Street Address Line 2,City,State,Zip Code,Home Phone Number,Work Phone Number,Accept Code,Evidence Code,EE Email Address,Communication Disability Code,EE Alternate ID,Dep Alternate ID,Old Control,Old Suffix,Old Account,New Control,New Suffix,New Account,
Not captured,Not captured,09/10/2019,Not captured,Not captured,863949,020,00072,ARS-02-0052613,Beacon America,Not captured,Not captured,Not captured,,,,Murphy,Melissa,,01/12/1980,female,Not captured,Not captured,Not captured,Not captured,Not captured,Not captured,Not captured,Not captured,Not captured,Not captured,Not captured,Not captured,Not captured,,,Not captured,Not captured,Not captured,Not captured,3217 Seedling Dr,,Redding,California,96001,,,Not captured,Not captured,melissajmurphy1@gmail.com,Not captured,701940542,,Not captured,Not captured,Not captured,Not captured,Not captured,Not captured,
Not captured,Not captured,09/10/2019,Not captured,Not captured,863949,020,00072,ARS-01-0052612,Beacon International,Not captured,Not captured,Not captured,,,,Warren,Doloris,S,04/04/1959,female,Not captured,Not captured,Not captured,Not captured,Not captured,Not captured,Not captured,Not captured,Not captured,Not captured,Not captured,Not captured,Not captured,,,Not captured,Not captured,Not captured,Not captured,5041 Cyrpess Links Blvd,,Elkton,Florida,32033,,,Not captured,Not captured,d.suzette.warren@gmail.com,Not captured,701940541,,Not captured,Not captured,Not captured,Not captured,Not captured,Not captured,
Not captured,Not captured,09/10/2019,Not captured,Not captured,863949,020,00072,ARS-02-0052606,Beacon America,Not captured,Not captured,Not captured,,,,Jones,Sara,L,09/09/1978,female,Not captured,Not captured,Not captured,Not captured,Not captured,Not captured,Not captured,Not captured,Not captured,Not captured,Not captured,Not captured,Not captured,,,Not captured,Not captured,Not captured,Not captured,Calle 34 lote 22 mza 33,,Playa del Carmen Solidaridad,,77710,,,Not captured,Not captured,sljones5@yahoo.com,Not captured,701940535,,Not captured,Not captured,Not captured,Not captured,Not captured,Not captured,
Not captured,Not captured,09/09/2019,Not captured,Not captured,863949,020,00072,ARS-04-0052297,Enhanced America,Not captured,Not captured,Not captured,Passport(C2567501),,,Phan,Van,,02/21/2003,female,Not captured,Not captured,Not captured,Not captured,Not captured,Not captured,Not captured,Not captured,Not captured,Not captured,Not captured,Not captured,Not captured,,,Not captured,Not captured,Not captured,Not captured,317 Bach bang St,,Hoce min,Binh Thuan,700000,8168822292,,Not captured,Not captured,huy.than3891@gmail.com,Not captured,701939868,,Not captured,Not captured,Not captured,Not captured,Not captured,Not captured,
Not captured,Not captured,09/09/2019,Not captured,Not captured,863949,020,00072,ARS-01-0052596,Beacon International,Not captured,Not captured,Not captured,,,,Tannous,Nicole,,09/29/1982,female,Not captured,Not captured,Not captured,Not captured,Not captured,Not captured,Not captured,Not captured,Not captured,Not captured,Not captured,Not captured,Not captured,,,Not captured,Not captured,Not captured,Not captured,4060 HUERFANO Ave. #122,,San Diego,California,92117,,,Not captured,Not captured,nicole.tannous@californiaprep.org,Not captured,701940511,,Not captured,Not captured,Not captured,Not captured,Not captured,Not captured,
Not captured,Not captured,09/09/2019,Not captured,Not captured,863949,020,00072,ARS-01-0052595,Beacon International,Not captured,Not captured,Not captured,,,,Myers,Moriah,,09/22/1987,female,Not captured,Not captured,Not captured,Not captured,Not captured,Not captured,Not captured,Not captured,Not captured,Not captured,Not captured,Not captured,Not captured,,,Not captured,Not captured,Not captured,Not captured,4060 HUERFANO Ave. #122,,San Diego,California,92117,,,Not captured,Not captured,nicole.tannous@californiaprep.org,Not captured,701940510,,Not captured,Not captured,Not captured,Not captured,Not captured,Not captured,
Not captured,Not captured,09/09/2019,Not captured,Not captured,863949,020,00072,ARS-01-0052593,Beacon International,Not captured,Not captured,Not captured,,,,Ferrer,Alessandra,R,08/12/1991,female,Not captured,Not captured,Not captured,Not captured,Not captured,Not captured,Not captured,Not captured,Not captured,Not captured,Not captured,Not captured,Not captured,,,Not captured,Not captured,Not captured,Not captured,Discovery Meinohama South,,Fukuoka,,819-0052,,,Not captured,Not captured,alessandra.ferrer8@yahoo.com,Not captured,701940501,,Not captured,Not captured,Not captured,Not captured,Not captured,Not captured,
Not captured,Not captured,09/09/2019,Not captured,Not captured,863949,020,00072,ARS-02-0052592,Beacon America,Not captured,Not captured,Not captured,,,,Julius,John,S,11/26/1986,male,Not captured,Not captured,Not captured,Not captured,Not captured,Not captured,Not captured,Not captured,Not captured,Not captured,Not captured,Not captured,Not captured,,,Not captured,Not captured,Not captured,Not captured,P.O. Box 3031,,Moshi,,0000,,,Not captured,Not captured,jojusayna@gmail.com,Not captured,701940500,,Not captured,Not captured,Not captured,Not captured,Not captured,Not captured,
Not captured,Not captured,09/09/2019,Not captured,Not captured,863949,020,00072,OVI-28-0052590,OverseasCare Visitors Insurance Plan,Not captured,Not captured,Not captured,Passport(T1462149),,,Bhulyan,Pushpa,,03/28/1927,female,Not captured,Not captured,Not captured,Not captured,Not captured,Not captured,Not captured,Not captured,Not captured,Not captured,Not captured,Not captured,Not captured,Pratishtha Gupta,Daughter,Not captured,Not captured,Not captured,Not captured,5817 W 100th Ter,,Overland Park,Kansas,66207,9134065357,,Not captured,Not captured,theguptas@att.net,Not captured,701940498,,Not captured,Not captured,Not captured,Not captured,Not captured,Not captured,
Not captured,Not captured,09/09/2019,Not captured,Not captured,863949,020,00072,ARS-01-0052589,Beacon International,Not captured,Not captured,Not captured,,,,Plante,Ianik,,10/16/1972,male,Not captured,Not captured,Not captured,Not captured,Not captured,Not captured,Not captured,Not captured,Not captured,Not captured,Not captured,Not captured,Not captured,,,Not captured,Not captured,Not captured,Not captured,13105 imperial shore dr,,Pearland,Texas,77584,,,Not captured,Not captured,IanikPlante@gmail.com,Not captured,701940497,,Not captured,Not captured,Not captured,Not captured,Not captured,Not captured,
Not captured,Not captured,09/09/2019,Not captured,Not captured,863949,020,00072,ARS-02-0052588,Beacon America,Not captured,Not captured,Not captured,,,,RAVIKUMAR,AKANKSHA,,11/23/2008,female,Not captured,Not captured,Not captured,Not captured,Not captured,Not captured,Not captured,Not captured,Not captured,Not captured,Not captured,Not captured,Not captured,Sharada Ramaiah,Mother,Not captured,Not captured,Not captured,Not captured,201 E Genesee Street,,Fayetteville,New York,13066,9014939147,,Not captured,Not captured,h.ravi.k@gmail.com,Not captured,701940496,,Not captured,Not captured,Not captured,Not captured,Not captured,Not captured,
Not captured,Not captured,09/09/2019,Not captured,Not captured,863949,020,00072,ARS-02-0052587,Beacon America,Not captured,Not captured,Not captured,,,,RAVIKUMAR,ADITHYA,,10/01/2004,male,Not captured,Not captured,Not captured,Not captured,Not captured,Not captured,Not captured,Not captured,Not captured,Not captured,Not captured,Not captured,Not captured,Sharada Ramaiah,Mother,Not captured,Not captured,Not captured,Not captured,201 E Genesee Street,,Fayetteville,New York,13066,9014939147,,Not captured,Not captured,h.ravi.k@gmail.com,Not captured,701940495,,Not captured,Not captured,Not captured,Not captured,Not captured,Not captured,
Not captured,Not captured,09/09/2019,Not captured,Not captured,863949,020,00072,ARS-02-0052586,Beacon America,Not captured,Not captured,Not captured,,,,SANTHEMAVATHUR PUTTASWAMAIAH,DEEPA,,03/29/1979,female,Not captured,Not captured,Not captured,Not captured,Not captured,Not captured,Not captured,Not captured,Not captured,Not captured,Not captured,Not captured,Not captured,Sharada Ramaiah,Mother,Not captured,Not captured,Not captured,Not captured,201 E Genesee Street,,Fayetteville,New York,13066,9014939147,,Not captured,Not captured,h.ravi.k@gmail.com,Not captured,701940494,,Not captured,Not captured,Not captured,Not captured,Not captured,Not captured,
Not captured,Not captured,09/09/2019,Not captured,Not captured,863949,020,00072,ARS-02-0052585,Beacon America,Not captured,Not captured,Not captured,Passport(Z4118598),,,HANUMAIAH,RAVIKUMAR,,03/24/1972,male,Not captured,Not captured,Not captured,Not captured,Not captured,Not captured,Not captured,Not captured,Not captured,Not captured,Not captured,Not captured,Not captured,Sharada Ramaiah,Mother,Not captured,Not captured,Not captured,Not captured,201 E Genesee Street,,Fayetteville,New York,13066,9014939147,,Not captured,Not captured,h.ravi.k@gmail.com,Not captured,701940493,,Not captured,Not captured,Not captured,Not captured,Not captured,Not captured,
Not captured,Not captured,09/08/2019,Not captured,Not captured,863949,020,00072,ARS-01-0052584,Beacon International,Not captured,Not captured,Not captured,,,,Giumarra,Marketa,M,03/08/1980,female,Not captured,Not captured,Not captured,Not captured,Not captured,Not captured,Not captured,Not captured,Not captured,Not captured,Not captured,Not captured,Not captured,,,Not captured,Not captured,Not captured,Not captured,1718 Esplanade #511,,Redondo Beach,California,90277,,,Not captured,Not captured,marketa@practicalmba.com,Not captured,701940492,,Not captured,Not captured,Not captured,Not captured,Not captured,Not captured,
Not captured,Not captured,09/09/2019,Not captured,Not captured,863949,020,00072,ARS-01-0052583,Beacon International,Not captured,Not captured,Not captured,,,,RAJOPADHYAYA,SUSMITA,,02/13/1993,female,Not captured,Not captured,Not captured,Not captured,Not captured,Not captured,Not captured,Not captured,Not captured,Not captured,Not captured,Not captured,Not captured,,,Not captured,Not captured,Not captured,Not captured,Kathmandu,,Kathmandu,,44605,,,Not captured,Not captured,yl.mohan.ghimire@gmail.com,Not captured,701940491,,Not captured,Not captured,Not captured,Not captured,Not captured,Not captured,
Not captured,Not captured,09/09/2019,Not captured,Not captured,863949,020,00072,ARS-01-0052582,Beacon International,Not captured,Not captured,Not captured,,,,LAMA,JANGMU,,05/06/1984,female,Not captured,Not captured,Not captured,Not captured,Not captured,Not captured,Not captured,Not captured,Not captured,Not captured,Not captured,Not captured,Not captured,,,Not captured,Not captured,Not captured,Not captured,Kathmandu,,Kathmandu,,44605,,,Not captured,Not captured,yl.mohan.ghimire@gmail.com,Not captured,701940490,,Not captured,Not captured,Not captured,Not captured,Not captured,Not captured,
Not captured,Not captured,09/09/2019,Not captured,Not captured,863949,020,00072,ARS-01-0052581,Beacon International,Not captured,Not captured,Not captured,,,,THAPA,NAVEENA,,03/28/1982,female,Not captured,Not captured,Not captured,Not captured,Not captured,Not captured,Not captured,Not captured,Not captured,Not captured,Not captured,Not captured,Not captured,,,Not captured,Not captured,Not captured,Not captured,Kathmandu,,Kathmandu,,44605,,,Not captured,Not captured,yl.mohan.ghimire@gmail.com,Not captured,701940489,,Not captured,Not captured,Not captured,Not captured,Not captured,Not captured,
Not captured,Not captured,09/09/2019,Not captured,Not captured,863949,020,00072,ARS-01-0052580,Beacon International,Not captured,Not captured,Not captured,,,,BHATTARAI BHUSAL,PRAGATI,,03/26/1991,female,Not captured,Not captured,Not captured,Not captured,Not captured,Not captured,Not captured,Not captured,Not captured,Not captured,Not captured,Not captured,Not captured,,,Not captured,Not captured,Not captured,Not captured,Kathmandu,,Kathmandu,,44605,,,Not captured,Not captured,yl.mohan.ghimire@gmail.com,Not captured,701940488,,Not captured,Not captured,Not captured,Not captured,Not captured,Not captured,
Not captured,Not captured,09/08/2019,Not captured,Not captured,863949,020,00072,ARS-01-0052579,Beacon International,Not captured,Not captured,Not captured,,,,Ng,Pui Fong,,06/21/1953,female,Not captured,Not captured,Not captured,Not captured,Not captured,Not captured,Not captured,Not captured,Not captured,Not captured,Not captured,Not captured,Not captured,,,Not captured,Not captured,Not captured,Not captured,216.5 6th St Unit 3,,Jersey City,New Jersey,07302,,,Not captured,Not captured,stephenmak729@yahoo.com,Not captured,701940487,,Not captured,Not captured,Not captured,Not captured,Not captured,Not captured,
Not captured,Not captured,09/07/2019,Not captured,Not captured,863949,020,00072,ARS-01-0052577,Beacon International,Not captured,Not captured,Not captured,,,,Garcia,Celia,,09/24/1991,female,Not captured,Not captured,Not captured,Not captured,Not captured,Not captured,Not captured,Not captured,Not captured,Not captured,Not captured,Not captured,Not captured,,,Not captured,Not captured,Not captured,Not captured,66-545 Kamehameha hwy,,Haleiwa,Hawaii,96712,,,Not captured,Not captured,cgarcia33753@gmail.com,Not captured,701940485,,Not captured,Not captured,Not captured,Not captured,Not captured,Not captured,
Not captured,Not captured,09/10/2019,Not captured,Not captured,863949,020,00072,ARS-02-0052576,Beacon America,Not captured,Not captured,Not captured,Passport(TB204843),,,Prevatt,Ian,L,06/14/1947,male,Not captured,Not captured,Not captured,Not captured,Not captured,Not captured,Not captured,Not captured,Not captured,Not captured,Not captured,Not captured,Not captured,Liselle Prevatt,Daughter,Not captured,Not captured,Not captured,Not captured,3 Fitt Street,,Port of Spain,00000,00000,8687532282,,Not captured,Not captured,liprevatt@gmail.com,Not captured,701940484,,Not captured,Not captured,Not captured,Not captured,Not captured,Not captured,
Not captured,Not captured,09/09/2019,Not captured,Not captured,863949,020,00072,ARS-02-0052575,Beacon America,Not captured,Not captured,Not captured,,,,Twisdale,Heather,M,08/13/1974,female,Not captured,Not captured,Not captured,Not captured,Not captured,Not captured,Not captured,Not captured,Not captured,Not captured,Not captured,Not captured,Not captured,Morgan Tanner,daughter,Not captured,Not captured,Not captured,Not captured,420 sawmill rd,,brighton,Tennessee,38011,9014751969,9015531483,Not captured,Not captured,kevin.twisdale@yahoo.com,Not captured,701940483,,Not captured,Not captured,Not captured,Not captured,Not captured,Not captured,
Not captured,Not captured,09/09/2019,Not captured,Not captured,863949,020,00072,ARS-02-0052574,Beacon America,Not captured,Not captured,Not captured,Passport(546088601),,,Twisdale,Kevin,J,09/30/1971,female,Not captured,Not captured,Not captured,Not captured,Not captured,Not captured,Not captured,Not captured,Not captured,Not captured,Not captured,Not captured,Not captured,Morgan Tanner,daughter,Not captured,Not captured,Not captured,Not captured,420 sawmill rd,,brighton,Tennessee,38011,9014751969,9015531483,Not captured,Not captured,kevin.twisdale@yahoo.com,Not captured,701940482,,Not captured,Not captured,Not captured,Not captured,Not captured,Not captured,
Not captured,Not captured,09/07/2019,Not captured,Not captured,863949,020,00072,ARS-02-0052571,Beacon America,Not captured,Not captured,Not captured,,,,Choudhuri,Arka Rai,,05/19/1992,male,Not captured,Not captured,Not captured,Not captured,Not captured,Not captured,Not captured,Not captured,Not captured,Not captured,Not captured,Not captured,Not captured,,,Not captured,Not captured,Not captured,Not captured,3100 Saint Paul Street,,Baltimore,Maryland,21218,,,Not captured,Not captured,arkarai.choudhuri@gmail.com,Not captured,701940479,,Not captured,Not captured,Not captured,Not captured,Not captured,Not captured,
Not captured,Not captured,09/08/2019,Not captured,Not captured,863949,020,00072,OVI-28-0052570,OverseasCare Visitors Insurance Plan,Not captured,Not captured,Not captured,Passport(GL483585),,,Cho,Isaac,Matthew,06/13/2002,male,Not captured,Not captured,Not captured,Not captured,Not captured,Not captured,Not captured,Not captured,Not captured,Not captured,Not captured,Not captured,Not captured,Isaac Matthew Cho,son,Not captured,Not captured,Not captured,Not captured,3-2369 Ogilvie Road,,Ottawa/Ontario,Ontario,K1J7N4,5872252815,,Not captured,Not captured,greenapple6655@gmail.com,Not captured,701940478,,Not captured,Not captured,Not captured,Not captured,Not captured,Not captured,
Not captured,Not captured,09/08/2019,Not captured,Not captured,863949,020,00072,OVI-28-0052569,OverseasCare Visitors Insurance Plan,Not captured,Not captured,Not captured,Passport(GL483585),,,Wong,Michelle,,07/05/1972,female,Not captured,Not captured,Not captured,Not captured,Not captured,Not captured,Not captured,Not captured,Not captured,Not captured,Not captured,Not captured,Not captured,Isaac Matthew Cho,son,Not captured,Not captured,Not captured,Not captured,3-2369 Ogilvie Road,,Ottawa/Ontario,Ontario,K1J7N4,5872252815,,Not captured,Not captured,greenapple6655@gmail.com,Not captured,701940477,,Not captured,Not captured,Not captured,Not captured,Not captured,Not captured,
Not captured,Not captured,09/07/2019,Not captured,Not captured,863949,020,00072,ARS-01-0052567,Beacon International,Not captured,Not captured,Not captured,,,,Parkin Caston,Deborah,L,04/03/1966,female,Not captured,Not captured,Not captured,Not captured,Not captured,Not captured,Not captured,Not captured,Not captured,Not captured,Not captured,Not captured,Not captured,,,Not captured,Not captured,Not captured,Not captured,152 Pythian Ave,,Hawthorne,New York,10532,,,Not captured,Not captured,debcaston@gmail.com,Not captured,701940475,,Not captured,Not captured,Not captured,Not captured,Not captured,Not captured,
Not captured,Not captured,09/08/2019,Not captured,Not captured,863949,020,00072,ARS-01-0052563,Beacon International,Not captured,Not captured,Not captured,,,,Schwartz,Moses,,09/17/1968,male,Not captured,Not captured,Not captured,Not captured,Not captured,Not captured,Not captured,Not captured,Not captured,Not captured,Not captured,Not captured,Not captured,,,Not captured,Not captured,Not captured,Not captured,685 River Avenue,,Lakewood,New Jersey,08701,,,Not captured,Not captured,tovak@tendertouch.com,Not captured,701940464,,Not captured,Not captured,Not captured,Not captured,Not captured,Not captured,
Not captured,Not captured,09/10/2019,Not captured,Not captured,863949,020,00072,OVI-28-0052546,OverseasCare Visitors Insurance Plan,Not captured,Not captured,Not captured,Passport(M0653432),,,POTHAPU,PRASANNA,,03/25/1960,female,Not captured,Not captured,Not captured,Not captured,Not captured,Not captured,Not captured,Not captured,Not captured,Not captured,Not captured,Not captured,Not captured,,,Not captured,Not captured,Not captured,Not captured,1072 DIAMOND DOVE LN,,APEX,North Carolina,27502,2489543222,,Not captured,Not captured,LIVISHOPPING@GMAIL.COM,Not captured,701940414,,Not captured,Not captured,Not captured,Not captured,Not captured,Not captured,
Not captured,Not captured,09/10/2019,Not captured,Not captured,863949,020,00072,OVI-28-0052545,OverseasCare Visitors Insurance Plan,Not captured,Not captured,Not captured,Passport(M0653432),,,POTHAPU,RAM MOHAN REDDY,,11/01/1955,male,Not captured,Not captured,Not captured,Not captured,Not captured,Not captured,Not captured,Not captured,Not captured,Not captured,Not captured,Not captured,Not captured,,,Not captured,Not captured,Not captured,Not captured,1072 DIAMOND DOVE LN,,APEX,North Carolina,27502,2489543222,,Not captured,Not captured,LIVISHOPPING@GMAIL.COM,Not captured,701940413,,Not captured,Not captured,Not captured,Not captured,Not captured,Not captured,
Not captured,Not captured,09/08/2019,Not captured,Not captured,863949,020,00072,ARS-01-0052544,Beacon International,Not captured,Not captured,Not captured,,,,Schulman,Batsheve,,12/17/2000,female,Not captured,Not captured,Not captured,Not captured,Not captured,Not captured,Not captured,Not captured,Not captured,Not captured,Not captured,Not captured,Not captured,,,Not captured,Not captured,Not captured,Not captured,215 Howard Ave,,Passaic,New Jersey,07055,862-668-8551,,Not captured,Not captured,aschulmaneliz@gmail.com,Not captured,701940412,,Not captured,Not captured,Not captured,Not captured,Not captured,Not captured,
Not captured,Not captured,09/09/2019,Not captured,Not captured,863949,020,00072,ARS-02-0052530,Beacon America,Not captured,Not captured,Not captured,Passport(na),,,Torres Roncancio,Luis Edilson,,07/01/1982,male,Not captured,Not captured,Not captured,Not captured,Not captured,Not captured,Not captured,Not captured,Not captured,Not captured,Not captured,Not captured,Not captured,estate,na,Not captured,Not captured,Not captured,Not captured,National Center for State Courts,,Bogota,Distrito Capltal de Santa Fe de Bogot&atilde;,na,5714898640 114,,Not captured,Not captured,yrodriguez@ncsc.co,Not captured,701940390,,Not captured,Not captured,Not captured,Not captured,Not captured,Not captured,
Not captured,Not captured,09/07/2019,Not captured,Not captured,863949,020,00072,ARS-02-0052525,Beacon America,Not captured,Not captured,Not captured,Passport(G1583055),,,Boateng,Charles,,12/07/1965,male,Not captured,Not captured,Not captured,Not captured,Not captured,Not captured,Not captured,Not captured,Not captured,Not captured,Not captured,Not captured,Not captured,,,Not captured,Not captured,Not captured,Not captured,12647 Olive Boulevard,,St Louis,Missouri,63141,3147541304,,Not captured,Not captured,edemerit@soy.org,Not captured,701940382,,Not captured,Not captured,Not captured,Not captured,Not captured,Not captured,
Not captured,Not captured,09/10/2019,Not captured,Not captured,863949,020,00072,OVI-28-0052519,OverseasCare Visitors Insurance Plan,Not captured,Not captured,Not captured,Passport(L3535191),,,Bangalore Ramakrishna,Uma ,,04/24/1960,female,Not captured,Not captured,Not captured,Not captured,Not captured,Not captured,Not captured,Not captured,Not captured,Not captured,Not captured,Not captured,Not captured,Prathima Pavan,Daughter ,Not captured,Not captured,Not captured,Not captured,2190 Mindy Lane,,Cumming,Georgia,30041,4708481349,,Not captured,Not captured,pavan.vasist@gmail.com,Not captured,701940374,,Not captured,Not captured,Not captured,Not captured,Not captured,Not captured,
Not captured,Not captured,09/10/2019,Not captured,Not captured,863949,020,00072,OVI-28-0052518,OverseasCare Visitors Insurance Plan,Not captured,Not captured,Not captured,Passport(L3535191),,,Bangalore Sathyanarayan Rao,Ravindra ,,04/02/1954,male,Not captured,Not captured,Not captured,Not captured,Not captured,Not captured,Not captured,Not captured,Not captured,Not captured,Not captured,Not captured,Not captured,Prathima Pavan,Daughter ,Not captured,Not captured,Not captured,Not captured,2190 Mindy Lane,,Cumming,Georgia,30041,4708481349,,Not captured,Not captured,pavan.vasist@gmail.com,Not captured,701940373,,Not captured,Not captured,Not captured,Not captured,Not captured,Not captured,