EE Transaction Type,Dependent Transaction Type,Effective Date,EE Signature,EE Signature Date,Control,Suffix,Account,Plan Number,Plan Name,Claim Office,Network ID Number,Customer Code,EE SSN,Dependent SSN,Dependent Relationship,Last Name,First Name,Middle Initial,DOB,Gender,Ethnicity,PCP/PCD,PCP/PCD Current Patient,Provider Cap Office Number,COB,Dep Student Indicator,Dep OOA Indicator,EE Prior Coverage Indicator,EE Late Entrant,EE Language Indicator,Hire Date,Earnings,Earnings Frequency,Beneficiary (Last Name First Name MI),Beneficiary Relationship,Continuation of Coverage Expiration Date,Continuation of Coverage Event Date,Continuation of Coverage Length of Coverage,Work Location Zip Code,Street Address Line 1,Street Address Line 2,City,State,Zip Code,Home Phone Number,Work Phone Number,Accept Code,Evidence Code,EE Email Address,Communication Disability Code,EE Alternate ID,Dep Alternate ID,Old Control,Old Suffix,Old Account,New Control,New Suffix,New Account,
Not captured,Not captured,09/06/2019,Not captured,Not captured,863949,020,00072,ARS-03-0052626,Essential International,Not captured,Not captured,Not captured,Passport(P0161181B),,,Ramirez,Ruth,,08/27/2018,female,Not captured,Not captured,Not captured,Not captured,Not captured,Not captured,Not captured,Not captured,Not captured,Not captured,Not captured,Not captured,Not captured,,,Not captured,Not captured,Not captured,Not captured,310 NE Arlington Cr.,,Lees Summit,Missouri,64063,8165075517,,Not captured,Not captured,service@azimuthrisk.com,Not captured,701940560,,Not captured,Not captured,Not captured,Not captured,Not captured,Not captured,
Not captured,Not captured,09/06/2019,Not captured,Not captured,863949,020,00072,ARS-02-0052566,Beacon America,Not captured,Not captured,Not captured,Passport(P4545216),,,Karrey,Bhagyalatha,,01/01/1964,male,Not captured,Not captured,Not captured,Not captured,Not captured,Not captured,Not captured,Not captured,Not captured,Not captured,Not captured,Not captured,Not captured,Prasanna Lakshmi Karrey,Daughter,Not captured,Not captured,Not captured,Not captured,132 Newyork St,,Redlands,California,92373,5133191740,,Not captured,Not captured,kapala.saiprasad@gmail.com,Not captured,701940474,,Not captured,Not captured,Not captured,Not captured,Not captured,Not captured,
Not captured,Not captured,09/06/2019,Not captured,Not captured,863949,020,00072,ARS-01-0052564,Beacon International,Not captured,Not captured,Not captured,,,,Bodenstein,Daniel,,05/26/1988,male,Not captured,Not captured,Not captured,Not captured,Not captured,Not captured,Not captured,Not captured,Not captured,Not captured,Not captured,Not captured,Not captured,,,Not captured,Not captured,Not captured,Not captured,12771 Caswell Ave,,Los Angeles,California,90066,,,Not captured,Not captured,dbodenstein@gmail.com,Not captured,701940465,,Not captured,Not captured,Not captured,Not captured,Not captured,Not captured,
Not captured,Not captured,09/06/2019,Not captured,Not captured,863949,020,00072,ARS-01-0052561,Beacon International,Not captured,Not captured,Not captured,Passport(AO555726),,,Greiffenstein Restrepo,Tomas,,09/09/1993,male,Not captured,Not captured,Not captured,Not captured,Not captured,Not captured,Not captured,Not captured,Not captured,Not captured,Not captured,Not captured,Not captured,Francisco Guillermo Greiffenstein,Padre,Not captured,Not captured,Not captured,Not captured,carrera 27 N.13-16,,bogota,Distrito Capltal de Santa Fe de Bogot&atilde;,00000,3511170,,Not captured,Not captured,greiffenstein09@gmail.com,Not captured,701940443,,Not captured,Not captured,Not captured,Not captured,Not captured,Not captured,
Not captured,Not captured,09/06/2019,Not captured,Not captured,863949,020,00072,OVI-28-0052560,OverseasCare Visitors Insurance Plan,Not captured,Not captured,Not captured,Passport(M4677307),,,Rayaghada,Rajeswaramma,,07/01/1949,female,Not captured,Not captured,Not captured,Not captured,Not captured,Not captured,Not captured,Not captured,Not captured,Not captured,Not captured,Not captured,Not captured,Harshavardhan Kuppili,Son,Not captured,Not captured,Not captured,Not captured,207 Cog Wheel Trl,,Delaware,Ohio,43015,7135919111,,Not captured,Not captured,harshakuppili@yahoo.com,Not captured,701940442,,Not captured,Not captured,Not captured,Not captured,Not captured,Not captured,
Not captured,Not captured,09/06/2019,Not captured,Not captured,863949,020,00072,OVI-28-0052559,OverseasCare Visitors Insurance Plan,Not captured,Not captured,Not captured,Passport(M4677307),,,Kuppili,Rama Rao,,07/15/1958,male,Not captured,Not captured,Not captured,Not captured,Not captured,Not captured,Not captured,Not captured,Not captured,Not captured,Not captured,Not captured,Not captured,Harshavardhan Kuppili,Son,Not captured,Not captured,Not captured,Not captured,207 Cog Wheel Trl,,Delaware,Ohio,43015,7135919111,,Not captured,Not captured,harshakuppili@yahoo.com,Not captured,701940441,,Not captured,Not captured,Not captured,Not captured,Not captured,Not captured,
Not captured,Not captured,09/06/2019,Not captured,Not captured,863949,020,00072,ARS-01-0052558,Beacon International,Not captured,Not captured,Not captured,,,,Sargent,Summer,H,12/07/1998,female,Not captured,Not captured,Not captured,Not captured,Not captured,Not captured,Not captured,Not captured,Not captured,Not captured,Not captured,Not captured,Not captured,,,Not captured,Not captured,Not captured,Not captured,474 Marygrove Rd,,Claremont,California,91711,,,Not captured,Not captured,summer.sargent@icloud.com,Not captured,701940440,,Not captured,Not captured,Not captured,Not captured,Not captured,Not captured,
Not captured,Not captured,09/06/2019,Not captured,Not captured,863949,020,00072,ARS-01-0052557,Beacon International,Not captured,Not captured,Not captured,,,,Hernandez-Payne,adrian,A,09/13/1993,male,Not captured,Not captured,Not captured,Not captured,Not captured,Not captured,Not captured,Not captured,Not captured,Not captured,Not captured,Not captured,Not captured,,,Not captured,Not captured,Not captured,Not captured,650 Southwest Meadow Drive 117,,Beaverton,Oregon,97006,,,Not captured,Not captured,adrian.hdz.p@gmail.com,Not captured,701940439,,Not captured,Not captured,Not captured,Not captured,Not captured,Not captured,
Not captured,Not captured,09/06/2019,Not captured,Not captured,863949,020,00072,ARS-01-0052556,Beacon International,Not captured,Not captured,Not captured,,,,Payne,Jennifer,O,03/08/1966,female,Not captured,Not captured,Not captured,Not captured,Not captured,Not captured,Not captured,Not captured,Not captured,Not captured,Not captured,Not captured,Not captured,,,Not captured,Not captured,Not captured,Not captured,650 SW Meadow Dr,,Beaverton,Oregon,97006,,,Not captured,Not captured,Jenniferkimchi2000@gmail.com,Not captured,701940438,,Not captured,Not captured,Not captured,Not captured,Not captured,Not captured,
Not captured,Not captured,09/06/2019,Not captured,Not captured,863949,020,00072,ARS-01-0052555,Beacon International,Not captured,Not captured,Not captured,,,,Juni,Nechama,,03/28/1990,female,Not captured,Not captured,Not captured,Not captured,Not captured,Not captured,Not captured,Not captured,Not captured,Not captured,Not captured,Not captured,Not captured,,,Not captured,Not captured,Not captured,Not captured,160 8th Street,,Providence,Rhode Island,02906,,,Not captured,Not captured,cyagod@gmail.com,Not captured,701940437,,Not captured,Not captured,Not captured,Not captured,Not captured,Not captured,
Not captured,Not captured,09/05/2019,Not captured,Not captured,863949,020,00072,ARS-01-0052551,Beacon International,Not captured,Not captured,Not captured,,,,Zurlinden,Donald,B,12/29/1953,male,Not captured,Not captured,Not captured,Not captured,Not captured,Not captured,Not captured,Not captured,Not captured,Not captured,Not captured,Not captured,Not captured,,,Not captured,Not captured,Not captured,Not captured,1285 Camino Manadero,,Santa Barbara,California,93111,,,Not captured,Not captured,nzurlinden@verizon.net,Not captured,701940419,,Not captured,Not captured,Not captured,Not captured,Not captured,Not captured,
Not captured,Not captured,09/05/2019,Not captured,Not captured,863949,020,00072,ARS-01-0052550,Beacon International,Not captured,Not captured,Not captured,,,,Zurlinden,Natalie,L,12/21/1955,female,Not captured,Not captured,Not captured,Not captured,Not captured,Not captured,Not captured,Not captured,Not captured,Not captured,Not captured,Not captured,Not captured,,,Not captured,Not captured,Not captured,Not captured,1285 Camino Manadero,,Santa Barbara,California,93111,,,Not captured,Not captured,nzurlinden@verizon.net,Not captured,701940418,,Not captured,Not captured,Not captured,Not captured,Not captured,Not captured,
Not captured,Not captured,09/05/2019,Not captured,Not captured,863949,020,00072,ARS-01-0052549,Beacon International,Not captured,Not captured,Not captured,,,,Zurlinden,Nickolas,W,09/08/1994,male,Not captured,Not captured,Not captured,Not captured,Not captured,Not captured,Not captured,Not captured,Not captured,Not captured,Not captured,Not captured,Not captured,,,Not captured,Not captured,Not captured,Not captured,1285 Camino Manadero,,Santa Barbara,California,93111,,,Not captured,Not captured,nzurlinden@verizon.net,Not captured,701940417,,Not captured,Not captured,Not captured,Not captured,Not captured,Not captured,
Not captured,Not captured,09/05/2019,Not captured,Not captured,863949,020,00072,ARS-01-0052548,Beacon International,Not captured,Not captured,Not captured,,,,Zurlinden,Jennifer,N,12/24/1997,female,Not captured,Not captured,Not captured,Not captured,Not captured,Not captured,Not captured,Not captured,Not captured,Not captured,Not captured,Not captured,Not captured,,,Not captured,Not captured,Not captured,Not captured,1285 Camino Manadero,,Santa Barbara,California,93111,,,Not captured,Not captured,nzurlinden@verizon.net,Not captured,701940416,,Not captured,Not captured,Not captured,Not captured,Not captured,Not captured,
Not captured,Not captured,09/06/2019,Not captured,Not captured,863949,020,00072,ARS-03-0052531,Essential International,Not captured,Not captured,Not captured,Passport(P4648703A),,,Ramirez,Rex,Marcelino,06/18/1989,male,Not captured,Not captured,Not captured,Not captured,Not captured,Not captured,Not captured,Not captured,Not captured,Not captured,Not captured,Not captured,Not captured,,,Not captured,Not captured,Not captured,Not captured,310 NE Arlington Circle,,Lees Summit,Missouri,64063,8165075517,,Not captured,Not captured,mikerbergen@gmail.com,Not captured,701940393,,Not captured,Not captured,Not captured,Not captured,Not captured,Not captured,
Not captured,Not captured,09/06/2019,Not captured,Not captured,863949,020,00072,ARS-03-0052531,Essential International,Not captured,Not captured,Not captured,,Passport(P8747329A),Spouse,Ramirez,Marilou,Arustia,07/11/1988,female,Not captured,Not captured,Not captured,Not captured,Not captured,Not captured,Not captured,Not captured,Not captured,Not captured,Not captured,Not captured,Not captured,,,Not captured,Not captured,Not captured,Not captured,310 NE Arlington Circle,,Lees Summit,Missouri,64063,8165075517,,Not captured,Not captured,mikerbergen@gmail.com,Not captured,,701940394,Not captured,Not captured,Not captured,Not captured,Not captured,Not captured,
Not captured,Not captured,09/05/2019,Not captured,Not captured,863949,020,00072,ARS-02-0052542,Beacon America,Not captured,Not captured,Not captured,,,,Grossberg,Esther R ,,12/26/2001,female,Not captured,Not captured,Not captured,Not captured,Not captured,Not captured,Not captured,Not captured,Not captured,Not captured,Not captured,Not captured,Not captured,,,Not captured,Not captured,Not captured,Not captured,5909 Hobart street,,Pittsburg,Pennsylvania,05217,412-521-4941,,Not captured,Not captured,mgrossberg@hillelpgh.org,Not captured,701940407,,Not captured,Not captured,Not captured,Not captured,Not captured,Not captured,
Not captured,Not captured,09/05/2019,Not captured,Not captured,863949,020,00072,ARS-01-0052541,Beacon International,Not captured,Not captured,Not captured,,,,McCarthy,Edmond,M,01/01/1961,male,Not captured,Not captured,Not captured,Not captured,Not captured,Not captured,Not captured,Not captured,Not captured,Not captured,Not captured,Not captured,Not captured,,,Not captured,Not captured,Not captured,Not captured,199 Dahlia Drive,,Louisville,Colorado,80027,,,Not captured,Not captured,susanmccarthy19@yahoo.com,Not captured,701940406,,Not captured,Not captured,Not captured,Not captured,Not captured,Not captured,
Not captured,Not captured,09/05/2019,Not captured,Not captured,863949,020,00072,ARS-01-0052540,Beacon International,Not captured,Not captured,Not captured,,,,McCarthy,susan,,09/19/1961,female,Not captured,Not captured,Not captured,Not captured,Not captured,Not captured,Not captured,Not captured,Not captured,Not captured,Not captured,Not captured,Not captured,,,Not captured,Not captured,Not captured,Not captured,199 Dahlia Drive,,Louisville,Colorado,80027,,,Not captured,Not captured,susanmccarthy19@yahoo.com,Not captured,701940405,,Not captured,Not captured,Not captured,Not captured,Not captured,Not captured,
Not captured,Not captured,09/05/2019,Not captured,Not captured,863949,020,00072,ARS-01-0052539,Beacon International,Not captured,Not captured,Not captured,,,,Schauer,Anna,M,09/10/1989,female,Not captured,Not captured,Not captured,Not captured,Not captured,Not captured,Not captured,Not captured,Not captured,Not captured,Not captured,Not captured,Not captured,,,Not captured,Not captured,Not captured,Not captured,56 Montpelier Park,,Edinburgh,,EH10 4NH,,,Not captured,Not captured,johndavidevans3@gmail.com,Not captured,701940404,,Not captured,Not captured,Not captured,Not captured,Not captured,Not captured,
Not captured,Not captured,09/05/2019,Not captured,Not captured,863949,020,00072,ARS-01-0052538,Beacon International,Not captured,Not captured,Not captured,,,,Evans,John,D,06/06/1981,male,Not captured,Not captured,Not captured,Not captured,Not captured,Not captured,Not captured,Not captured,Not captured,Not captured,Not captured,Not captured,Not captured,,,Not captured,Not captured,Not captured,Not captured,56 Montpelier Park,,Edinburgh,,EH10 4NH,,,Not captured,Not captured,johndavidevans3@gmail.com,Not captured,701940403,,Not captured,Not captured,Not captured,Not captured,Not captured,Not captured,
Not captured,Not captured,09/05/2019,Not captured,Not captured,863949,020,00072,ARS-02-0052537,Beacon America,Not captured,Not captured,Not captured,,,,Nagy,Janice,,11/17/1966,female,Not captured,Not captured,Not captured,Not captured,Not captured,Not captured,Not captured,Not captured,Not captured,Not captured,Not captured,Not captured,Not captured,,,Not captured,Not captured,Not captured,Not captured,1117 EARL AVE,,SCHENECTADY,New York,12309,,,Not captured,Not captured,dirk.nagy@gmail.com,Not captured,701940402,,Not captured,Not captured,Not captured,Not captured,Not captured,Not captured,
Not captured,Not captured,09/05/2019,Not captured,Not captured,863949,020,00072,ARS-02-0052536,Beacon America,Not captured,Not captured,Not captured,,,,Nagy,Dirk,,09/11/1964,male,Not captured,Not captured,Not captured,Not captured,Not captured,Not captured,Not captured,Not captured,Not captured,Not captured,Not captured,Not captured,Not captured,,,Not captured,Not captured,Not captured,Not captured,1117 EARL AVE,,SCHENECTADY,New York,12309,,,Not captured,Not captured,dirk.nagy@gmail.com,Not captured,701940401,,Not captured,Not captured,Not captured,Not captured,Not captured,Not captured,
Not captured,Not captured,09/04/2019,Not captured,Not captured,863949,020,00072,OVI-28-0052535,OverseasCare Visitors Insurance Plan,Not captured,Not captured,Not captured,,,,kanuganti,padmavathi,,08/18/1950,male,Not captured,Not captured,Not captured,Not captured,Not captured,Not captured,Not captured,Not captured,Not captured,Not captured,Not captured,Not captured,Not captured,ram mohan kanuganti,Son,Not captured,Not captured,Not captured,Not captured,1611 W tombstone trail,,Phoenix,Arizona,85085,2016587005,,Not captured,Not captured,rammohan.acharyadasa@gmail.com,Not captured,701940400,,Not captured,Not captured,Not captured,Not captured,Not captured,Not captured,
Not captured,Not captured,09/04/2019,Not captured,Not captured,863949,020,00072,ARS-02-0052533,Beacon America,Not captured,Not captured,Not captured,,,,Song,Eun Ah ,,07/26/1989,female,Not captured,Not captured,Not captured,Not captured,Not captured,Not captured,Not captured,Not captured,Not captured,Not captured,Not captured,Not captured,Not captured,,,Not captured,Not captured,Not captured,Not captured,152 Oakwood Ln,,Ithaca,New York,14850,607-379-1823,,Not captured,Not captured,es938@cornell.edu,Not captured,701940396,,Not captured,Not captured,Not captured,Not captured,Not captured,Not captured,
Not captured,Not captured,09/04/2019,Not captured,Not captured,863949,020,00072,ARS-01-0052528,Beacon International,Not captured,Not captured,Not captured,,,,Worrel,Sandra,,11/19/1957,female,Not captured,Not captured,Not captured,Not captured,Not captured,Not captured,Not captured,Not captured,Not captured,Not captured,Not captured,Not captured,Not captured,,,Not captured,Not captured,Not captured,Not captured,3261 Idaho Lane,,Costa Mesa,California,92626,,,Not captured,Not captured,worrels5@gmail.com,Not captured,701940385,,Not captured,Not captured,Not captured,Not captured,Not captured,Not captured,
Not captured,Not captured,09/04/2019,Not captured,Not captured,863949,020,00072,ARS-01-0052527,Beacon International,Not captured,Not captured,Not captured,,,,Gilmore,Michael,P,07/03/1973,male,Not captured,Not captured,Not captured,Not captured,Not captured,Not captured,Not captured,Not captured,Not captured,Not captured,Not captured,Not captured,Not captured,,,Not captured,Not captured,Not captured,Not captured,9764 HIGH WATER CT.,,BURKE,Virginia,22015,,,Not captured,Not captured,mgilmor1@gmu.edu,Not captured,701940384,,Not captured,Not captured,Not captured,Not captured,Not captured,Not captured,
Not captured,Not captured,09/04/2019,Not captured,Not captured,863949,020,00072,ARS-01-0052526,Beacon International,Not captured,Not captured,Not captured,,,,Webb,Stephen,,07/19/1979,male,Not captured,Not captured,Not captured,Not captured,Not captured,Not captured,Not captured,Not captured,Not captured,Not captured,Not captured,Not captured,Not captured,,,Not captured,Not captured,Not captured,Not captured,1716 Candlewood Ridge Ln,,Matthews,North Carolina,28105,,,Not captured,Not captured,spwebb2@gmail.com,Not captured,701940383,,Not captured,Not captured,Not captured,Not captured,Not captured,Not captured,
Not captured,Not captured,09/03/2019,Not captured,Not captured,863949,020,00072,ARS-01-0052522,Beacon International,Not captured,Not captured,Not captured,,,,Lo Giudice,Pablo,,06/29/1967,male,Not captured,Not captured,Not captured,Not captured,Not captured,Not captured,Not captured,Not captured,Not captured,Not captured,Not captured,Not captured,Not captured,,,Not captured,Not captured,Not captured,Not captured,1099 23rd St,,San Francisco,California,94107,,,Not captured,Not captured,blakecgriffin@gmail.com,Not captured,701940377,,Not captured,Not captured,Not captured,Not captured,Not captured,Not captured,
Not captured,Not captured,09/03/2019,Not captured,Not captured,863949,020,00072,ARS-01-0052521,Beacon International,Not captured,Not captured,Not captured,,,,Griffin,Blake,,08/24/1984,male,Not captured,Not captured,Not captured,Not captured,Not captured,Not captured,Not captured,Not captured,Not captured,Not captured,Not captured,Not captured,Not captured,,,Not captured,Not captured,Not captured,Not captured,1099 23rd St,,San Francisco,California,94107,,,Not captured,Not captured,blakecgriffin@gmail.com,Not captured,701940376,,Not captured,Not captured,Not captured,Not captured,Not captured,Not captured,
Not captured,Not captured,09/03/2019,Not captured,Not captured,863949,020,00072,ARS-01-0052517,Beacon International,Not captured,Not captured,Not captured,,,,Guyennet,Arthur,,05/23/1991,male,Not captured,Not captured,Not captured,Not captured,Not captured,Not captured,Not captured,Not captured,Not captured,Not captured,Not captured,Not captured,Not captured,,,Not captured,Not captured,Not captured,Not captured,3 quarter avenue de chevene,,annecy,,74000,,,Not captured,Not captured,guyennet.a@gmail.com,Not captured,701940372,,Not captured,Not captured,Not captured,Not captured,Not captured,Not captured,
Not captured,Not captured,09/03/2019,Not captured,Not captured,863949,020,00072,ARS-01-0052516,Beacon International,Not captured,Not captured,Not captured,,,,Ruiz Aponte,Helbert,,01/31/1992,male,Not captured,Not captured,Not captured,Not captured,Not captured,Not captured,Not captured,Not captured,Not captured,Not captured,Not captured,Not captured,Not captured,,,Not captured,Not captured,Not captured,Not captured,10829 NW 5th st,,Plantation,Florida,33324,,,Not captured,Not captured,helbertruiz1@gmail.com,Not captured,701940371,,Not captured,Not captured,Not captured,Not captured,Not captured,Not captured,
Not captured,Not captured,09/03/2019,Not captured,Not captured,863949,020,00072,ARS-02-0052515,Beacon America,Not captured,Not captured,Not captured,,,,Huffman,Paige,M,01/25/1999,female,Not captured,Not captured,Not captured,Not captured,Not captured,Not captured,Not captured,Not captured,Not captured,Not captured,Not captured,Not captured,Not captured,,,Not captured,Not captured,Not captured,Not captured,210 Avenida Victoria #A,,San Clemente,California,92672,,,Not captured,Not captured,adroit@prodigy.net,Not captured,701940370,,Not captured,Not captured,Not captured,Not captured,Not captured,Not captured,
Not captured,Not captured,09/03/2019,Not captured,Not captured,863949,020,00072,ARS-02-0052514,Beacon America,Not captured,Not captured,Not captured,,,,Jamdade,Ruhaan,M,12/04/2018,male,Not captured,Not captured,Not captured,Not captured,Not captured,Not captured,Not captured,Not captured,Not captured,Not captured,Not captured,Not captured,Not captured,Ricky Heimbach,father,Not captured,Not captured,Not captured,Not captured,2515 W Liberty St,,Allentown,Pennsylvania,18104,484-860-8686,,Not captured,Not captured,rick@heimbach.us,Not captured,701940369,,Not captured,Not captured,Not captured,Not captured,Not captured,Not captured,
Not captured,Not captured,09/03/2019,Not captured,Not captured,863949,020,00072,ARS-02-0052513,Beacon America,Not captured,Not captured,Not captured,,,,Jamdade,Jasmine,G,09/04/2017,male,Not captured,Not captured,Not captured,Not captured,Not captured,Not captured,Not captured,Not captured,Not captured,Not captured,Not captured,Not captured,Not captured,Ricky Heimbach,father,Not captured,Not captured,Not captured,Not captured,2515 W Liberty St,,Allentown,Pennsylvania,18104,484-860-8686,,Not captured,Not captured,rick@heimbach.us,Not captured,701940368,,Not captured,Not captured,Not captured,Not captured,Not captured,Not captured,
Not captured,Not captured,09/03/2019,Not captured,Not captured,863949,020,00072,ARS-02-0052512,Beacon America,Not captured,Not captured,Not captured,Passport(TS0004934),,,Jamdade,Elliko,E,01/20/1987,female,Not captured,Not captured,Not captured,Not captured,Not captured,Not captured,Not captured,Not captured,Not captured,Not captured,Not captured,Not captured,Not captured,Ricky Heimbach,father,Not captured,Not captured,Not captured,Not captured,2515 W Liberty St,,Allentown,Pennsylvania,18104,484-860-8686,,Not captured,Not captured,rick@heimbach.us,Not captured,701940367,,Not captured,Not captured,Not captured,Not captured,Not captured,Not captured,