EE Transaction Type,Dependent Transaction Type,Effective Date,EE Signature,EE Signature Date,Control,Suffix,Account,Plan Number,Plan Name,Claim Office,Network ID Number,Customer Code,EE SSN,Dependent SSN,Dependent Relationship,Last Name,First Name,Middle Initial,DOB,Gender,Ethnicity,PCP/PCD,PCP/PCD Current Patient,Provider Cap Office Number,COB,Dep Student Indicator,Dep OOA Indicator,EE Prior Coverage Indicator,EE Late Entrant,EE Language Indicator,Hire Date,Earnings,Earnings Frequency,Beneficiary (Last Name First Name MI),Beneficiary Relationship,Continuation of Coverage Expiration Date,Continuation of Coverage Event Date,Continuation of Coverage Length of Coverage,Work Location Zip Code,Street Address Line 1,Street Address Line 2,City,State,Zip Code,Home Phone Number,Work Phone Number,Accept Code,Evidence Code,EE Email Address,Communication Disability Code,EE Alternate ID,Dep Alternate ID,Old Control,Old Suffix,Old Account,New Control,New Suffix,New Account,
Not captured,Not captured,08/29/2019,Not captured,Not captured,863949,020,00072,ARS-04-0052145,Enhanced America,Not captured,Not captured,Not captured,Passport(ZP022332),,,Bobbili,Sreenivasa,Reddy,05/22/1961,male,Not captured,Not captured,Not captured,Not captured,Not captured,Not captured,Not captured,Not captured,Not captured,Not captured,Not captured,Not captured,Not captured,,,Not captured,Not captured,Not captured,Not captured,61 Ron road,,Lusaka,Lusaka,10101,260966760845,,Not captured,Not captured,rbobbili@abramscapital.com,Not captured,701939669,,Not captured,Not captured,Not captured,Not captured,Not captured,Not captured,
Not captured,Not captured,08/29/2019,Not captured,Not captured,863949,020,00072,ARS-01-0052413,Beacon International,Not captured,Not captured,Not captured,,,,Baumann,Danielle,M,03/20/1997,female,Not captured,Not captured,Not captured,Not captured,Not captured,Not captured,Not captured,Not captured,Not captured,Not captured,Not captured,Not captured,Not captured,,,Not captured,Not captured,Not captured,Not captured,8433 Ironside Ct.,,West Chester,Ohio,45069,,,Not captured,Not captured,daniellexxbaumann@gmail.com,Not captured,701940159,,Not captured,Not captured,Not captured,Not captured,Not captured,Not captured,
Not captured,Not captured,08/29/2019,Not captured,Not captured,863949,020,00072,ARS-02-0052411,Beacon America,Not captured,Not captured,Not captured,Passport(HG116716),,,Harivel,Colin,P.,01/28/1947,male,Not captured,Not captured,Not captured,Not captured,Not captured,Not captured,Not captured,Not captured,Not captured,Not captured,Not captured,Not captured,Not captured,Atticus Harivel,Son,Not captured,Not captured,Not captured,Not captured,16513 59th Avenue,,Surrey,British Columbia,V3S4G2,6042514407,,Not captured,Not captured,colinharivel@gmail.com,Not captured,701940157,,Not captured,Not captured,Not captured,Not captured,Not captured,Not captured,
Not captured,Not captured,08/28/2019,Not captured,Not captured,863949,020,00072,ARS-01-0052410,Beacon International,Not captured,Not captured,Not captured,,,,Caldwell,Peter,M,02/20/1993,male,Not captured,Not captured,Not captured,Not captured,Not captured,Not captured,Not captured,Not captured,Not captured,Not captured,Not captured,Not captured,Not captured,,,Not captured,Not captured,Not captured,Not captured,700 Dalen Lane,,Knoxville,Tennessee,37932,,,Not captured,Not captured,caldwell.dn@gmail.com,Not captured,701940156,,Not captured,Not captured,Not captured,Not captured,Not captured,Not captured,
Not captured,Not captured,08/28/2019,Not captured,Not captured,863949,020,00072,ARS-02-0052407,Beacon America,Not captured,Not captured,Not captured,,,,Drinko,Alexey,,06/05/1977,male,Not captured,Not captured,Not captured,Not captured,Not captured,Not captured,Not captured,Not captured,Not captured,Not captured,Not captured,Not captured,Not captured,,,Not captured,Not captured,Not captured,Not captured,Krasnogo znameni st 35,,Vladivostok,,690106,,,Not captured,Not captured,dr4lex77@gmail.com,Not captured,701940153,,Not captured,Not captured,Not captured,Not captured,Not captured,Not captured,
Not captured,Not captured,08/29/2019,Not captured,Not captured,863949,020,00072,OVI-28-0052403,OverseasCare Visitors Insurance Plan,Not captured,Not captured,Not captured,,,,Rajanna,Lakshmi,GAUTHAM,10/22/1955,female,Not captured,Not captured,Not captured,Not captured,Not captured,Not captured,Not captured,Not captured,Not captured,Not captured,Not captured,Not captured,Not captured,ASHWINI RAJANNA,Daughter,Not captured,Not captured,Not captured,Not captured,18615 Cascade Timbers Ln,,Tomball,Texas,77377,3476829405,,Not captured,Not captured,KGAUTHAMPRASAD@GMAIL.COM,Not captured,701940133,,Not captured,Not captured,Not captured,Not captured,Not captured,Not captured,
Not captured,Not captured,08/29/2019,Not captured,Not captured,863949,020,00072,OVI-28-0052402,OverseasCare Visitors Insurance Plan,Not captured,Not captured,Not captured,,,,Ramaswamy,Rajanna,,04/05/1947,male,Not captured,Not captured,Not captured,Not captured,Not captured,Not captured,Not captured,Not captured,Not captured,Not captured,Not captured,Not captured,Not captured,ASHWINI RAJANNA,Daughter,Not captured,Not captured,Not captured,Not captured,18615 Cascade Timbers Ln,,Tomball,Texas,77377,3476829405,,Not captured,Not captured,KGAUTHAMPRASAD@GMAIL.COM,Not captured,701940132,,Not captured,Not captured,Not captured,Not captured,Not captured,Not captured,
Not captured,Not captured,08/28/2019,Not captured,Not captured,863949,020,00072,ARS-02-0052401,Beacon America,Not captured,Not captured,Not captured,,,,Feldman,Moshe,,07/23/1990,male,Not captured,Not captured,Not captured,Not captured,Not captured,Not captured,Not captured,Not captured,Not captured,Not captured,Not captured,Not captured,Not captured,,,Not captured,Not captured,Not captured,Not captured,75 Starmont ST,,Toronto,Ontario,M5N2C3,416-781-5473,,Not captured,Not captured,moishfeldman@gmail.com,Not captured,701940106,,Not captured,Not captured,Not captured,Not captured,Not captured,Not captured,
Not captured,Not captured,08/28/2019,Not captured,Not captured,863949,020,00072,ARS-01-0052397,Beacon International,Not captured,Not captured,Not captured,,,,Smith,Justin,D,12/04/1983,male,Not captured,Not captured,Not captured,Not captured,Not captured,Not captured,Not captured,Not captured,Not captured,Not captured,Not captured,Not captured,Not captured,,,Not captured,Not captured,Not captured,Not captured,815 Breeze Place,,Redwood City,California,94062,,,Not captured,Not captured,j3smith@gmail.com,Not captured,701940074,,Not captured,Not captured,Not captured,Not captured,Not captured,Not captured,
Not captured,Not captured,08/28/2019,Not captured,Not captured,863949,020,00072,ARS-01-0052395,Beacon International,Not captured,Not captured,Not captured,,,,Hughes,Elliot,J,05/25/2019,male,Not captured,Not captured,Not captured,Not captured,Not captured,Not captured,Not captured,Not captured,Not captured,Not captured,Not captured,Not captured,Not captured,,,Not captured,Not captured,Not captured,Not captured,2252 Daniel Bray Highway,,Stockton,New Jersey,08559,,,Not captured,Not captured,luciedhughes@gmail.com,Not captured,701940069,,Not captured,Not captured,Not captured,Not captured,Not captured,Not captured,
Not captured,Not captured,08/28/2019,Not captured,Not captured,863949,020,00072,ARS-01-0052394,Beacon International,Not captured,Not captured,Not captured,,,,Delcuvellerie,Lucie,A,05/22/1989,female,Not captured,Not captured,Not captured,Not captured,Not captured,Not captured,Not captured,Not captured,Not captured,Not captured,Not captured,Not captured,Not captured,,,Not captured,Not captured,Not captured,Not captured,2252 Daniel Bray Highway,,Stockton,New Jersey,08559,,,Not captured,Not captured,luciedhughes@gmail.com,Not captured,701940068,,Not captured,Not captured,Not captured,Not captured,Not captured,Not captured,
Not captured,Not captured,08/28/2019,Not captured,Not captured,863949,020,00072,ARS-01-0052393,Beacon International,Not captured,Not captured,Not captured,,,,Hughes,Billy,J,11/14/1984,male,Not captured,Not captured,Not captured,Not captured,Not captured,Not captured,Not captured,Not captured,Not captured,Not captured,Not captured,Not captured,Not captured,,,Not captured,Not captured,Not captured,Not captured,2252 Daniel Bray Highway,,Stockton,New Jersey,08559,,,Not captured,Not captured,luciedhughes@gmail.com,Not captured,701940067,,Not captured,Not captured,Not captured,Not captured,Not captured,Not captured,
Not captured,Not captured,08/28/2019,Not captured,Not captured,863949,020,00072,ARS-02-0052392,Beacon America,Not captured,Not captured,Not captured,Passport(064757168),,,Pineda Delgado,Nathaly Esperanza,,08/23/1965,female,Not captured,Not captured,Not captured,Not captured,Not captured,Not captured,Not captured,Not captured,Not captured,Not captured,Not captured,Not captured,Not captured,Fernan Gonzalez,Hijo,Not captured,Not captured,Not captured,Not captured,Urb. Villas de Europa Casa Nro 28 las margaritas de Tariba,,Tariba,Tachira,5001,02763569875,,Not captured,Not captured,oficinafg2011@hotmail.com,Not captured,701940066,,Not captured,Not captured,Not captured,Not captured,Not captured,Not captured,
Not captured,Not captured,08/28/2019,Not captured,Not captured,863949,020,00072,ARS-03-0052381,Essential America,Not captured,Not captured,Not captured,Passport(Y27837637907882),,,Yeruva Reddy,Veera,,07/07/1988,male,Not captured,Not captured,Not captured,Not captured,Not captured,Not captured,Not captured,Not captured,Not captured,Not captured,Not captured,Not captured,Not captured,,,Not captured,Not captured,Not captured,Not captured,1245 Main Bazar Vittamrajupalli,,Vinykonda,Gujarat,522647,7177750590,,Not captured,Not captured,YVREDDY1988@GMAIL.COM,Not captured,701940048,,Not captured,Not captured,Not captured,Not captured,Not captured,Not captured,
Not captured,Not captured,08/28/2019,Not captured,Not captured,863949,020,00072,ARS-03-0052381,Essential America,Not captured,Not captured,Not captured,,Passport(M3788165),Spouse,Mounika,Maruri,,08/21/1991,female,Not captured,Not captured,Not captured,Not captured,Not captured,Not captured,Not captured,Not captured,Not captured,Not captured,Not captured,Not captured,Not captured,,,Not captured,Not captured,Not captured,Not captured,1245 Main Bazar Vittamrajupalli,,Vinykonda,Gujarat,522647,7177750590,,Not captured,Not captured,YVREDDY1988@GMAIL.COM,Not captured,,701940049,Not captured,Not captured,Not captured,Not captured,Not captured,Not captured,
Not captured,Not captured,08/28/2019,Not captured,Not captured,863949,020,00072,ARS-03-0052381,Essential America,Not captured,Not captured,Not captured,,Passport(P0635554),Dependant,Yeruva Reddy,Nandika,,11/13/2015,female,Not captured,Not captured,Not captured,Not captured,Not captured,Not captured,Not captured,Not captured,Not captured,Not captured,Not captured,Not captured,Not captured,,,Not captured,Not captured,Not captured,Not captured,1245 Main Bazar Vittamrajupalli,,Vinykonda,Gujarat,522647,7177750590,,Not captured,Not captured,YVREDDY1988@GMAIL.COM,Not captured,,701940050,Not captured,Not captured,Not captured,Not captured,Not captured,Not captured,
Not captured,Not captured,08/28/2019,Not captured,Not captured,863949,020,00072,ARS-03-0052381,Essential America,Not captured,Not captured,Not captured,,Passport(S7098562),Dependant,Yeruva Reddy,Riya,,04/02/2018,female,Not captured,Not captured,Not captured,Not captured,Not captured,Not captured,Not captured,Not captured,Not captured,Not captured,Not captured,Not captured,Not captured,,,Not captured,Not captured,Not captured,Not captured,1245 Main Bazar Vittamrajupalli,,Vinykonda,Gujarat,522647,7177750590,,Not captured,Not captured,YVREDDY1988@GMAIL.COM,Not captured,,701940051,Not captured,Not captured,Not captured,Not captured,Not captured,Not captured,
Not captured,Not captured,08/29/2019,Not captured,Not captured,863949,020,00072,ARS-01-0052385,Beacon International,Not captured,Not captured,Not captured,,,,Katz,Harley,,10/02/1990,male,Not captured,Not captured,Not captured,Not captured,Not captured,Not captured,Not captured,Not captured,Not captured,Not captured,Not captured,Not captured,Not captured,,,Not captured,Not captured,Not captured,Not captured,274 Collingwood Street,,San Fransisco,California,94114,,,Not captured,Not captured,harley@probablygenetic.com,Not captured,701940055,,Not captured,Not captured,Not captured,Not captured,Not captured,Not captured,
Not captured,Not captured,08/28/2019,Not captured,Not captured,863949,020,00072,ARS-02-0052046,Beacon America,Not captured,Not captured,Not captured,Passport(na),,,Torres Valero,Omar Albeiro,,08/29/1984,male,Not captured,Not captured,Not captured,Not captured,Not captured,Not captured,Not captured,Not captured,Not captured,Not captured,Not captured,Not captured,Not captured,estate,na,Not captured,Not captured,Not captured,Not captured,National Center for State Courts,,Bogota,Distrito Capltal de Santa Fe de Bogot&atilde;,na,5714898640 123,,Not captured,Not captured,mihernandez@ncsc.co,Not captured,701939433,,Not captured,Not captured,Not captured,Not captured,Not captured,Not captured,
Not captured,Not captured,08/28/2019,Not captured,Not captured,863949,020,00072,ARS-02-0052045,Beacon America,Not captured,Not captured,Not captured,Passport(na),,,Gil Rios,Elizabeth,,07/14/1987,female,Not captured,Not captured,Not captured,Not captured,Not captured,Not captured,Not captured,Not captured,Not captured,Not captured,Not captured,Not captured,Not captured,estate,na,Not captured,Not captured,Not captured,Not captured,National Center for State Courts,,Bogota,Distrito Capltal de Santa Fe de Bogot&atilde;,na,5714898640 123,,Not captured,Not captured,mihernandez@ncsc.co,Not captured,701939432,,Not captured,Not captured,Not captured,Not captured,Not captured,Not captured,
Not captured,Not captured,08/29/2019,Not captured,Not captured,863949,020,00072,ARS-03-0051868,Essential America,Not captured,Not captured,Not captured,Passport(506311178),,,Harrison,Michael,Bailey,09/29/1984,male,Not captured,Not captured,Not captured,Not captured,Not captured,Not captured,Not captured,Not captured,Not captured,Not captured,Not captured,Not captured,Not captured,,,Not captured,Not captured,Not captured,Not captured,Visnelik Mahallesi Atat&uuml;rk Bulvari No:183,,Odunpazari,Eskisehir,26020,405-826-1053,,Not captured,Not captured,harrisonmb@live.com,Not captured,701939202,,Not captured,Not captured,Not captured,Not captured,Not captured,Not captured,
Not captured,Not captured,08/29/2019,Not captured,Not captured,863949,020,00072,ARS-03-0051868,Essential America,Not captured,Not captured,Not captured,,Passport(498117207),Spouse,Harrison,Aimee,Michelle,05/24/1987,female,Not captured,Not captured,Not captured,Not captured,Not captured,Not captured,Not captured,Not captured,Not captured,Not captured,Not captured,Not captured,Not captured,,,Not captured,Not captured,Not captured,Not captured,Visnelik Mahallesi Atat&uuml;rk Bulvari No:183,,Odunpazari,Eskisehir,26020,405-826-1053,,Not captured,Not captured,harrisonmb@live.com,Not captured,,701939203,Not captured,Not captured,Not captured,Not captured,Not captured,Not captured,
Not captured,Not captured,08/29/2019,Not captured,Not captured,863949,020,00072,ARS-03-0051868,Essential America,Not captured,Not captured,Not captured,,Passport(588881051),Dependant,Harrison,Ruth,Michelle,09/14/2014,female,Not captured,Not captured,Not captured,Not captured,Not captured,Not captured,Not captured,Not captured,Not captured,Not captured,Not captured,Not captured,Not captured,,,Not captured,Not captured,Not captured,Not captured,Visnelik Mahallesi Atat&uuml;rk Bulvari No:183,,Odunpazari,Eskisehir,26020,405-826-1053,,Not captured,Not captured,harrisonmb@live.com,Not captured,,701939204,Not captured,Not captured,Not captured,Not captured,Not captured,Not captured,
Not captured,Not captured,08/29/2019,Not captured,Not captured,863949,020,00072,ARS-03-0051868,Essential America,Not captured,Not captured,Not captured,,Passport(588881052),Dependant,Harrison,Margaret,Leigh,08/13/2016,female,Not captured,Not captured,Not captured,Not captured,Not captured,Not captured,Not captured,Not captured,Not captured,Not captured,Not captured,Not captured,Not captured,,,Not captured,Not captured,Not captured,Not captured,Visnelik Mahallesi Atat&uuml;rk Bulvari No:183,,Odunpazari,Eskisehir,26020,405-826-1053,,Not captured,Not captured,harrisonmb@live.com,Not captured,,701939205,Not captured,Not captured,Not captured,Not captured,Not captured,Not captured,
Not captured,Not captured,08/29/2019,Not captured,Not captured,863949,020,00072,ARS-03-0051868,Essential America,Not captured,Not captured,Not captured,,Passport(597904260),Dependant,Harrison,Shepherd,James,02/22/2019,male,Not captured,Not captured,Not captured,Not captured,Not captured,Not captured,Not captured,Not captured,Not captured,Not captured,Not captured,Not captured,Not captured,,,Not captured,Not captured,Not captured,Not captured,Visnelik Mahallesi Atat&uuml;rk Bulvari No:183,,Odunpazari,Eskisehir,26020,405-826-1053,,Not captured,Not captured,harrisonmb@live.com,Not captured,,701939206,Not captured,Not captured,Not captured,Not captured,Not captured,Not captured,
Not captured,Not captured,08/29/2019,Not captured,Not captured,863949,020,00072,ARS-01-0051652,Beacon International,Not captured,Not captured,Not captured,,,,Otto-Darko,Beth,,08/01/1990,female,Not captured,Not captured,Not captured,Not captured,Not captured,Not captured,Not captured,Not captured,Not captured,Not captured,Not captured,Not captured,Not captured,,,Not captured,Not captured,Not captured,Not captured,3 The Retreat,,Providenciales,,12,,,Not captured,Not captured,b.otto-darko@hotmail.co.uk,Not captured,701938756,,Not captured,Not captured,Not captured,Not captured,Not captured,Not captured,
Not captured,Not captured,08/29/2019,Not captured,Not captured,863949,020,00072,ARS-01-0051651,Beacon International,Not captured,Not captured,Not captured,,,,Moxon,Bobby,,01/11/1988,male,Not captured,Not captured,Not captured,Not captured,Not captured,Not captured,Not captured,Not captured,Not captured,Not captured,Not captured,Not captured,Not captured,,,Not captured,Not captured,Not captured,Not captured,3 The Retreat,,Providenciales,,12,,,Not captured,Not captured,b.otto-darko@hotmail.co.uk,Not captured,701938755,,Not captured,Not captured,Not captured,Not captured,Not captured,Not captured,
Not captured,Not captured,08/29/2019,Not captured,Not captured,863949,020,00072,ARS-01-0051606,Beacon International,Not captured,Not captured,Not captured,,,,Laluz,Yolanda,,01/30/1961,female,Not captured,Not captured,Not captured,Not captured,Not captured,Not captured,Not captured,Not captured,Not captured,Not captured,Not captured,Not captured,Not captured,Spouses are 100 percent primary contingent is Joshua E Laluz,spouses then son,Not captured,Not captured,Not captured,Not captured,1582 Hannah Ln.,,Pingree Grove,Illinois,60140,847-894-0575,,Not captured,Not captured,yolandalaluz@gmail.com,Not captured,701938692,,Not captured,Not captured,Not captured,Not captured,Not captured,Not captured,
Not captured,Not captured,08/29/2019,Not captured,Not captured,863949,020,00072,ARS-01-0051605,Beacon International,Not captured,Not captured,Not captured,Passport(543637693),,,Laluz,Rafael,E.,05/28/1951,male,Not captured,Not captured,Not captured,Not captured,Not captured,Not captured,Not captured,Not captured,Not captured,Not captured,Not captured,Not captured,Not captured,Spouses are 100 percent primary contingent is Joshua E Laluz,spouses then son,Not captured,Not captured,Not captured,Not captured,1582 Hannah Ln.,,Pingree Grove,Illinois,60140,847-894-0575,,Not captured,Not captured,yolandalaluz@gmail.com,Not captured,701938691,,Not captured,Not captured,Not captured,Not captured,Not captured,Not captured,
Not captured,Not captured,08/28/2019,Not captured,Not captured,863949,020,00072,ARS-02-0051585,Beacon America,Not captured,Not captured,Not captured,Passport(HG167065),,,Berhane,Samuel,B,04/18/1969,male,Not captured,Not captured,Not captured,Not captured,Not captured,Not captured,Not captured,Not captured,Not captured,Not captured,Not captured,Not captured,Not captured,,,Not captured,Not captured,Not captured,Not captured,2910 Military Avenue,,Los Angeles,CA,90064,,,Not captured,Not captured,asimainc@yahoo.com,Not captured,701938632,,Not captured,Not captured,Not captured,Not captured,Not captured,Not captured,
Not captured,Not captured,08/30/2019,Not captured,Not captured,863949,020,00072,BG001030-23-4eca6b97,International Assurance,Not captured,Not captured,Not captured,-,-,,Aguilera,Edgar ,,04/26/1991,male,Not captured,Not captured,Not captured,Not captured,Not captured,Not captured,Not captured,Not captured,Not captured,Not captured,Not captured,Not captured,Not captured,,,Not captured,Not captured,Not captured,Not captured,3585 N Lee Trevino,,El Paso,Texas,79936,9155950288,,Not captured,Not captured,charlie@cielovista.org,Not captured,701940136,,Not captured,Not captured,Not captured,Not captured,Not captured,Not captured,
Not captured,Not captured,08/30/2019,Not captured,Not captured,863949,020,00072,BG001030-23-4eca6b97,International Assurance,Not captured,Not captured,Not captured,-,-,,Arellano,Araceli,,04/08/1971,female,Not captured,Not captured,Not captured,Not captured,Not captured,Not captured,Not captured,Not captured,Not captured,Not captured,Not captured,Not captured,Not captured,,,Not captured,Not captured,Not captured,Not captured,3585 N Lee Trevino,,El Paso,Texas,79936,9155950288,,Not captured,Not captured,charlie@cielovista.org,Not captured,701940137,,Not captured,Not captured,Not captured,Not captured,Not captured,Not captured,
Not captured,Not captured,08/30/2019,Not captured,Not captured,863949,020,00072,BG001030-23-4eca6b97,International Assurance,Not captured,Not captured,Not captured,-,-,,Arellano,Charles,J,12/06/1962,male,Not captured,Not captured,Not captured,Not captured,Not captured,Not captured,Not captured,Not captured,Not captured,Not captured,Not captured,Not captured,Not captured,,,Not captured,Not captured,Not captured,Not captured,3585 N Lee Trevino,,El Paso,Texas,79936,9155950288,,Not captured,Not captured,charlie@cielovista.org,Not captured,701940138,,Not captured,Not captured,Not captured,Not captured,Not captured,Not captured,
Not captured,Not captured,08/30/2019,Not captured,Not captured,863949,020,00072,BG001030-23-4eca6b97,International Assurance,Not captured,Not captured,Not captured,-,-,,Cordero,Laurence,G ,07/31/1962,male,Not captured,Not captured,Not captured,Not captured,Not captured,Not captured,Not captured,Not captured,Not captured,Not captured,Not captured,Not captured,Not captured,,,Not captured,Not captured,Not captured,Not captured,3585 N Lee Trevino,,El Paso,Texas,79936,9155950288,,Not captured,Not captured,charlie@cielovista.org,Not captured,701940139,,Not captured,Not captured,Not captured,Not captured,Not captured,Not captured,
Not captured,Not captured,08/30/2019,Not captured,Not captured,863949,020,00072,BG001030-23-4eca6b97,International Assurance,Not captured,Not captured,Not captured,-,-,,Delgado,Denise,,06/21/1975,female,Not captured,Not captured,Not captured,Not captured,Not captured,Not captured,Not captured,Not captured,Not captured,Not captured,Not captured,Not captured,Not captured,,,Not captured,Not captured,Not captured,Not captured,3585 N Lee Trevino,,El Paso,Texas,79936,9155950288,,Not captured,Not captured,charlie@cielovista.org,Not captured,701940140,,Not captured,Not captured,Not captured,Not captured,Not captured,Not captured,