EE Transaction Type,Dependent Transaction Type,Effective Date,EE Signature,EE Signature Date,Control,Suffix,Account,Plan Number,Plan Name,Claim Office,Network ID Number,Customer Code,EE SSN,Dependent SSN,Dependent Relationship,Last Name,First Name,Middle Initial,DOB,Gender,Ethnicity,PCP/PCD,PCP/PCD Current Patient,Provider Cap Office Number,COB,Dep Student Indicator,Dep OOA Indicator,EE Prior Coverage Indicator,EE Late Entrant,EE Language Indicator,Hire Date,Earnings,Earnings Frequency,Beneficiary (Last Name First Name MI),Beneficiary Relationship,Continuation of Coverage Expiration Date,Continuation of Coverage Event Date,Continuation of Coverage Length of Coverage,Work Location Zip Code,Street Address Line 1,Street Address Line 2,City,State,Zip Code,Home Phone Number,Work Phone Number,Accept Code,Evidence Code,EE Email Address,Communication Disability Code,EE Alternate ID,Dep Alternate ID,Old Control,Old Suffix,Old Account,New Control,New Suffix,New Account,
Not captured,Not captured,08/31/2019,Not captured,Not captured,863949,020,00072,ARS-01-0052489,Beacon International,Not captured,Not captured,Not captured,,,,ohana,mia,G,07/28/2016,female,Not captured,Not captured,Not captured,Not captured,Not captured,Not captured,Not captured,Not captured,Not captured,Not captured,Not captured,Not captured,Not captured,,,Not captured,Not captured,Not captured,Not captured,2646 iron crest ln,,las vegas,Nevada,89138,,,Not captured,Not captured,guyohana10@icloud.com,Not captured,701940332,,Not captured,Not captured,Not captured,Not captured,Not captured,Not captured,
Not captured,Not captured,08/31/2019,Not captured,Not captured,863949,020,00072,ARS-01-0052488,Beacon International,Not captured,Not captured,Not captured,,,,ohana,kaori,,02/10/1978,female,Not captured,Not captured,Not captured,Not captured,Not captured,Not captured,Not captured,Not captured,Not captured,Not captured,Not captured,Not captured,Not captured,,,Not captured,Not captured,Not captured,Not captured,2646 iron crest ln,,las vegas,Nevada,89138,,,Not captured,Not captured,guyohana10@icloud.com,Not captured,701940331,,Not captured,Not captured,Not captured,Not captured,Not captured,Not captured,
Not captured,Not captured,08/31/2019,Not captured,Not captured,863949,020,00072,ARS-01-0052487,Beacon International,Not captured,Not captured,Not captured,,,,OHANA,YAISH,G,02/08/1988,male,Not captured,Not captured,Not captured,Not captured,Not captured,Not captured,Not captured,Not captured,Not captured,Not captured,Not captured,Not captured,Not captured,,,Not captured,Not captured,Not captured,Not captured,2646 iron crest ln,,las vegas,Nevada,89138,,,Not captured,Not captured,guyohana10@icloud.com,Not captured,701940330,,Not captured,Not captured,Not captured,Not captured,Not captured,Not captured,
Not captured,Not captured,08/31/2019,Not captured,Not captured,863949,020,00072,ARS-01-0052486,Beacon International,Not captured,Not captured,Not captured,,,,De Leon,Robert,,07/01/1986,male,Not captured,Not captured,Not captured,Not captured,Not captured,Not captured,Not captured,Not captured,Not captured,Not captured,Not captured,Not captured,Not captured,,,Not captured,Not captured,Not captured,Not captured,140,,Long Beach,California,90802,,,Not captured,Not captured,sntran84@yahoo.com,Not captured,701940329,,Not captured,Not captured,Not captured,Not captured,Not captured,Not captured,
Not captured,Not captured,08/31/2019,Not captured,Not captured,863949,020,00072,ARS-01-0052485,Beacon International,Not captured,Not captured,Not captured,,,,Tran,Sandy,,05/16/1984,female,Not captured,Not captured,Not captured,Not captured,Not captured,Not captured,Not captured,Not captured,Not captured,Not captured,Not captured,Not captured,Not captured,,,Not captured,Not captured,Not captured,Not captured,140,,Long Beach,California,90802,,,Not captured,Not captured,sntran84@yahoo.com,Not captured,701940328,,Not captured,Not captured,Not captured,Not captured,Not captured,Not captured,
Not captured,Not captured,08/31/2019,Not captured,Not captured,863949,020,00072,ARS-02-0052483,Beacon America,Not captured,Not captured,Not captured,,,,McCaffrey,Rebekah,T,04/19/2000,female,Not captured,Not captured,Not captured,Not captured,Not captured,Not captured,Not captured,Not captured,Not captured,Not captured,Not captured,Not captured,Not captured,,,Not captured,Not captured,Not captured,Not captured,83664 S Hwy 81,,Norfolk,Nebraska,68701,,,Not captured,Not captured,janetmccaffrey1@gmail.com,Not captured,701940326,,Not captured,Not captured,Not captured,Not captured,Not captured,Not captured,
Not captured,Not captured,08/31/2019,Not captured,Not captured,863949,020,00072,ARS-01-0052482,Beacon International,Not captured,Not captured,Not captured,,,,Jones,Brad,L,10/24/1979,male,Not captured,Not captured,Not captured,Not captured,Not captured,Not captured,Not captured,Not captured,Not captured,Not captured,Not captured,Not captured,Not captured,,,Not captured,Not captured,Not captured,Not captured,121 west Wentworth st,,Englewood,Florida,34223,,,Not captured,Not captured,samanthajstuckey@aol.com,Not captured,701940325,,Not captured,Not captured,Not captured,Not captured,Not captured,Not captured,
Not captured,Not captured,08/31/2019,Not captured,Not captured,863949,020,00072,ARS-01-0052481,Beacon International,Not captured,Not captured,Not captured,,,,Stuckey,Samantha,J,11/26/1985,female,Not captured,Not captured,Not captured,Not captured,Not captured,Not captured,Not captured,Not captured,Not captured,Not captured,Not captured,Not captured,Not captured,,,Not captured,Not captured,Not captured,Not captured,121 west Wentworth st,,Englewood,Florida,34223,,,Not captured,Not captured,samanthajstuckey@aol.com,Not captured,701940324,,Not captured,Not captured,Not captured,Not captured,Not captured,Not captured,
Not captured,Not captured,08/31/2019,Not captured,Not captured,863949,020,00072,ARS-01-0052480,Beacon International,Not captured,Not captured,Not captured,,,,Little,Allyson,R,12/04/1977,female,Not captured,Not captured,Not captured,Not captured,Not captured,Not captured,Not captured,Not captured,Not captured,Not captured,Not captured,Not captured,Not captured,,,Not captured,Not captured,Not captured,Not captured,4204 Russell Ave #5,,Mount Rainier,Maryland,20712,,,Not captured,Not captured,allysonlittle@gmail.com,Not captured,701940323,,Not captured,Not captured,Not captured,Not captured,Not captured,Not captured,
Not captured,Not captured,08/31/2019,Not captured,Not captured,863949,020,00072,ARS-01-0052479,Beacon International,Not captured,Not captured,Not captured,,,,Gebreab,Liya,,03/03/1991,female,Not captured,Not captured,Not captured,Not captured,Not captured,Not captured,Not captured,Not captured,Not captured,Not captured,Not captured,Not captured,Not captured,,,Not captured,Not captured,Not captured,Not captured,349 38th st,,Oakland,California,94609,,,Not captured,Not captured,yaphetteklu@gmail.com,Not captured,701940322,,Not captured,Not captured,Not captured,Not captured,Not captured,Not captured,
Not captured,Not captured,08/31/2019,Not captured,Not captured,863949,020,00072,ARS-01-0052478,Beacon International,Not captured,Not captured,Not captured,,,,Teklu,Yaphet,,02/16/1989,male,Not captured,Not captured,Not captured,Not captured,Not captured,Not captured,Not captured,Not captured,Not captured,Not captured,Not captured,Not captured,Not captured,,,Not captured,Not captured,Not captured,Not captured,349 38th st,,Oakland,California,94609,,,Not captured,Not captured,yaphetteklu@gmail.com,Not captured,701940321,,Not captured,Not captured,Not captured,Not captured,Not captured,Not captured,
Not captured,Not captured,08/31/2019,Not captured,Not captured,863949,020,00072,ARS-01-0052476,Beacon International,Not captured,Not captured,Not captured,,,,Tripathi,Shrey,,07/14/1990,male,Not captured,Not captured,Not captured,Not captured,Not captured,Not captured,Not captured,Not captured,Not captured,Not captured,Not captured,Not captured,Not captured,,,Not captured,Not captured,Not captured,Not captured,8510 E 29th St. N Apt 1204,,Wichita,Kansas,67226,,,Not captured,Not captured,shreytrip14@gmail.com,Not captured,701940319,,Not captured,Not captured,Not captured,Not captured,Not captured,Not captured,
Not captured,Not captured,08/31/2019,Not captured,Not captured,863949,020,00072,ARS-01-0052475,Beacon International,Not captured,Not captured,Not captured,,,,Jennings,Hannah,,06/23/1987,female,Not captured,Not captured,Not captured,Not captured,Not captured,Not captured,Not captured,Not captured,Not captured,Not captured,Not captured,Not captured,Not captured,James Heikes,Grandpa,Not captured,Not captured,Not captured,Not captured,308 Bluebird Ln,,McAlester,Oklahoma,74501,9184294228,,Not captured,Not captured,blake@thekingshouse.church,Not captured,701940318,,Not captured,Not captured,Not captured,Not captured,Not captured,Not captured,
Not captured,Not captured,08/31/2019,Not captured,Not captured,863949,020,00072,ARS-01-0052474,Beacon International,Not captured,Not captured,Not captured,Passport(582858515),,,Jennings,Blake,A,09/10/1980,male,Not captured,Not captured,Not captured,Not captured,Not captured,Not captured,Not captured,Not captured,Not captured,Not captured,Not captured,Not captured,Not captured,James Heikes,Grandpa,Not captured,Not captured,Not captured,Not captured,308 Bluebird Ln,,McAlester,Oklahoma,74501,9184294228,,Not captured,Not captured,blake@thekingshouse.church,Not captured,701940317,,Not captured,Not captured,Not captured,Not captured,Not captured,Not captured,
Not captured,Not captured,08/30/2019,Not captured,Not captured,863949,020,00072,ARS-01-0052473,Beacon International,Not captured,Not captured,Not captured,,,,Zapatero,Ileana,E,01/25/1959,female,Not captured,Not captured,Not captured,Not captured,Not captured,Not captured,Not captured,Not captured,Not captured,Not captured,Not captured,Not captured,Not captured,,,Not captured,Not captured,Not captured,Not captured,462 Arbramar Ave,,Los Angeles,California,90272,,,Not captured,Not captured,mgrothmd@gmail.com,Not captured,701940316,,Not captured,Not captured,Not captured,Not captured,Not captured,Not captured,
Not captured,Not captured,08/30/2019,Not captured,Not captured,863949,020,00072,ARS-01-0052472,Beacon International,Not captured,Not captured,Not captured,,,,Groth,Michael,J,06/17/1959,male,Not captured,Not captured,Not captured,Not captured,Not captured,Not captured,Not captured,Not captured,Not captured,Not captured,Not captured,Not captured,Not captured,,,Not captured,Not captured,Not captured,Not captured,462 Arbramar Ave,,Los Angeles,California,90272,,,Not captured,Not captured,mgrothmd@gmail.com,Not captured,701940315,,Not captured,Not captured,Not captured,Not captured,Not captured,Not captured,
Not captured,Not captured,08/30/2019,Not captured,Not captured,863949,020,00072,ARS-02-0052469,Beacon America,Not captured,Not captured,Not captured,,,,Gonzalez,Jessica,J,04/01/1993,female,Not captured,Not captured,Not captured,Not captured,Not captured,Not captured,Not captured,Not captured,Not captured,Not captured,Not captured,Not captured,Not captured,,,Not captured,Not captured,Not captured,Not captured,788 union drive,,uniondale,New York,11553,,,Not captured,Not captured,wilfredokan@gmail.com,Not captured,701940312,,Not captured,Not captured,Not captured,Not captured,Not captured,Not captured,
Not captured,Not captured,08/30/2019,Not captured,Not captured,863949,020,00072,ARS-02-0052468,Beacon America,Not captured,Not captured,Not captured,,,,Canas,Wilfredo,,05/01/1991,male,Not captured,Not captured,Not captured,Not captured,Not captured,Not captured,Not captured,Not captured,Not captured,Not captured,Not captured,Not captured,Not captured,,,Not captured,Not captured,Not captured,Not captured,788 union drive,,uniondale,New York,11553,,,Not captured,Not captured,wilfredokan@gmail.com,Not captured,701940311,,Not captured,Not captured,Not captured,Not captured,Not captured,Not captured,
Not captured,Not captured,08/30/2019,Not captured,Not captured,863949,020,00072,ARS-01-0052465,Beacon International,Not captured,Not captured,Not captured,,,,Gordon,Slava,,02/03/1980,female,Not captured,Not captured,Not captured,Not captured,Not captured,Not captured,Not captured,Not captured,Not captured,Not captured,Not captured,Not captured,Not captured,,,Not captured,Not captured,Not captured,Not captured,271 North 6 street,,Brooklyn,New York,11211,,,Not captured,Not captured,stgnyc@gmail.com,Not captured,701940299,,Not captured,Not captured,Not captured,Not captured,Not captured,Not captured,
Not captured,Not captured,08/30/2019,Not captured,Not captured,863949,020,00072,ARS-02-0052464,Beacon America,Not captured,Not captured,Not captured,,,,Trajanovic,Nikola,,08/09/1964,male,Not captured,Not captured,Not captured,Not captured,Not captured,Not captured,Not captured,Not captured,Not captured,Not captured,Not captured,Not captured,Not captured,,,Not captured,Not captured,Not captured,Not captured,14 The Arbors,,New Providence,New Jersey,07974,,,Not captured,Not captured,mila.trajanovic@yahoo.com,Not captured,701940298,,Not captured,Not captured,Not captured,Not captured,Not captured,Not captured,
Not captured,Not captured,08/30/2019,Not captured,Not captured,863949,020,00072,ARS-01-0052463,Beacon International,Not captured,Not captured,Not captured,,,,Yalung,Bryan,,10/25/1984,male,Not captured,Not captured,Not captured,Not captured,Not captured,Not captured,Not captured,Not captured,Not captured,Not captured,Not captured,Not captured,Not captured,,,Not captured,Not captured,Not captured,Not captured,417 West 47th Apt 4E,,New York,New York,10036,,,Not captured,Not captured,yanrisse@yahoo.com,Not captured,701940297,,Not captured,Not captured,Not captured,Not captured,Not captured,Not captured,
Not captured,Not captured,08/30/2019,Not captured,Not captured,863949,020,00072,ARS-01-0052441,Beacon International,Not captured,Not captured,Not captured,,,,Olson Jr.,Richard,D,10/04/1967,male,Not captured,Not captured,Not captured,Not captured,Not captured,Not captured,Not captured,Not captured,Not captured,Not captured,Not captured,Not captured,Not captured,,,Not captured,Not captured,Not captured,Not captured,44 Harvest St,,Dorchester,Massachusetts,02125,,,Not captured,Not captured,richard.rsmith@gmail.com,Not captured,701940275,,Not captured,Not captured,Not captured,Not captured,Not captured,Not captured,
Not captured,Not captured,08/30/2019,Not captured,Not captured,863949,020,00072,ARS-01-0052440,Beacon International,Not captured,Not captured,Not captured,,,,Smith,Richard,R,12/16/1970,male,Not captured,Not captured,Not captured,Not captured,Not captured,Not captured,Not captured,Not captured,Not captured,Not captured,Not captured,Not captured,Not captured,,,Not captured,Not captured,Not captured,Not captured,44 Harvest St,,Dorchester,Massachusetts,02125,,,Not captured,Not captured,richard.rsmith@gmail.com,Not captured,701940274,,Not captured,Not captured,Not captured,Not captured,Not captured,Not captured,
Not captured,Not captured,08/30/2019,Not captured,Not captured,863949,020,00072,ARS-01-0052437,Beacon International,Not captured,Not captured,Not captured,Passport(A08508266),,,Abioro,Margaret Eniola,,07/10/1998,female,Not captured,Not captured,Not captured,Not captured,Not captured,Not captured,Not captured,Not captured,Not captured,Not captured,Not captured,Not captured,Not captured,,,Not captured,Not captured,Not captured,Not captured,210 East 121 Street,,New York,New York,10035,6467013912,,Not captured,Not captured,LaurenR@nextmodels.com,Not captured,701940271,,Not captured,Not captured,Not captured,Not captured,Not captured,Not captured,
Not captured,Not captured,08/30/2019,Not captured,Not captured,863949,020,00072,ARS-01-0052432,Beacon International,Not captured,Not captured,Not captured,,,,GRAHAM,ALEXANDRA,,05/31/1990,female,Not captured,Not captured,Not captured,Not captured,Not captured,Not captured,Not captured,Not captured,Not captured,Not captured,Not captured,Not captured,Not captured,,,Not captured,Not captured,Not captured,Not captured,1300 RAINWOOD LANE,,RALEIGH,North Carolina,27615,,,Not captured,Not captured,agraham@republicwireless.com,Not captured,701940182,,Not captured,Not captured,Not captured,Not captured,Not captured,Not captured,
Not captured,Not captured,08/30/2019,Not captured,Not captured,863949,020,00072,ARS-02-0052431,Beacon America,Not captured,Not captured,Not captured,,,,Fraser,Elliot,L,04/30/2019,female,Not captured,Not captured,Not captured,Not captured,Not captured,Not captured,Not captured,Not captured,Not captured,Not captured,Not captured,Not captured,Not captured,,,Not captured,Not captured,Not captured,Not captured,4242 East West Hwy,,Chevy Chase,Maryland,20815,,,Not captured,Not captured,annapfraser@gmail.com,Not captured,701940181,,Not captured,Not captured,Not captured,Not captured,Not captured,Not captured,
Not captured,Not captured,08/30/2019,Not captured,Not captured,863949,020,00072,ARS-02-0052430,Beacon America,Not captured,Not captured,Not captured,,,,Fraser,Sherilyn,A,02/21/1986,female,Not captured,Not captured,Not captured,Not captured,Not captured,Not captured,Not captured,Not captured,Not captured,Not captured,Not captured,Not captured,Not captured,,,Not captured,Not captured,Not captured,Not captured,4242 East West Hwy,,Chevy Chase,Maryland,20815,,,Not captured,Not captured,annapfraser@gmail.com,Not captured,701940180,,Not captured,Not captured,Not captured,Not captured,Not captured,Not captured,
Not captured,Not captured,08/30/2019,Not captured,Not captured,863949,020,00072,ARS-02-0052429,Beacon America,Not captured,Not captured,Not captured,,,,Fraser,Anna,P,12/24/1984,female,Not captured,Not captured,Not captured,Not captured,Not captured,Not captured,Not captured,Not captured,Not captured,Not captured,Not captured,Not captured,Not captured,,,Not captured,Not captured,Not captured,Not captured,4242 East West Hwy,,Chevy Chase,Maryland,20815,,,Not captured,Not captured,annapfraser@gmail.com,Not captured,701940179,,Not captured,Not captured,Not captured,Not captured,Not captured,Not captured,
Not captured,Not captured,08/30/2019,Not captured,Not captured,863949,020,00072,ARS-01-0052428,Beacon International,Not captured,Not captured,Not captured,,,,Sampige,Sridhar,,12/06/1984,male,Not captured,Not captured,Not captured,Not captured,Not captured,Not captured,Not captured,Not captured,Not captured,Not captured,Not captured,Not captured,Not captured,,,Not captured,Not captured,Not captured,Not captured,1345 FILLMORE ST APT 302,,SAN FRANCISCO,California,94115,,,Not captured,Not captured,divya.k1124@gmail.com,Not captured,701940178,,Not captured,Not captured,Not captured,Not captured,Not captured,Not captured,
Not captured,Not captured,08/30/2019,Not captured,Not captured,863949,020,00072,ARS-01-0052427,Beacon International,Not captured,Not captured,Not captured,,,,Krishnamurthi,Akila,,09/11/1991,female,Not captured,Not captured,Not captured,Not captured,Not captured,Not captured,Not captured,Not captured,Not captured,Not captured,Not captured,Not captured,Not captured,,,Not captured,Not captured,Not captured,Not captured,1345 FILLMORE ST APT 302,,SAN FRANCISCO,California,94115,,,Not captured,Not captured,divya.k1124@gmail.com,Not captured,701940177,,Not captured,Not captured,Not captured,Not captured,Not captured,Not captured,
Not captured,Not captured,08/30/2019,Not captured,Not captured,863949,020,00072,ARS-02-0052424,Beacon America,Not captured,Not captured,Not captured,,,,Schweitzer,Malky ,,09/23/1995,female,Not captured,Not captured,Not captured,Not captured,Not captured,Not captured,Not captured,Not captured,Not captured,Not captured,Not captured,Not captured,Not captured,,,Not captured,Not captured,Not captured,Not captured,4418 10th Avenue,,Brooklyn,,11229,3473820432,,Not captured,Not captured,avischwei@gmail.com,Not captured,701940174,,Not captured,Not captured,Not captured,Not captured,Not captured,Not captured,
Not captured,Not captured,08/30/2019,Not captured,Not captured,863949,020,00072,ARS-02-0052423,Beacon America,Not captured,Not captured,Not captured,,,,Schweitzer,Abraham,,05/20/1990,male,Not captured,Not captured,Not captured,Not captured,Not captured,Not captured,Not captured,Not captured,Not captured,Not captured,Not captured,Not captured,Not captured,,,Not captured,Not captured,Not captured,Not captured,4418 10th Avenue,,Brooklyn,,11229,3473820432,,Not captured,Not captured,avischwei@gmail.com,Not captured,701940173,,Not captured,Not captured,Not captured,Not captured,Not captured,Not captured,
Not captured,Not captured,08/29/2019,Not captured,Not captured,863949,020,00072,ARS-04-0052145,Enhanced America,Not captured,Not captured,Not captured,Passport(ZP022332),,,Bobbili,Sreenivasa,Reddy,05/22/1961,male,Not captured,Not captured,Not captured,Not captured,Not captured,Not captured,Not captured,Not captured,Not captured,Not captured,Not captured,Not captured,Not captured,,,Not captured,Not captured,Not captured,Not captured,61 Ron road,,Lusaka,Lusaka,10101,260966760845,,Not captured,Not captured,rbobbili@abramscapital.com,Not captured,701939669,,Not captured,Not captured,Not captured,Not captured,Not captured,Not captured,
Not captured,Not captured,08/30/2019,Not captured,Not captured,863949,020,00072,OVI-28-0052416,OverseasCare Visitors Insurance Plan,Not captured,Not captured,Not captured,,,,Cook,Frederick,,12/02/1927,male,Not captured,Not captured,Not captured,Not captured,Not captured,Not captured,Not captured,Not captured,Not captured,Not captured,Not captured,Not captured,Not captured,Joy Cook McKay,Joy Cook McKay ,Not captured,Not captured,Not captured,Not captured,Fox 201,,Eagle Sham,Alberta,T0H1H0,701-214-0899,,Not captured,Not captured,joycookmckay@gmail.com,Not captured,701940166,,Not captured,Not captured,Not captured,Not captured,Not captured,Not captured,
Not captured,Not captured,08/29/2019,Not captured,Not captured,863949,020,00072,ARS-01-0052413,Beacon International,Not captured,Not captured,Not captured,,,,Baumann,Danielle,M,03/20/1997,female,Not captured,Not captured,Not captured,Not captured,Not captured,Not captured,Not captured,Not captured,Not captured,Not captured,Not captured,Not captured,Not captured,,,Not captured,Not captured,Not captured,Not captured,8433 Ironside Ct.,,West Chester,Ohio,45069,,,Not captured,Not captured,daniellexxbaumann@gmail.com,Not captured,701940159,,Not captured,Not captured,Not captured,Not captured,Not captured,Not captured,
Not captured,Not captured,08/29/2019,Not captured,Not captured,863949,020,00072,ARS-02-0052411,Beacon America,Not captured,Not captured,Not captured,Passport(HG116716),,,Harivel,Colin,P.,01/28/1947,male,Not captured,Not captured,Not captured,Not captured,Not captured,Not captured,Not captured,Not captured,Not captured,Not captured,Not captured,Not captured,Not captured,Atticus Harivel,Son,Not captured,Not captured,Not captured,Not captured,16513 59th Avenue,,Surrey,British Columbia,V3S4G2,6042514407,,Not captured,Not captured,colinharivel@gmail.com,Not captured,701940157,,Not captured,Not captured,Not captured,Not captured,Not captured,Not captured,
Not captured,Not captured,08/28/2019,Not captured,Not captured,863949,020,00072,ARS-01-0052410,Beacon International,Not captured,Not captured,Not captured,,,,Caldwell,Peter,M,02/20/1993,male,Not captured,Not captured,Not captured,Not captured,Not captured,Not captured,Not captured,Not captured,Not captured,Not captured,Not captured,Not captured,Not captured,,,Not captured,Not captured,Not captured,Not captured,700 Dalen Lane,,Knoxville,Tennessee,37932,,,Not captured,Not captured,caldwell.dn@gmail.com,Not captured,701940156,,Not captured,Not captured,Not captured,Not captured,Not captured,Not captured,