EE Transaction Type,Dependent Transaction Type,Effective Date,EE Signature,EE Signature Date,Control,Suffix,Account,Plan Number,Plan Name,Claim Office,Network ID Number,Customer Code,EE SSN,Dependent SSN,Dependent Relationship,Last Name,First Name,Middle Initial,DOB,Gender,Ethnicity,PCP/PCD,PCP/PCD Current Patient,Provider Cap Office Number,COB,Dep Student Indicator,Dep OOA Indicator,EE Prior Coverage Indicator,EE Late Entrant,EE Language Indicator,Hire Date,Earnings,Earnings Frequency,Beneficiary (Last Name First Name MI),Beneficiary Relationship,Continuation of Coverage Expiration Date,Continuation of Coverage Event Date,Continuation of Coverage Length of Coverage,Work Location Zip Code,Street Address Line 1,Street Address Line 2,City,State,Zip Code,Home Phone Number,Work Phone Number,Accept Code,Evidence Code,EE Email Address,Communication Disability Code,EE Alternate ID,Dep Alternate ID,Old Control,Old Suffix,Old Account,New Control,New Suffix,New Account,
Not captured,Not captured,08/27/2019,Not captured,Not captured,863949,020,00072,ARS-01-0052390,Beacon International,Not captured,Not captured,Not captured,,,,Cicha,Kamila,,03/09/1985,female,Not captured,Not captured,Not captured,Not captured,Not captured,Not captured,Not captured,Not captured,Not captured,Not captured,Not captured,Not captured,Not captured,,,Not captured,Not captured,Not captured,Not captured,13 Evergreen Row,,Armonk,New York,10504,,,Not captured,Not captured,caleb.richelson@gmail.com,Not captured,701940064,,Not captured,Not captured,Not captured,Not captured,Not captured,Not captured,
Not captured,Not captured,08/27/2019,Not captured,Not captured,863949,020,00072,ARS-01-0052389,Beacon International,Not captured,Not captured,Not captured,,,,Richelson,Caleb,,02/25/1988,male,Not captured,Not captured,Not captured,Not captured,Not captured,Not captured,Not captured,Not captured,Not captured,Not captured,Not captured,Not captured,Not captured,,,Not captured,Not captured,Not captured,Not captured,13 Evergreen Row,,Armonk,New York,10504,,,Not captured,Not captured,caleb.richelson@gmail.com,Not captured,701940063,,Not captured,Not captured,Not captured,Not captured,Not captured,Not captured,
Not captured,Not captured,08/27/2019,Not captured,Not captured,863949,020,00072,ARS-01-0052388,Beacon International,Not captured,Not captured,Not captured,,,,Raders-Eichinger,Birgit,,05/06/1960,female,Not captured,Not captured,Not captured,Not captured,Not captured,Not captured,Not captured,Not captured,Not captured,Not captured,Not captured,Not captured,Not captured,,,Not captured,Not captured,Not captured,Not captured,502 Hansen Drive,,West Chester,Pennsylvania,19380,,,Not captured,Not captured,buddy502@ymail.com,Not captured,701940062,,Not captured,Not captured,Not captured,Not captured,Not captured,Not captured,
Not captured,Not captured,08/27/2019,Not captured,Not captured,863949,020,00072,ARS-01-0052387,Beacon International,Not captured,Not captured,Not captured,,,,Eichinger,Siegfried,,09/27/1956,male,Not captured,Not captured,Not captured,Not captured,Not captured,Not captured,Not captured,Not captured,Not captured,Not captured,Not captured,Not captured,Not captured,,,Not captured,Not captured,Not captured,Not captured,502 Hansen Drive,,West Chester,Pennsylvania,19380,,,Not captured,Not captured,buddy502@ymail.com,Not captured,701940061,,Not captured,Not captured,Not captured,Not captured,Not captured,Not captured,
Not captured,Not captured,08/27/2019,Not captured,Not captured,863949,020,00072,ARS-02-0052383,Beacon America,Not captured,Not captured,Not captured,Passport(132957171),,,Tomaselli,Maria Antonieta,,11/14/1957,female,Not captured,Not captured,Not captured,Not captured,Not captured,Not captured,Not captured,Not captured,Not captured,Not captured,Not captured,Not captured,Not captured,Maria Daniella Macuare,Hija,Not captured,Not captured,Not captured,Not captured,Carrera 1 casa # 3 Sector Campo Obrero,,Maturin,Monagas,6201,+584147653553,,Not captured,Not captured,jata30@hotmail.com,Not captured,701940053,,Not captured,Not captured,Not captured,Not captured,Not captured,Not captured,
Not captured,Not captured,08/27/2019,Not captured,Not captured,863949,020,00072,ARS-01-0052382,Beacon International,Not captured,Not captured,Not captured,,,,Davis,Marcus,A,03/24/1989,male,Not captured,Not captured,Not captured,Not captured,Not captured,Not captured,Not captured,Not captured,Not captured,Not captured,Not captured,Not captured,Not captured,,,Not captured,Not captured,Not captured,Not captured,5454 S Shore Dr Apt 1307,,Chicago,Illinois,60615,,,Not captured,Not captured,marcus.a.davis24@gmail.com,Not captured,701940052,,Not captured,Not captured,Not captured,Not captured,Not captured,Not captured,
Not captured,Not captured,08/27/2019,Not captured,Not captured,863949,020,00072,ARS-01-0052380,Beacon International,Not captured,Not captured,Not captured,,,,Audibert,Alice,,08/31/1976,female,Not captured,Not captured,Not captured,Not captured,Not captured,Not captured,Not captured,Not captured,Not captured,Not captured,Not captured,Not captured,Not captured,,,Not captured,Not captured,Not captured,Not captured,1341 58th Ave,,Oakland,California,94621,,,Not captured,Not captured,scottlydon18@gmail.com,Not captured,701940047,,Not captured,Not captured,Not captured,Not captured,Not captured,Not captured,
Not captured,Not captured,08/27/2019,Not captured,Not captured,863949,020,00072,ARS-01-0052379,Beacon International,Not captured,Not captured,Not captured,,,,Lydon,Scott,,11/17/1988,male,Not captured,Not captured,Not captured,Not captured,Not captured,Not captured,Not captured,Not captured,Not captured,Not captured,Not captured,Not captured,Not captured,,,Not captured,Not captured,Not captured,Not captured,240 Robin rd. Hillsborough,,Hillsborough,California,94010,,,Not captured,Not captured,scottlydon18@gmail.com,Not captured,701940046,,Not captured,Not captured,Not captured,Not captured,Not captured,Not captured,
Not captured,Not captured,08/27/2019,Not captured,Not captured,863949,020,00072,ARS-02-0052378,Beacon America,Not captured,Not captured,Not captured,,,,Fleischman ,Malky ,,11/20/2017,female,Not captured,Not captured,Not captured,Not captured,Not captured,Not captured,Not captured,Not captured,Not captured,Not captured,Not captured,Not captured,Not captured,,,Not captured,Not captured,Not captured,Not captured,180 Locust Street,,Lakewood,New Jersey,08701,732-363-7323 ,,Not captured,Not captured,Shmulyf15@gmail.com,Not captured,701940045,,Not captured,Not captured,Not captured,Not captured,Not captured,Not captured,
Not captured,Not captured,08/27/2019,Not captured,Not captured,863949,020,00072,ARS-02-0052377,Beacon America,Not captured,Not captured,Not captured,,,,Fleischman ,Toby ,,02/05/2013,female,Not captured,Not captured,Not captured,Not captured,Not captured,Not captured,Not captured,Not captured,Not captured,Not captured,Not captured,Not captured,Not captured,,,Not captured,Not captured,Not captured,Not captured,180 Locust Street,,Lakewood,New Jersey,08701,732-363-7323 ,,Not captured,Not captured,Shmulyf15@gmail.com,Not captured,701940044,,Not captured,Not captured,Not captured,Not captured,Not captured,Not captured,
Not captured,Not captured,08/27/2019,Not captured,Not captured,863949,020,00072,ARS-02-0052376,Beacon America,Not captured,Not captured,Not captured,,,,Fleischman ,Leah,,09/04/2010,female,Not captured,Not captured,Not captured,Not captured,Not captured,Not captured,Not captured,Not captured,Not captured,Not captured,Not captured,Not captured,Not captured,,,Not captured,Not captured,Not captured,Not captured,180 Locust Street,,Lakewood,New Jersey,08701,732-363-7323 ,,Not captured,Not captured,Shmulyf15@gmail.com,Not captured,701940043,,Not captured,Not captured,Not captured,Not captured,Not captured,Not captured,
Not captured,Not captured,08/27/2019,Not captured,Not captured,863949,020,00072,ARS-02-0052375,Beacon America,Not captured,Not captured,Not captured,,,,Fleischman ,Blima,,05/02/1990,female,Not captured,Not captured,Not captured,Not captured,Not captured,Not captured,Not captured,Not captured,Not captured,Not captured,Not captured,Not captured,Not captured,,,Not captured,Not captured,Not captured,Not captured,180 Locust Street,,Lakewood,New Jersey,08701,732-363-7323 ,,Not captured,Not captured,Shmulyf15@gmail.com,Not captured,701940042,,Not captured,Not captured,Not captured,Not captured,Not captured,Not captured,
Not captured,Not captured,08/27/2019,Not captured,Not captured,863949,020,00072,ARS-02-0052374,Beacon America,Not captured,Not captured,Not captured,,,,Fleischman ,Shmuel,,11/15/1989,male,Not captured,Not captured,Not captured,Not captured,Not captured,Not captured,Not captured,Not captured,Not captured,Not captured,Not captured,Not captured,Not captured,,,Not captured,Not captured,Not captured,Not captured,180 Locust Street,,Lakewood,New Jersey,08701,732-363-7323 ,,Not captured,Not captured,Shmulyf15@gmail.com,Not captured,701940041,,Not captured,Not captured,Not captured,Not captured,Not captured,Not captured,
Not captured,Not captured,08/27/2019,Not captured,Not captured,863949,020,00072,ARS-02-0052372,Beacon America,Not captured,Not captured,Not captured,,,,Friedman,Rachel ,,12/05/2003,female,Not captured,Not captured,Not captured,Not captured,Not captured,Not captured,Not captured,Not captured,Not captured,Not captured,Not captured,Not captured,Not captured,,,Not captured,Not captured,Not captured,Not captured,4 Plymouth Pl,,Airmont,New York,10952,845-354-4188,,Not captured,Not captured,devorah222@gmail.com,Not captured,701940039,,Not captured,Not captured,Not captured,Not captured,Not captured,Not captured,
Not captured,Not captured,08/27/2019,Not captured,Not captured,863949,020,00072,ARS-02-0052371,Beacon America,Not captured,Not captured,Not captured,,,,Friedman,Chana,,09/18/1998,female,Not captured,Not captured,Not captured,Not captured,Not captured,Not captured,Not captured,Not captured,Not captured,Not captured,Not captured,Not captured,Not captured,,,Not captured,Not captured,Not captured,Not captured,4 Plymouth Pl,,Airmont,New York,10952,845-354-4188,,Not captured,Not captured,devorah222@gmail.com,Not captured,701940038,,Not captured,Not captured,Not captured,Not captured,Not captured,Not captured,
Not captured,Not captured,08/27/2019,Not captured,Not captured,863949,020,00072,ARS-02-0052370,Beacon America,Not captured,Not captured,Not captured,,,,Friedman,Joseph,,02/24/1975,male,Not captured,Not captured,Not captured,Not captured,Not captured,Not captured,Not captured,Not captured,Not captured,Not captured,Not captured,Not captured,Not captured,,,Not captured,Not captured,Not captured,Not captured,4 Plymouth Pl,,Airmont,New York,10952,845-354-4188,,Not captured,Not captured,devorah222@gmail.com,Not captured,701940037,,Not captured,Not captured,Not captured,Not captured,Not captured,Not captured,
Not captured,Not captured,08/27/2019,Not captured,Not captured,863949,020,00072,ARS-02-0052369,Beacon America,Not captured,Not captured,Not captured,,,,Friedman,Devorah,,01/21/1975,female,Not captured,Not captured,Not captured,Not captured,Not captured,Not captured,Not captured,Not captured,Not captured,Not captured,Not captured,Not captured,Not captured,,,Not captured,Not captured,Not captured,Not captured,4 Plymouth Pl,,Airmont,New York,10952,845-354-4188,,Not captured,Not captured,devorah222@gmail.com,Not captured,701940036,,Not captured,Not captured,Not captured,Not captured,Not captured,Not captured,
Not captured,Not captured,08/26/2019,Not captured,Not captured,863949,020,00072,ARS-01-0052368,Beacon International,Not captured,Not captured,Not captured,,,,Nakama,Sehun,,12/15/1992,male,Not captured,Not captured,Not captured,Not captured,Not captured,Not captured,Not captured,Not captured,Not captured,Not captured,Not captured,Not captured,Not captured,,,Not captured,Not captured,Not captured,Not captured,2104 Wilder Ave,,Honolulu,Hawaii,96822,,,Not captured,Not captured,sehun.nakama@gmail.com,Not captured,701940035,,Not captured,Not captured,Not captured,Not captured,Not captured,Not captured,
Not captured,Not captured,08/26/2019,Not captured,Not captured,863949,020,00072,ARS-01-0052366,Beacon International,Not captured,Not captured,Not captured,,,,Zeilberger,Arye L,,01/17/1962,male,Not captured,Not captured,Not captured,Not captured,Not captured,Not captured,Not captured,Not captured,Not captured,Not captured,Not captured,Not captured,Not captured,,,Not captured,Not captured,Not captured,Not captured,118 Washington Ave,,Highland Park,New Jersey,08904,732-718-0668,,Not captured,Not captured,chaniezeilberger@gmail.com,Not captured,701940033,,Not captured,Not captured,Not captured,Not captured,Not captured,Not captured,
Not captured,Not captured,08/26/2019,Not captured,Not captured,863949,020,00072,ARS-36-0052363,Beacon Student Elite,Not captured,Not captured,Not captured,Passport(096781489),,,Lopez,Patricia,,04/28/1999,male,Not captured,Not captured,Not captured,Not captured,Not captured,Not captured,Not captured,Not captured,Not captured,Not captured,Not captured,Not captured,Not captured,Jiklor Chacon,Father,Not captured,Not captured,Not captured,Not captured,Ave. Universidad Paramillo Urb. Garden&apos;s Country Club Casa #24,,San Cristobal,Tachira,5001,2132357846,,Not captured,Not captured,patriciavchaconl@gmail.com,Not captured,701940030,,Not captured,Not captured,Not captured,Not captured,Not captured,Not captured,
Not captured,Not captured,08/26/2019,Not captured,Not captured,863949,020,00072,ARS-02-0052362,Beacon America,Not captured,Not captured,Not captured,,,,Gestetner,Fraidy,,06/04/2019,female,Not captured,Not captured,Not captured,Not captured,Not captured,Not captured,Not captured,Not captured,Not captured,Not captured,Not captured,Not captured,Not captured,,,Not captured,Not captured,Not captured,Not captured,112 Vine Ave,,Lakewood,New Jersey,08701,347-860-1834,,Not captured,Not captured,esty.gestetner@gmail.com,Not captured,701940029,,Not captured,Not captured,Not captured,Not captured,Not captured,Not captured,
Not captured,Not captured,08/26/2019,Not captured,Not captured,863949,020,00072,ARS-02-0052361,Beacon America,Not captured,Not captured,Not captured,,,,Gestetner,Meyer,,06/03/2013,male,Not captured,Not captured,Not captured,Not captured,Not captured,Not captured,Not captured,Not captured,Not captured,Not captured,Not captured,Not captured,Not captured,,,Not captured,Not captured,Not captured,Not captured,112 Vine Ave,,Lakewood,New Jersey,08701,347-860-1834,,Not captured,Not captured,esty.gestetner@gmail.com,Not captured,701940028,,Not captured,Not captured,Not captured,Not captured,Not captured,Not captured,
Not captured,Not captured,08/26/2019,Not captured,Not captured,863949,020,00072,ARS-02-0052360,Beacon America,Not captured,Not captured,Not captured,,,,Gestetner,Yehudis,,08/18/2013,male,Not captured,Not captured,Not captured,Not captured,Not captured,Not captured,Not captured,Not captured,Not captured,Not captured,Not captured,Not captured,Not captured,,,Not captured,Not captured,Not captured,Not captured,112 Vine Ave,,Lakewood,New Jersey,08701,347-860-1834,,Not captured,Not captured,esty.gestetner@gmail.com,Not captured,701940027,,Not captured,Not captured,Not captured,Not captured,Not captured,Not captured,
Not captured,Not captured,08/26/2019,Not captured,Not captured,863949,020,00072,ARS-02-0052359,Beacon America,Not captured,Not captured,Not captured,,,,Gestetner,Avrohom,,05/18/2011,male,Not captured,Not captured,Not captured,Not captured,Not captured,Not captured,Not captured,Not captured,Not captured,Not captured,Not captured,Not captured,Not captured,,,Not captured,Not captured,Not captured,Not captured,112 Vine Ave,,Lakewood,New Jersey,08701,347-860-1834,,Not captured,Not captured,esty.gestetner@gmail.com,Not captured,701940026,,Not captured,Not captured,Not captured,Not captured,Not captured,Not captured,
Not captured,Not captured,08/26/2019,Not captured,Not captured,863949,020,00072,ARS-02-0052358,Beacon America,Not captured,Not captured,Not captured,,,,Gestetner,Daniel,,05/03/2009,male,Not captured,Not captured,Not captured,Not captured,Not captured,Not captured,Not captured,Not captured,Not captured,Not captured,Not captured,Not captured,Not captured,,,Not captured,Not captured,Not captured,Not captured,112 Vine Ave,,Lakewood,New Jersey,08701,347-860-1834,,Not captured,Not captured,esty.gestetner@gmail.com,Not captured,701940025,,Not captured,Not captured,Not captured,Not captured,Not captured,Not captured,
Not captured,Not captured,08/26/2019,Not captured,Not captured,863949,020,00072,ARS-02-0052357,Beacon America,Not captured,Not captured,Not captured,,,,Gestetner,Esther,,01/12/1984,female,Not captured,Not captured,Not captured,Not captured,Not captured,Not captured,Not captured,Not captured,Not captured,Not captured,Not captured,Not captured,Not captured,,,Not captured,Not captured,Not captured,Not captured,112 Vine Ave,,Lakewood,New Jersey,08701,347-860-1834,,Not captured,Not captured,esty.gestetner@gmail.com,Not captured,701940024,,Not captured,Not captured,Not captured,Not captured,Not captured,Not captured,
Not captured,Not captured,08/27/2019,Not captured,Not captured,863949,020,00072,ARS-01-0052356,Beacon International,Not captured,Not captured,Not captured,,,,Moskowitz,Abe,,07/01/2000,male,Not captured,Not captured,Not captured,Not captured,Not captured,Not captured,Not captured,Not captured,Not captured,Not captured,Not captured,Not captured,Not captured,,,Not captured,Not captured,Not captured,Not captured,2 Park slop Terrace,,Lakewood,New Jersey,08701,732-901-6636,,Not captured,Not captured,mmonticarlo@aol.com,Not captured,701940023,,Not captured,Not captured,Not captured,Not captured,Not captured,Not captured,
Not captured,Not captured,08/26/2019,Not captured,Not captured,863949,020,00072,ARS-01-0052355,Beacon International,Not captured,Not captured,Not captured,,,,Codyer,Thomas,,10/20/1988,male,Not captured,Not captured,Not captured,Not captured,Not captured,Not captured,Not captured,Not captured,Not captured,Not captured,Not captured,Not captured,Not captured,,,Not captured,Not captured,Not captured,Not captured,122 Townsend St,,Pepperell,Massachusetts,01463,,,Not captured,Not captured,Thomascodyer@gmail.com,Not captured,701940022,,Not captured,Not captured,Not captured,Not captured,Not captured,Not captured,
Not captured,Not captured,08/26/2019,Not captured,Not captured,863949,020,00072,ARS-01-0052354,Beacon International,Not captured,Not captured,Not captured,Passport(081155484),,,Sleiman Montagna,Indhira Victoria,,03/13/2000,female,Not captured,Not captured,Not captured,Not captured,Not captured,Not captured,Not captured,Not captured,Not captured,Not captured,Not captured,Not captured,Not captured,Carlos Sleiman,Padre,Not captured,Not captured,Not captured,Not captured,calle 14 nro 21-81,,SAN CRISTOBAL,Tachira,5001,+584147069647,,Not captured,Not captured,oficinafg2011@hotmail.com,Not captured,701939933,,Not captured,Not captured,Not captured,Not captured,Not captured,Not captured,
Not captured,Not captured,08/27/2019,Not captured,Not captured,863949,020,00072,ARS-01-0052351,Beacon International,Not captured,Not captured,Not captured,Passport(AD974667),,,Nyhus,Matthew,D,12/08/1994,male,Not captured,Not captured,Not captured,Not captured,Not captured,Not captured,Not captured,Not captured,Not captured,Not captured,Not captured,Not captured,Not captured,Glen Nyhus,Father,Not captured,Not captured,Not captured,Not captured,195 Abraham St,,Cambridge,Ontario,N3H 1H4,5196500759,,Not captured,Not captured,mdnyhus@gmail.com,Not captured,701939930,,Not captured,Not captured,Not captured,Not captured,Not captured,Not captured,
Not captured,Not captured,08/26/2019,Not captured,Not captured,863949,020,00072,ARS-02-0052349,Beacon America,Not captured,Not captured,Not captured,Passport(P4545623),,,Karrey,Veeraiah,,03/16/1952,male,Not captured,Not captured,Not captured,Not captured,Not captured,Not captured,Not captured,Not captured,Not captured,Not captured,Not captured,Not captured,Not captured,Prasanna Karrey,Daughter,Not captured,Not captured,Not captured,Not captured,132 Newyork St,,Redlands,California,92373,513-319-1740,,Not captured,Not captured,sai.kapala@gmail.com,Not captured,701939928,,Not captured,Not captured,Not captured,Not captured,Not captured,Not captured,
Not captured,Not captured,08/27/2019,Not captured,Not captured,863949,020,00072,ARS-03-0052298,Essential America,Not captured,Not captured,Not captured,Passport(477331248),,,Blair,Brittany,Melinda,07/08/1992,female,Not captured,Not captured,Not captured,Not captured,Not captured,Not captured,Not captured,Not captured,Not captured,Not captured,Not captured,Not captured,Not captured,,,Not captured,Not captured,Not captured,Not captured,1930 Carters Valley,,Surgoinsville,Tennessee,37873,423-557-5304,,Not captured,Not captured,mblair114@yahoo.com,Not captured,701939869,,Not captured,Not captured,Not captured,Not captured,Not captured,Not captured,
Not captured,Not captured,08/27/2019,Not captured,Not captured,863949,020,00072,ARS-03-0052302,Essential America,Not captured,Not captured,Not captured,SSN(414516708),,,Winegar,Tucoma,Rachelle,05/15/1986,female,Not captured,Not captured,Not captured,Not captured,Not captured,Not captured,Not captured,Not captured,Not captured,Not captured,Not captured,Not captured,Not captured,,,Not captured,Not captured,Not captured,Not captured,1930 Carters Valley,,Surgoinsville,Tennessee,37873,4232931008,,Not captured,Not captured,tucomawinegar@gmail.com,Not captured,701939873,,Not captured,Not captured,Not captured,Not captured,Not captured,Not captured,
Not captured,Not captured,08/27/2019,Not captured,Not captured,863949,020,00072,ARS-03-0051791,Essential America,Not captured,Not captured,Not captured,Passport(490715521),,,Kim,Chong,k,06/28/1965,male,Not captured,Not captured,Not captured,Not captured,Not captured,Not captured,Not captured,Not captured,Not captured,Not captured,Not captured,Not captured,Not captured,,,Not captured,Not captured,Not captured,Not captured,Tianyu Shengtai Jai Yuen,,Yanji Jilin province China,Jilin,133000,86-158-4330-8673,,Not captured,Not captured,h3kim2013@gmail.com,Not captured,701939054,,Not captured,Not captured,Not captured,Not captured,Not captured,Not captured,
Not captured,Not captured,08/27/2019,Not captured,Not captured,863949,020,00072,ARS-03-0051791,Essential America,Not captured,Not captured,Not captured,,Passport(489273627),Spouse,kim,Jean,o,10/30/1964,female,Not captured,Not captured,Not captured,Not captured,Not captured,Not captured,Not captured,Not captured,Not captured,Not captured,Not captured,Not captured,Not captured,,,Not captured,Not captured,Not captured,Not captured,Tianyu Shengtai Jai Yuen,,Yanji Jilin province China,Jilin,133000,86-158-4330-8673,,Not captured,Not captured,h3kim2013@gmail.com,Not captured,,701939055,Not captured,Not captured,Not captured,Not captured,Not captured,Not captured,
Not captured,Not captured,09/28/2019,Not captured,Not captured,863949,020,00072,BG001030-23-b0c368a2,International Assurance,Not captured,Not captured,Not captured,-,-,,Baird,Michele,,11/6/1955,female,Not captured,Not captured,Not captured,Not captured,Not captured,Not captured,Not captured,Not captured,Not captured,Not captured,Not captured,Not captured,Not captured,,,Not captured,Not captured,Not captured,Not captured,1240 HW J,,Linn,Missouri,65051,573-691-9320,,Not captured,Not captured,dihop@yahoo.com,Not captured,701940056,,Not captured,Not captured,Not captured,Not captured,Not captured,Not captured,