EE Transaction Type,Dependent Transaction Type,Effective Date,EE Signature,EE Signature Date,Control,Suffix,Account,Plan Number,Plan Name,Claim Office,Network ID Number,Customer Code,EE SSN,Dependent SSN,Dependent Relationship,Last Name,First Name,Middle Initial,DOB,Gender,Ethnicity,PCP/PCD,PCP/PCD Current Patient,Provider Cap Office Number,COB,Dep Student Indicator,Dep OOA Indicator,EE Prior Coverage Indicator,EE Late Entrant,EE Language Indicator,Hire Date,Earnings,Earnings Frequency,Beneficiary (Last Name First Name MI),Beneficiary Relationship,Continuation of Coverage Expiration Date,Continuation of Coverage Event Date,Continuation of Coverage Length of Coverage,Work Location Zip Code,Street Address Line 1,Street Address Line 2,City,State,Zip Code,Home Phone Number,Work Phone Number,Accept Code,Evidence Code,EE Email Address,Communication Disability Code,EE Alternate ID,Dep Alternate ID,Old Control,Old Suffix,Old Account,New Control,New Suffix,New Account,
Not captured,Not captured,08/25/2019,Not captured,Not captured,863949,020,00072,ARS-01-0052346,Beacon International,Not captured,Not captured,Not captured,,,,Zablotsky,Yehoshua,,08/17/2002,male,Not captured,Not captured,Not captured,Not captured,Not captured,Not captured,Not captured,Not captured,Not captured,Not captured,Not captured,Not captured,Not captured,,,Not captured,Not captured,Not captured,Not captured,1441 41st st,,Brooklyn,New York,11218,,,Not captured,Not captured,sales@zionjudaica.com,Not captured,701939925,,Not captured,Not captured,Not captured,Not captured,Not captured,Not captured,
Not captured,Not captured,08/25/2019,Not captured,Not captured,863949,020,00072,ARS-01-0052345,Beacon International,Not captured,Not captured,Not captured,,,,Kumbuka,Khalid,,10/21/1982,male,Not captured,Not captured,Not captured,Not captured,Not captured,Not captured,Not captured,Not captured,Not captured,Not captured,Not captured,Not captured,Not captured,,,Not captured,Not captured,Not captured,Not captured,Po Box 10252,,Dar es Salaam,,DSM,,,Not captured,Not captured,k.kumbuka@googlemail.com,Not captured,701939924,,Not captured,Not captured,Not captured,Not captured,Not captured,Not captured,
Not captured,Not captured,08/24/2019,Not captured,Not captured,863949,020,00072,ARS-01-0052342,Beacon International,Not captured,Not captured,Not captured,,,,Druppel,Amanda,,10/03/1987,female,Not captured,Not captured,Not captured,Not captured,Not captured,Not captured,Not captured,Not captured,Not captured,Not captured,Not captured,Not captured,Not captured,,,Not captured,Not captured,Not captured,Not captured,2146 Columbia St,,San Diego,California,92101,,,Not captured,Not captured,amanda.druppel@gmail.com,Not captured,701939918,,Not captured,Not captured,Not captured,Not captured,Not captured,Not captured,
Not captured,Not captured,08/24/2019,Not captured,Not captured,863949,020,00072,ARS-01-0052341,Beacon International,Not captured,Not captured,Not captured,,,,Brower,Michelle,,08/25/1987,female,Not captured,Not captured,Not captured,Not captured,Not captured,Not captured,Not captured,Not captured,Not captured,Not captured,Not captured,Not captured,Not captured,,,Not captured,Not captured,Not captured,Not captured,1225 Island Ave #217,,San Diego,California,92101,,,Not captured,Not captured,brower.michelle@yahoo.com,Not captured,701939917,,Not captured,Not captured,Not captured,Not captured,Not captured,Not captured,
Not captured,Not captured,08/24/2019,Not captured,Not captured,863949,020,00072,ARS-01-0052338,Beacon International,Not captured,Not captured,Not captured,,,,Kim,Clara,,07/23/1978,female,Not captured,Not captured,Not captured,Not captured,Not captured,Not captured,Not captured,Not captured,Not captured,Not captured,Not captured,Not captured,Not captured,,,Not captured,Not captured,Not captured,Not captured,Jeongja Il-ro 156 Beon-gil 12,,Seongnam-si,,13558,,,Not captured,Not captured,clarak@outlook.com,Not captured,701939914,,Not captured,Not captured,Not captured,Not captured,Not captured,Not captured,
Not captured,Not captured,08/24/2019,Not captured,Not captured,863949,020,00072,ARS-01-0052337,Beacon International,Not captured,Not captured,Not captured,,,,Gainfort,Nancy,L,05/03/1957,female,Not captured,Not captured,Not captured,Not captured,Not captured,Not captured,Not captured,Not captured,Not captured,Not captured,Not captured,Not captured,Not captured,,,Not captured,Not captured,Not captured,Not captured,450 marsh duck way,,Virginia Beach,Virginia,23451,,,Not captured,Not captured,nancyleigh.gainfort@gmail.com,Not captured,701939913,,Not captured,Not captured,Not captured,Not captured,Not captured,Not captured,
Not captured,Not captured,08/24/2019,Not captured,Not captured,863949,020,00072,ARS-01-0052335,Beacon International,Not captured,Not captured,Not captured,,,,Roach,Miles,E,02/23/2019,male,Not captured,Not captured,Not captured,Not captured,Not captured,Not captured,Not captured,Not captured,Not captured,Not captured,Not captured,Not captured,Not captured,,,Not captured,Not captured,Not captured,Not captured,102 N Freeman St,,Oceanside,California,92054,7602075441,,Not captured,Not captured,roachtunes@outlook.com,Not captured,701939911,,Not captured,Not captured,Not captured,Not captured,Not captured,Not captured,
Not captured,Not captured,08/24/2019,Not captured,Not captured,863949,020,00072,ARS-01-0052334,Beacon International,Not captured,Not captured,Not captured,,,,Roach,Annajak,J,08/04/2015,female,Not captured,Not captured,Not captured,Not captured,Not captured,Not captured,Not captured,Not captured,Not captured,Not captured,Not captured,Not captured,Not captured,,,Not captured,Not captured,Not captured,Not captured,102 N Freeman St,,Oceanside,California,92054,7602075441,,Not captured,Not captured,roachtunes@outlook.com,Not captured,701939910,,Not captured,Not captured,Not captured,Not captured,Not captured,Not captured,
Not captured,Not captured,08/24/2019,Not captured,Not captured,863949,020,00072,ARS-01-0052333,Beacon International,Not captured,Not captured,Not captured,,,,Roach,Eddie,D,09/16/1977,male,Not captured,Not captured,Not captured,Not captured,Not captured,Not captured,Not captured,Not captured,Not captured,Not captured,Not captured,Not captured,Not captured,,,Not captured,Not captured,Not captured,Not captured,102 N Freeman St,,Oceanside,California,92054,7602075441,,Not captured,Not captured,roachtunes@outlook.com,Not captured,701939909,,Not captured,Not captured,Not captured,Not captured,Not captured,Not captured,
Not captured,Not captured,08/24/2019,Not captured,Not captured,863949,020,00072,ARS-01-0052332,Beacon International,Not captured,Not captured,Not captured,Passport(531050918),,,Roach,Bethany ,E,06/01/1984,female,Not captured,Not captured,Not captured,Not captured,Not captured,Not captured,Not captured,Not captured,Not captured,Not captured,Not captured,Not captured,Not captured,,,Not captured,Not captured,Not captured,Not captured,102 N Freeman St,,Oceanside,California,92054,7602075441,,Not captured,Not captured,roachtunes@outlook.com,Not captured,701939908,,Not captured,Not captured,Not captured,Not captured,Not captured,Not captured,
Not captured,Not captured,08/24/2019,Not captured,Not captured,863949,020,00072,ARS-01-0052330,Beacon International,Not captured,Not captured,Not captured,,,,Benorden,Deanne,L,02/04/1965,female,Not captured,Not captured,Not captured,Not captured,Not captured,Not captured,Not captured,Not captured,Not captured,Not captured,Not captured,Not captured,Not captured,,,Not captured,Not captured,Not captured,Not captured,11764 Crystal Brook Lane,,Knoxville,Tennessee,37934,,,Not captured,Not captured,dlbenorden@yahoo.com,Not captured,701939906,,Not captured,Not captured,Not captured,Not captured,Not captured,Not captured,
Not captured,Not captured,08/24/2019,Not captured,Not captured,863949,020,00072,ARS-01-0052329,Beacon International,Not captured,Not captured,Not captured,,,,Benorden,Larry,A,12/13/1959,male,Not captured,Not captured,Not captured,Not captured,Not captured,Not captured,Not captured,Not captured,Not captured,Not captured,Not captured,Not captured,Not captured,,,Not captured,Not captured,Not captured,Not captured,11764 Crystal Brook Lane,,Knoxville,Tennessee,37934,,,Not captured,Not captured,dlbenorden@yahoo.com,Not captured,701939905,,Not captured,Not captured,Not captured,Not captured,Not captured,Not captured,
Not captured,Not captured,08/23/2019,Not captured,Not captured,863949,020,00072,ARS-02-0052328,Beacon America,Not captured,Not captured,Not captured,,,,LI,JIAWEN,,11/04/2001,female,Not captured,Not captured,Not captured,Not captured,Not captured,Not captured,Not captured,Not captured,Not captured,Not captured,Not captured,Not captured,Not captured,JIAWEN LI,DAUGHTER,Not captured,Not captured,Not captured,Not captured,1350 Trinity Dr,,Menlo Park,California,94025,7025210981,,Not captured,Not captured,JHY3025@SINA.COM,Not captured,701939901,,Not captured,Not captured,Not captured,Not captured,Not captured,Not captured,
Not captured,Not captured,08/23/2019,Not captured,Not captured,863949,020,00072,ARS-02-0052327,Beacon America,Not captured,Not captured,Not captured,Passport(G43618908),,,JIANG,HUAYING,,06/24/1977,female,Not captured,Not captured,Not captured,Not captured,Not captured,Not captured,Not captured,Not captured,Not captured,Not captured,Not captured,Not captured,Not captured,JIAWEN LI,DAUGHTER,Not captured,Not captured,Not captured,Not captured,1350 Trinity Dr,,Menlo Park,California,94025,7025210981,,Not captured,Not captured,JHY3025@SINA.COM,Not captured,701939900,,Not captured,Not captured,Not captured,Not captured,Not captured,Not captured,
Not captured,Not captured,08/23/2019,Not captured,Not captured,863949,020,00072,ARS-02-0052325,Beacon America,Not captured,Not captured,Not captured,,,,moses,anne,m,11/10/1963,female,Not captured,Not captured,Not captured,Not captured,Not captured,Not captured,Not captured,Not captured,Not captured,Not captured,Not captured,Not captured,Not captured,,,Not captured,Not captured,Not captured,Not captured,22022 111 ave sw,,Vashon,Washington,98070,,,Not captured,Not captured,netting63@gmail.com,Not captured,701939898,,Not captured,Not captured,Not captured,Not captured,Not captured,Not captured,
Not captured,Not captured,08/24/2019,Not captured,Not captured,863949,020,00072,ARS-01-0052324,Beacon International,Not captured,Not captured,Not captured,,,,McCormack,Lystra,C,04/14/1972,female,Not captured,Not captured,Not captured,Not captured,Not captured,Not captured,Not captured,Not captured,Not captured,Not captured,Not captured,Not captured,Not captured,Ashley McCormack,daughter,Not captured,Not captured,Not captured,Not captured,119 Island Drive,,Long Pond,Pennsylvania,18334,212-432-1831,,Not captured,Not captured,mervin.Mccormack@foason.com,Not captured,701939897,,Not captured,Not captured,Not captured,Not captured,Not captured,Not captured,
Not captured,Not captured,08/24/2019,Not captured,Not captured,863949,020,00072,ARS-01-0052323,Beacon International,Not captured,Not captured,Not captured,Passport(4674281091),,,McCormack,Mervin,W,09/06/1965,male,Not captured,Not captured,Not captured,Not captured,Not captured,Not captured,Not captured,Not captured,Not captured,Not captured,Not captured,Not captured,Not captured,Ashley McCormack,daughter,Not captured,Not captured,Not captured,Not captured,119 Island Drive,,Long Pond,Pennsylvania,18334,212-432-1831,,Not captured,Not captured,mervin.Mccormack@foason.com,Not captured,701939896,,Not captured,Not captured,Not captured,Not captured,Not captured,Not captured,
Not captured,Not captured,08/23/2019,Not captured,Not captured,863949,020,00072,ARS-01-0052319,Beacon International,Not captured,Not captured,Not captured,,,,Goodloe,Laura,E,11/02/1989,female,Not captured,Not captured,Not captured,Not captured,Not captured,Not captured,Not captured,Not captured,Not captured,Not captured,Not captured,Not captured,Not captured,,,Not captured,Not captured,Not captured,Not captured,2724 Barberry Drive,,Hobart,Indiana,46342,,,Not captured,Not captured,goodloe.dale@gmail.com,Not captured,701939890,,Not captured,Not captured,Not captured,Not captured,Not captured,Not captured,
Not captured,Not captured,08/23/2019,Not captured,Not captured,863949,020,00072,ARS-01-0052318,Beacon International,Not captured,Not captured,Not captured,,,,Goodloe,Dale,D,11/08/1988,male,Not captured,Not captured,Not captured,Not captured,Not captured,Not captured,Not captured,Not captured,Not captured,Not captured,Not captured,Not captured,Not captured,,,Not captured,Not captured,Not captured,Not captured,2724 Barberry Drive,,Hobart,Indiana,46342,,,Not captured,Not captured,goodloe.dale@gmail.com,Not captured,701939889,,Not captured,Not captured,Not captured,Not captured,Not captured,Not captured,
Not captured,Not captured,08/23/2019,Not captured,Not captured,863949,020,00072,ARS-02-0052315,Beacon America,Not captured,Not captured,Not captured,,,,Scott,John,H,01/21/1978,male,Not captured,Not captured,Not captured,Not captured,Not captured,Not captured,Not captured,Not captured,Not captured,Not captured,Not captured,Not captured,Not captured,,,Not captured,Not captured,Not captured,Not captured,1200 S Rolling Ridge Way,,Bloomington,Indiana,47403,,,Not captured,Not captured,john.hg.scott@gmail.com,Not captured,701939886,,Not captured,Not captured,Not captured,Not captured,Not captured,Not captured,
Not captured,Not captured,08/23/2019,Not captured,Not captured,863949,020,00072,ARS-02-0052314,Beacon America,Not captured,Not captured,Not captured,,,,Fowlie,Meaghan,,05/13/1979,female,Not captured,Not captured,Not captured,Not captured,Not captured,Not captured,Not captured,Not captured,Not captured,Not captured,Not captured,Not captured,Not captured,,,Not captured,Not captured,Not captured,Not captured,achter sint pieter 11m,,Utrecht,,3512hp,,,Not captured,Not captured,meaghanfowlie@gmail.com,Not captured,701939885,,Not captured,Not captured,Not captured,Not captured,Not captured,Not captured,
Not captured,Not captured,08/23/2019,Not captured,Not captured,863949,020,00072,ARS-01-0052313,Beacon International,Not captured,Not captured,Not captured,,,,Moore,Lungiswa,,10/21/1985,female,Not captured,Not captured,Not captured,Not captured,Not captured,Not captured,Not captured,Not captured,Not captured,Not captured,Not captured,Not captured,Not captured,,,Not captured,Not captured,Not captured,Not captured,23005 Golfview Dr,,Southfield,Michigan,48033,,,Not captured,Not captured,mailpaisley@gmail.com,Not captured,701939884,,Not captured,Not captured,Not captured,Not captured,Not captured,Not captured,
Not captured,Not captured,08/23/2019,Not captured,Not captured,863949,020,00072,ARS-01-0052312,Beacon International,Not captured,Not captured,Not captured,,,,Moore,Ricardo,,09/29/1983,male,Not captured,Not captured,Not captured,Not captured,Not captured,Not captured,Not captured,Not captured,Not captured,Not captured,Not captured,Not captured,Not captured,,,Not captured,Not captured,Not captured,Not captured,23005 Golfview Dr,,Southfield,Michigan,48033,,,Not captured,Not captured,mailpaisley@gmail.com,Not captured,701939883,,Not captured,Not captured,Not captured,Not captured,Not captured,Not captured,
Not captured,Not captured,08/23/2019,Not captured,Not captured,863949,020,00072,ARS-01-0052311,Beacon International,Not captured,Not captured,Not captured,,,,michelfelder,james,,03/04/1982,male,Not captured,Not captured,Not captured,Not captured,Not captured,Not captured,Not captured,Not captured,Not captured,Not captured,Not captured,Not captured,Not captured,,,Not captured,Not captured,Not captured,Not captured,30 Bayard St 3A,,Brooklyn,New York,11211,,,Not captured,Not captured,jaymichelfelder@gmail.com,Not captured,701939882,,Not captured,Not captured,Not captured,Not captured,Not captured,Not captured,
Not captured,Not captured,08/23/2019,Not captured,Not captured,863949,020,00072,ARS-01-0052310,Beacon International,Not captured,Not captured,Not captured,,,,Austerlitz,Maria Florencia,,04/20/1990,female,Not captured,Not captured,Not captured,Not captured,Not captured,Not captured,Not captured,Not captured,Not captured,Not captured,Not captured,Not captured,Not captured,,,Not captured,Not captured,Not captured,Not captured,552 Greathouse Drive,,Milpitas,California,95035,,,Not captured,Not captured,js31853211@gmail.com,Not captured,701939881,,Not captured,Not captured,Not captured,Not captured,Not captured,Not captured,
Not captured,Not captured,08/23/2019,Not captured,Not captured,863949,020,00072,ARS-01-0052309,Beacon International,Not captured,Not captured,Not captured,,,,Lawrence,David,,01/23/1985,male,Not captured,Not captured,Not captured,Not captured,Not captured,Not captured,Not captured,Not captured,Not captured,Not captured,Not captured,Not captured,Not captured,,,Not captured,Not captured,Not captured,Not captured,552 Greathouse Drive,,Milpitas,California,95035,,,Not captured,Not captured,js31853211@gmail.com,Not captured,701939880,,Not captured,Not captured,Not captured,Not captured,Not captured,Not captured,
Not captured,Not captured,08/23/2019,Not captured,Not captured,863949,020,00072,ARS-01-0052308,Beacon International,Not captured,Not captured,Not captured,,,,Zheng,Rongbin,,12/09/1983,male,Not captured,Not captured,Not captured,Not captured,Not captured,Not captured,Not captured,Not captured,Not captured,Not captured,Not captured,Not captured,Not captured,,,Not captured,Not captured,Not captured,Not captured,1515 Wanjun Jingmao Building No.21 Baoxing Rd,,shenzhen,,518133,,,Not captured,Not captured,irven.z@hotmail.com,Not captured,701939879,,Not captured,Not captured,Not captured,Not captured,Not captured,Not captured,
Not captured,Not captured,08/23/2019,Not captured,Not captured,863949,020,00072,ARS-01-0052307,Beacon International,Not captured,Not captured,Not captured,,,,Petrova,Oleksandra,,01/21/1978,female,Not captured,Not captured,Not captured,Not captured,Not captured,Not captured,Not captured,Not captured,Not captured,Not captured,Not captured,Not captured,Not captured,,,Not captured,Not captured,Not captured,Not captured,2830 Ocean Pkwy Apt 13G,,Brooklyn,New York,11235,,,Not captured,Not captured,alxapetrova@gmail.com,Not captured,701939878,,Not captured,Not captured,Not captured,Not captured,Not captured,Not captured,
Not captured,Not captured,08/23/2019,Not captured,Not captured,863949,020,00072,ARS-01-0052306,Beacon International,Not captured,Not captured,Not captured,,,,Petrova,Nataliya,,05/10/1951,female,Not captured,Not captured,Not captured,Not captured,Not captured,Not captured,Not captured,Not captured,Not captured,Not captured,Not captured,Not captured,Not captured,,,Not captured,Not captured,Not captured,Not captured,2830 Ocean Pkwy Apt 13G,,Brooklyn,New York,11235,,,Not captured,Not captured,alxapetrova@gmail.com,Not captured,701939877,,Not captured,Not captured,Not captured,Not captured,Not captured,Not captured,
Not captured,Not captured,08/23/2019,Not captured,Not captured,863949,020,00072,ARS-01-0052305,Beacon International,Not captured,Not captured,Not captured,,,,Cevallos,Marcela,S,08/24/1989,female,Not captured,Not captured,Not captured,Not captured,Not captured,Not captured,Not captured,Not captured,Not captured,Not captured,Not captured,Not captured,Not captured,,,Not captured,Not captured,Not captured,Not captured,Zwirki i Wiguri,,Warsaw,,02-089,,,Not captured,Not captured,marce.cevallos@hotmail.com,Not captured,701939876,,Not captured,Not captured,Not captured,Not captured,Not captured,Not captured,
Not captured,Not captured,08/24/2019,Not captured,Not captured,863949,020,00072,ARS-01-0052304,Beacon International,Not captured,Not captured,Not captured,,,,Kennedy,Clare,,05/31/1988,female,Not captured,Not captured,Not captured,Not captured,Not captured,Not captured,Not captured,Not captured,Not captured,Not captured,Not captured,Not captured,Not captured,,,Not captured,Not captured,Not captured,Not captured,8310 Regents Road,,San Diego,California,92122,,,Not captured,Not captured,btozer@ucsd.edu,Not captured,701939875,,Not captured,Not captured,Not captured,Not captured,Not captured,Not captured,
Not captured,Not captured,08/24/2019,Not captured,Not captured,863949,020,00072,ARS-01-0052303,Beacon International,Not captured,Not captured,Not captured,,,,Tozer,Brook,,12/24/1988,male,Not captured,Not captured,Not captured,Not captured,Not captured,Not captured,Not captured,Not captured,Not captured,Not captured,Not captured,Not captured,Not captured,,,Not captured,Not captured,Not captured,Not captured,8310 Regents Road,,San Diego,California,92122,,,Not captured,Not captured,btozer@ucsd.edu,Not captured,701939874,,Not captured,Not captured,Not captured,Not captured,Not captured,Not captured,
Not captured,Not captured,08/24/2019,Not captured,Not captured,863949,020,00072,ARS-02-0052296,Beacon America,Not captured,Not captured,Not captured,,,,tapia,marcela ,a,06/04/2005,female,Not captured,Not captured,Not captured,Not captured,Not captured,Not captured,Not captured,Not captured,Not captured,Not captured,Not captured,Not captured,Not captured,maria tapia,daugther,Not captured,Not captured,Not captured,Not captured,814 neptune pointe ln,,orlando,florida,34744,6292072247,,Not captured,Not captured,luzbethchadel@gmail.com,Not captured,701939867,,Not captured,Not captured,Not captured,Not captured,Not captured,Not captured,
Not captured,Not captured,08/24/2019,Not captured,Not captured,863949,020,00072,ARS-02-0052295,Beacon America,Not captured,Not captured,Not captured,Passport(086057002),,,chacon ,luzbeth ,s,01/26/1965,female,Not captured,Not captured,Not captured,Not captured,Not captured,Not captured,Not captured,Not captured,Not captured,Not captured,Not captured,Not captured,Not captured,maria tapia,daugther,Not captured,Not captured,Not captured,Not captured,814 neptune pointe ln,,orlando,florida,34744,6292072247,,Not captured,Not captured,luzbethchadel@gmail.com,Not captured,701939866,,Not captured,Not captured,Not captured,Not captured,Not captured,Not captured,
Not captured,Not captured,08/22/2019,Not captured,Not captured,863949,020,00072,ARS-02-0052294,Beacon America,Not captured,Not captured,Not captured,,,,Johnston,Lottie,A,07/08/1993,female,Not captured,Not captured,Not captured,Not captured,Not captured,Not captured,Not captured,Not captured,Not captured,Not captured,Not captured,Not captured,Not captured,,,Not captured,Not captured,Not captured,Not captured,2517 N. 47th St.,,Milwaukee,Wisconsin,53210,,,Not captured,Not captured,badgeretto5@gmail.com,Not captured,701939865,,Not captured,Not captured,Not captured,Not captured,Not captured,Not captured,
Not captured,Not captured,08/22/2019,Not captured,Not captured,863949,020,00072,ARS-02-0052293,Beacon America,Not captured,Not captured,Not captured,,,,Johnston,Eva,E,05/15/1965,female,Not captured,Not captured,Not captured,Not captured,Not captured,Not captured,Not captured,Not captured,Not captured,Not captured,Not captured,Not captured,Not captured,,,Not captured,Not captured,Not captured,Not captured,2517 N. 47th St.,,Milwaukee,Wisconsin,53210,,,Not captured,Not captured,badgeretto5@gmail.com,Not captured,701939864,,Not captured,Not captured,Not captured,Not captured,Not captured,Not captured,
Not captured,Not captured,08/23/2019,Not captured,Not captured,863949,020,00072,ARS-02-0052292,Beacon America,Not captured,Not captured,Not captured,,,,Sawadogo,Martial,,11/27/1965,male,Not captured,Not captured,Not captured,Not captured,Not captured,Not captured,Not captured,Not captured,Not captured,Not captured,Not captured,Not captured,Not captured,,,Not captured,Not captured,Not captured,Not captured,12647 Olive Boulevard,,St Louis,Missouri,63141,3147541304,,Not captured,Not captured,edemerit@soy.org,Not captured,701939863,,Not captured,Not captured,Not captured,Not captured,Not captured,Not captured,