EE Transaction Type,Dependent Transaction Type,Effective Date,EE Signature,EE Signature Date,Control,Suffix,Account,Plan Number,Plan Name,Claim Office,Network ID Number,Customer Code,EE SSN,Dependent SSN,Dependent Relationship,Last Name,First Name,Middle Initial,DOB,Gender,Ethnicity,PCP/PCD,PCP/PCD Current Patient,Provider Cap Office Number,COB,Dep Student Indicator,Dep OOA Indicator,EE Prior Coverage Indicator,EE Late Entrant,EE Language Indicator,Hire Date,Earnings,Earnings Frequency,Beneficiary (Last Name First Name MI),Beneficiary Relationship,Continuation of Coverage Expiration Date,Continuation of Coverage Event Date,Continuation of Coverage Length of Coverage,Work Location Zip Code,Street Address Line 1,Street Address Line 2,City,State,Zip Code,Home Phone Number,Work Phone Number,Accept Code,Evidence Code,EE Email Address,Communication Disability Code,EE Alternate ID,Dep Alternate ID,Old Control,Old Suffix,Old Account,New Control,New Suffix,New Account,
Not captured,Not captured,08/22/2019,Not captured,Not captured,863949,020,00072,ARS-02-0052294,Beacon America,Not captured,Not captured,Not captured,,,,Johnston,Lottie,A,07/08/1993,female,Not captured,Not captured,Not captured,Not captured,Not captured,Not captured,Not captured,Not captured,Not captured,Not captured,Not captured,Not captured,Not captured,,,Not captured,Not captured,Not captured,Not captured,2517 N. 47th St.,,Milwaukee,Wisconsin,53210,,,Not captured,Not captured,badgeretto5@gmail.com,Not captured,701939865,,Not captured,Not captured,Not captured,Not captured,Not captured,Not captured,
Not captured,Not captured,08/22/2019,Not captured,Not captured,863949,020,00072,ARS-02-0052293,Beacon America,Not captured,Not captured,Not captured,,,,Johnston,Eva,E,05/15/1965,female,Not captured,Not captured,Not captured,Not captured,Not captured,Not captured,Not captured,Not captured,Not captured,Not captured,Not captured,Not captured,Not captured,,,Not captured,Not captured,Not captured,Not captured,2517 N. 47th St.,,Milwaukee,Wisconsin,53210,,,Not captured,Not captured,badgeretto5@gmail.com,Not captured,701939864,,Not captured,Not captured,Not captured,Not captured,Not captured,Not captured,
Not captured,Not captured,08/22/2019,Not captured,Not captured,863949,020,00072,ARS-02-0052291,Beacon America,Not captured,Not captured,Not captured,,,,Ca&ntilde;&oacute;n,Jorge,,10/01/1980,male,Not captured,Not captured,Not captured,Not captured,Not captured,Not captured,Not captured,Not captured,Not captured,Not captured,Not captured,Not captured,Not captured,,,Not captured,Not captured,Not captured,Not captured,lotissement taapuna,,punaauia,,98718,,,Not captured,Not captured,jorgecanonglez@hotmail.com,Not captured,701939862,,Not captured,Not captured,Not captured,Not captured,Not captured,Not captured,
Not captured,Not captured,08/21/2019,Not captured,Not captured,863949,020,00072,ARS-01-0052289,Beacon International,Not captured,Not captured,Not captured,,,,Szatko,Slavek,,10/04/1978,male,Not captured,Not captured,Not captured,Not captured,Not captured,Not captured,Not captured,Not captured,Not captured,Not captured,Not captured,Not captured,Not captured,,,Not captured,Not captured,Not captured,Not captured,1321 rose ave,,carol stream,Illinois,60188,,,Not captured,Not captured,sslawii@yahoo.com,Not captured,701939860,,Not captured,Not captured,Not captured,Not captured,Not captured,Not captured,
Not captured,Not captured,08/21/2019,Not captured,Not captured,863949,020,00072,ARS-01-0052288,Beacon International,Not captured,Not captured,Not captured,,,,Pavlevych,Kateryna,,10/30/1993,female,Not captured,Not captured,Not captured,Not captured,Not captured,Not captured,Not captured,Not captured,Not captured,Not captured,Not captured,Not captured,Not captured,,,Not captured,Not captured,Not captured,Not captured,400 Clementina St Apt 815,,San Francisco,California,94103,,,Not captured,Not captured,kpavlevych@gmail.com,Not captured,701939859,,Not captured,Not captured,Not captured,Not captured,Not captured,Not captured,
Not captured,Not captured,08/21/2019,Not captured,Not captured,863949,020,00072,ARS-01-0052286,Beacon International,Not captured,Not captured,Not captured,,,,Venditti,Kate,,05/04/1995,female,Not captured,Not captured,Not captured,Not captured,Not captured,Not captured,Not captured,Not captured,Not captured,Not captured,Not captured,Not captured,Not captured,,,Not captured,Not captured,Not captured,Not captured,6865 Towbridge Rd,,Fayetteville,North Carolina,28306,,,Not captured,Not captured,chadmslate@gmail.com,Not captured,701939857,,Not captured,Not captured,Not captured,Not captured,Not captured,Not captured,
Not captured,Not captured,08/21/2019,Not captured,Not captured,863949,020,00072,ARS-01-0052285,Beacon International,Not captured,Not captured,Not captured,,,,Chiang,Andy,,08/28/1990,male,Not captured,Not captured,Not captured,Not captured,Not captured,Not captured,Not captured,Not captured,Not captured,Not captured,Not captured,Not captured,Not captured,,,Not captured,Not captured,Not captured,Not captured,2930 Barnard Street,,San Diego,California,92110,,,Not captured,Not captured,Lmbb14@gmail.com,Not captured,701939856,,Not captured,Not captured,Not captured,Not captured,Not captured,Not captured,
Not captured,Not captured,08/21/2019,Not captured,Not captured,863949,020,00072,ARS-01-0052284,Beacon International,Not captured,Not captured,Not captured,,,,Michaels,Lauren,T,11/27/1987,female,Not captured,Not captured,Not captured,Not captured,Not captured,Not captured,Not captured,Not captured,Not captured,Not captured,Not captured,Not captured,Not captured,,,Not captured,Not captured,Not captured,Not captured,2930 Barnard Street,,San Diego,California,92110,,,Not captured,Not captured,Lmbb14@gmail.com,Not captured,701939855,,Not captured,Not captured,Not captured,Not captured,Not captured,Not captured,
Not captured,Not captured,08/21/2019,Not captured,Not captured,863949,020,00072,ARS-01-0052283,Beacon International,Not captured,Not captured,Not captured,,,,KVICK,Johan Valter,Emil,06/10/1962,male,Not captured,Not captured,Not captured,Not captured,Not captured,Not captured,Not captured,Not captured,Not captured,Not captured,Not captured,Not captured,Not captured,DOREEN Kvick,Wife,Not captured,Not captured,Not captured,Not captured,Solhaga Hassleberg,,Linkoping,&Ouml;sterg&ouml;tland,58597,01387013,,Not captured,Not captured,emilkvick@gmail.com,Not captured,701939852,,Not captured,Not captured,Not captured,Not captured,Not captured,Not captured,
Not captured,Not captured,08/21/2019,Not captured,Not captured,863949,020,00072,ARS-02-0052282,Beacon America,Not captured,Not captured,Not captured,,,,Zablotsky,Yitty,,01/08/1952,female,Not captured,Not captured,Not captured,Not captured,Not captured,Not captured,Not captured,Not captured,Not captured,Not captured,Not captured,Not captured,Not captured,,,Not captured,Not captured,Not captured,Not captured,1727 44th st,,Brooklyn,New York,11204,,,Not captured,Not captured,shaye@protectplusins.com,Not captured,701939851,,Not captured,Not captured,Not captured,Not captured,Not captured,Not captured,
Not captured,Not captured,08/21/2019,Not captured,Not captured,863949,020,00072,ARS-01-0052279,Beacon International,Not captured,Not captured,Not captured,,,,Schira,Gregoire,H,01/14/1978,male,Not captured,Not captured,Not captured,Not captured,Not captured,Not captured,Not captured,Not captured,Not captured,Not captured,Not captured,Not captured,Not captured,,,Not captured,Not captured,Not captured,Not captured,Junction Court,,Nairobi,,6052,,,Not captured,Not captured,gschira@safer-access.com,Not captured,701939847,,Not captured,Not captured,Not captured,Not captured,Not captured,Not captured,
Not captured,Not captured,08/20/2019,Not captured,Not captured,863949,020,00072,ARS-01-0052278,Beacon International,Not captured,Not captured,Not captured,Passport(HC927001),,,Tempelman,Matthew,,06/29/1990,male,Not captured,Not captured,Not captured,Not captured,Not captured,Not captured,Not captured,Not captured,Not captured,Not captured,Not captured,Not captured,Not captured,Martine and Corinne Tempelman,Parents,Not captured,Not captured,Not captured,Not captured,184 Holomego Rd.,,Kakabeka Falls,Ontario,P0T 1W0,1 807 475 5161,,Not captured,Not captured,tempelmanm@gmail.com,Not captured,701939846,,Not captured,Not captured,Not captured,Not captured,Not captured,Not captured,
Not captured,Not captured,08/21/2019,Not captured,Not captured,863949,020,00072,ARS-03-0052202,Essential America,Not captured,Not captured,Not captured,Passport(ED5228060),,,Xu,Siyuan,,10/08/2002,male,Not captured,Not captured,Not captured,Not captured,Not captured,Not captured,Not captured,Not captured,Not captured,Not captured,Not captured,Not captured,Not captured,,,Not captured,Not captured,Not captured,Not captured,13106 Bridgeport Crossing,,Lakewood Ranch,Florida,34211,941-348-3300,,Not captured,Not captured,miaolei@allbrightlaw.com,Not captured,701939757,,Not captured,Not captured,Not captured,Not captured,Not captured,Not captured,
Not captured,Not captured,08/20/2019,Not captured,Not captured,863949,020,00072,ARS-02-0052276,Beacon America,Not captured,Not captured,Not captured,,,,Thau,Meir,,02/28/1995,male,Not captured,Not captured,Not captured,Not captured,Not captured,Not captured,Not captured,Not captured,Not captured,Not captured,Not captured,Not captured,Not captured,,,Not captured,Not captured,Not captured,Not captured,19 Mahoney Ct,,New City,New York,10956,917--974-2856,,Not captured,Not captured,shulamisschulman@gmail.com,Not captured,701939842,,Not captured,Not captured,Not captured,Not captured,Not captured,Not captured,
Not captured,Not captured,08/20/2019,Not captured,Not captured,863949,020,00072,ARS-01-0052273,Beacon International,Not captured,Not captured,Not captured,,,,Espiniza,Joshua,,01/01/1995,male,Not captured,Not captured,Not captured,Not captured,Not captured,Not captured,Not captured,Not captured,Not captured,Not captured,Not captured,Not captured,Not captured,,,Not captured,Not captured,Not captured,Not captured,3200 Navajo Lane,,Provo,Utah,84604,,,Not captured,Not captured,herbstoddard@aol.com,Not captured,701939839,,Not captured,Not captured,Not captured,Not captured,Not captured,Not captured,
Not captured,Not captured,08/20/2019,Not captured,Not captured,863949,020,00072,ARS-01-0052272,Beacon International,Not captured,Not captured,Not captured,,,,Espinoza,Hannah,,05/19/1997,female,Not captured,Not captured,Not captured,Not captured,Not captured,Not captured,Not captured,Not captured,Not captured,Not captured,Not captured,Not captured,Not captured,,,Not captured,Not captured,Not captured,Not captured,3200 Navajo Lane,,Provo,Utah,84604,,,Not captured,Not captured,herbstoddard@aol.com,Not captured,701939838,,Not captured,Not captured,Not captured,Not captured,Not captured,Not captured,
Not captured,Not captured,08/20/2019,Not captured,Not captured,863949,020,00072,ARS-01-0052270,Beacon International,Not captured,Not captured,Not captured,,,,Weijer,Alexander,D,01/28/2017,male,Not captured,Not captured,Not captured,Not captured,Not captured,Not captured,Not captured,Not captured,Not captured,Not captured,Not captured,Not captured,Not captured,,,Not captured,Not captured,Not captured,Not captured,463 S Gaylord Street,,Denver,Colorado,80209,,,Not captured,Not captured,annachehtova@yahoo.com,Not captured,701939836,,Not captured,Not captured,Not captured,Not captured,Not captured,Not captured,
Not captured,Not captured,08/20/2019,Not captured,Not captured,863949,020,00072,ARS-01-0052269,Beacon International,Not captured,Not captured,Not captured,,,,Weijer,Johannes,E,08/14/1983,male,Not captured,Not captured,Not captured,Not captured,Not captured,Not captured,Not captured,Not captured,Not captured,Not captured,Not captured,Not captured,Not captured,,,Not captured,Not captured,Not captured,Not captured,463 S Gaylord Street,,Denver,Colorado,80209,,,Not captured,Not captured,annachehtova@yahoo.com,Not captured,701939835,,Not captured,Not captured,Not captured,Not captured,Not captured,Not captured,
Not captured,Not captured,08/20/2019,Not captured,Not captured,863949,020,00072,ARS-01-0052268,Beacon International,Not captured,Not captured,Not captured,,,,Chehtova,Anna,A,08/12/1980,female,Not captured,Not captured,Not captured,Not captured,Not captured,Not captured,Not captured,Not captured,Not captured,Not captured,Not captured,Not captured,Not captured,,,Not captured,Not captured,Not captured,Not captured,463 S Gaylord Street,,Denver,Colorado,80209,,,Not captured,Not captured,annachehtova@yahoo.com,Not captured,701939834,,Not captured,Not captured,Not captured,Not captured,Not captured,Not captured,
Not captured,Not captured,08/21/2019,Not captured,Not captured,863949,020,00072,ARS-01-0052265,Beacon International,Not captured,Not captured,Not captured,,,,bonde,Joan,A,12/16/1968,female,Not captured,Not captured,Not captured,Not captured,Not captured,Not captured,Not captured,Not captured,Not captured,Not captured,Not captured,Not captured,Not captured,,,Not captured,Not captured,Not captured,Not captured,4309 Rustic Place,,Shoreview,Minnesota,55126,,,Not captured,Not captured,deanbonde1@yahoo.com,Not captured,701939831,,Not captured,Not captured,Not captured,Not captured,Not captured,Not captured,
Not captured,Not captured,08/21/2019,Not captured,Not captured,863949,020,00072,ARS-01-0052264,Beacon International,Not captured,Not captured,Not captured,,,,bonde,Dean,,07/28/1968,male,Not captured,Not captured,Not captured,Not captured,Not captured,Not captured,Not captured,Not captured,Not captured,Not captured,Not captured,Not captured,Not captured,,,Not captured,Not captured,Not captured,Not captured,4309 Rustic Place,,Shoreview,Minnesota,55126,,,Not captured,Not captured,deanbonde1@yahoo.com,Not captured,701939830,,Not captured,Not captured,Not captured,Not captured,Not captured,Not captured,
Not captured,Not captured,08/21/2019,Not captured,Not captured,863949,020,00072,ARS-01-0052263,Beacon International,Not captured,Not captured,Not captured,,,,bonde,Jeremiah,,02/08/1997,male,Not captured,Not captured,Not captured,Not captured,Not captured,Not captured,Not captured,Not captured,Not captured,Not captured,Not captured,Not captured,Not captured,,,Not captured,Not captured,Not captured,Not captured,4309 Rustic Place,,Shoreview,Minnesota,55126,,,Not captured,Not captured,deanbonde1@yahoo.com,Not captured,701939829,,Not captured,Not captured,Not captured,Not captured,Not captured,Not captured,
Not captured,Not captured,08/21/2019,Not captured,Not captured,863949,020,00072,ARS-01-0052262,Beacon International,Not captured,Not captured,Not captured,,,,bonde,Josh,,05/15/2000,male,Not captured,Not captured,Not captured,Not captured,Not captured,Not captured,Not captured,Not captured,Not captured,Not captured,Not captured,Not captured,Not captured,,,Not captured,Not captured,Not captured,Not captured,4309 Rustic Place,,Shoreview,Minnesota,55126,,,Not captured,Not captured,deanbonde1@yahoo.com,Not captured,701939828,,Not captured,Not captured,Not captured,Not captured,Not captured,Not captured,
Not captured,Not captured,08/20/2019,Not captured,Not captured,863949,020,00072,ARS-03-0052095,Essential America,Not captured,Not captured,Not captured,Passport(n/a),,,Cheney,Gavin,,07/21/2019,male,Not captured,Not captured,Not captured,Not captured,Not captured,Not captured,Not captured,Not captured,Not captured,Not captured,Not captured,Not captured,Not captured,,,Not captured,Not captured,Not captured,Not captured,10 Macey Ave.,,Toronto,Ontario,m1l 4r4,6474656884,,Not captured,Not captured,service@azimuthrisk.com,Not captured,701939500,,Not captured,Not captured,Not captured,Not captured,Not captured,Not captured,
Not captured,Not captured,08/20/2019,Not captured,Not captured,863949,020,00072,ARS-01-0052254,Beacon International,Not captured,Not captured,Not captured,,,,Madhusudhan,Anusha,,05/03/1993,female,Not captured,Not captured,Not captured,Not captured,Not captured,Not captured,Not captured,Not captured,Not captured,Not captured,Not captured,Not captured,Not captured,,,Not captured,Not captured,Not captured,Not captured,Flat 101 KT 26 Sri Ranga 8 cross 6 main Malleshwaram,,Bangalore,,560003,,,Not captured,Not captured,am8148@nyu.edu,Not captured,701939815,,Not captured,Not captured,Not captured,Not captured,Not captured,Not captured,
Not captured,Not captured,08/20/2019,Not captured,Not captured,863949,020,00072,ARS-02-0052252,Beacon America,Not captured,Not captured,Not captured,,,,Appala,Manikyamba,,03/03/1945,female,Not captured,Not captured,Not captured,Not captured,Not captured,Not captured,Not captured,Not captured,Not captured,Not captured,Not captured,Not captured,Not captured,Syam Sundar Appala,Son,Not captured,Not captured,Not captured,Not captured,4406 Laird Circle,,Santa Clara,CA,95054,4082168647,+14088886589,Not captured,Not captured,syamappala@gmail.com,Not captured,701939813,,Not captured,Not captured,Not captured,Not captured,Not captured,Not captured,
Not captured,Not captured,08/20/2019,Not captured,Not captured,863949,020,00072,ARS-02-0052251,Beacon America,Not captured,Not captured,Not captured,Passport(N6958570),,,Appala,Ramana Rao,,07/04/1942,male,Not captured,Not captured,Not captured,Not captured,Not captured,Not captured,Not captured,Not captured,Not captured,Not captured,Not captured,Not captured,Not captured,Syam Sundar Appala,Son,Not captured,Not captured,Not captured,Not captured,4406 Laird Circle,,Santa Clara,CA,95054,4082168647,+14088886589,Not captured,Not captured,syamappala@gmail.com,Not captured,701939812,,Not captured,Not captured,Not captured,Not captured,Not captured,Not captured,
Not captured,Not captured,08/20/2019,Not captured,Not captured,863949,020,00072,ARS-02-0052250,Beacon America,Not captured,Not captured,Not captured,,,,Cao,Trang Minh Tu,,01/01/1980,male,Not captured,Not captured,Not captured,Not captured,Not captured,Not captured,Not captured,Not captured,Not captured,Not captured,Not captured,Not captured,Not captured,,,Not captured,Not captured,Not captured,Not captured,6595 Fleming Street,,Vancouver,British Columbia,V5P 3H3,,,Not captured,Not captured,tucaotrang@gmail.com,Not captured,701939811,,Not captured,Not captured,Not captured,Not captured,Not captured,Not captured,
Not captured,Not captured,08/21/2019,Not captured,Not captured,863949,020,00072,ARS-02-0052233,Beacon America,Not captured,Not captured,Not captured,Passport(J3757027),,,Sabnani,Prabhu,G,04/14/1947,male,Not captured,Not captured,Not captured,Not captured,Not captured,Not captured,Not captured,Not captured,Not captured,Not captured,Not captured,Not captured,Not captured,,,Not captured,Not captured,Not captured,Not captured,607 Spanish Mustang Dr.,,Cedar Park,Texas,78613,5128083677,,Not captured,Not captured,prabhu@sabnanis.com,Not captured,701939793,,Not captured,Not captured,Not captured,Not captured,Not captured,Not captured,
Not captured,Not captured,08/21/2019,Not captured,Not captured,863949,020,00072,ARS-02-0052230,Beacon America,Not captured,Not captured,Not captured,Passport(L4995546),,,Sabnani,Latha,P,08/30/1949,female,Not captured,Not captured,Not captured,Not captured,Not captured,Not captured,Not captured,Not captured,Not captured,Not captured,Not captured,Not captured,Not captured,,,Not captured,Not captured,Not captured,Not captured,607 Spanish Mustang Dr.,,Cedar Park,Texas,78613,5128083677,,Not captured,Not captured,lata@sabnanis.com,Not captured,701939790,,Not captured,Not captured,Not captured,Not captured,Not captured,Not captured,
Not captured,Not captured,08/22/2019,Not captured,Not captured,863949,020,00072,ARS-01-0052220,Beacon International,Not captured,Not captured,Not captured,Passport(TR4322201),,,Ishizumi,Asuka,,12/26/1984,male,Not captured,Not captured,Not captured,Not captured,Not captured,Not captured,Not captured,Not captured,Not captured,Not captured,Not captured,Not captured,Not captured,Kazuo Ishizumi,Father,Not captured,Not captured,Not captured,Not captured,41-7 Koizumi,,Ogaki,Gifu,5030816,+81584811298,,Not captured,Not captured,asuka1226_min@msn.com,Not captured,701939778,,Not captured,Not captured,Not captured,Not captured,Not captured,Not captured,
Not captured,Not captured,08/21/2019,Not captured,Not captured,863949,020,00072,ARS-01-0052216,Beacon International,Not captured,Not captured,Not captured,Passport(103813976),,,LAWEIKO SALAZAR,ALANA VALENTINA,,03/27/2004,female,Not captured,Not captured,Not captured,Not captured,Not captured,Not captured,Not captured,Not captured,Not captured,Not captured,Not captured,Not captured,Not captured,ADRIANA LUCILA SALAZAR ,MOTHER,Not captured,Not captured,Not captured,Not captured,7876 NW 109TH PATH,,MIAMI,Florida,33178,7862127688,,Not captured,Not captured,adrianalsalazar@yahoo.com,Not captured,701939774,,Not captured,Not captured,Not captured,Not captured,Not captured,Not captured,
Not captured,Not captured,08/21/2019,Not captured,Not captured,863949,020,00072,ARS-02-0052190,Beacon America,Not captured,Not captured,Not captured,,,,Weber,Genna,M,07/07/1997,female,Not captured,Not captured,Not captured,Not captured,Not captured,Not captured,Not captured,Not captured,Not captured,Not captured,Not captured,Not captured,Not captured,,,Not captured,Not captured,Not captured,Not captured,292231 Culloden Line,,Brownsville,Ontario,N0L1C0,,,Not captured,Not captured,joshua_weber@live.ca,Not captured,701939745,,Not captured,Not captured,Not captured,Not captured,Not captured,Not captured,
Not captured,Not captured,08/21/2019,Not captured,Not captured,863949,020,00072,ARS-02-0052189,Beacon America,Not captured,Not captured,Not captured,,,,Weber,Joshua,,11/27/1996,male,Not captured,Not captured,Not captured,Not captured,Not captured,Not captured,Not captured,Not captured,Not captured,Not captured,Not captured,Not captured,Not captured,,,Not captured,Not captured,Not captured,Not captured,292231 Culloden Line,,Brownsville,Ontario,N0L1C0,,,Not captured,Not captured,joshua_weber@live.ca,Not captured,701939744,,Not captured,Not captured,Not captured,Not captured,Not captured,Not captured,
Not captured,Not captured,08/22/2019,Not captured,Not captured,863949,020,00072,ARS-01-0051925,Beacon International,Not captured,Not captured,Not captured,Passport(101882217),,,CONTRERAS,DANIELA,M,10/23/1999,female,Not captured,Not captured,Not captured,Not captured,Not captured,Not captured,Not captured,Not captured,Not captured,Not captured,Not captured,Not captured,Not captured,NELIDA MARQUEZ,MADRE,Not captured,Not captured,Not captured,Not captured,285 UPTOWN BLVD NRO 409,,ALTAMONTE SPRING,Florida,32701,4074099167,04147377945,Not captured,Not captured,DANIELAACONTRERASM23@GMAIL.COM,Not captured,701939277,,Not captured,Not captured,Not captured,Not captured,Not captured,Not captured,
Not captured,Not captured,08/20/2019,Not captured,Not captured,863949,020,00072,ARS-01-0051823,Beacon International,Not captured,Not captured,Not captured,Passport(286457271),,,Simoni,Brigid,A,12/19/1954,female,Not captured,Not captured,Not captured,Not captured,Not captured,Not captured,Not captured,Not captured,Not captured,Not captured,Not captured,Not captured,Not captured,Nicholas Pacione,Son,Not captured,Not captured,Not captured,Not captured,102 Sandpiper Lane,,New Windsor,,12553,845-670-7311,,Not captured,Not captured,omagheire@yahoo.com,Not captured,701939111,,Not captured,Not captured,Not captured,Not captured,Not captured,Not captured,