EE Transaction Type,Dependent Transaction Type,Effective Date,EE Signature,EE Signature Date,Control,Suffix,Account,Plan Number,Plan Name,Claim Office,Network ID Number,Customer Code,EE SSN,Dependent SSN,Dependent Relationship,Last Name,First Name,Middle Initial,DOB,Gender,Ethnicity,PCP/PCD,PCP/PCD Current Patient,Provider Cap Office Number,COB,Dep Student Indicator,Dep OOA Indicator,EE Prior Coverage Indicator,EE Late Entrant,EE Language Indicator,Hire Date,Earnings,Earnings Frequency,Beneficiary (Last Name First Name MI),Beneficiary Relationship,Continuation of Coverage Expiration Date,Continuation of Coverage Event Date,Continuation of Coverage Length of Coverage,Work Location Zip Code,Street Address Line 1,Street Address Line 2,City,State,Zip Code,Home Phone Number,Work Phone Number,Accept Code,Evidence Code,EE Email Address,Communication Disability Code,EE Alternate ID,Dep Alternate ID,Old Control,Old Suffix,Old Account,New Control,New Suffix,New Account,
Not captured,Not captured,08/19/2019,Not captured,Not captured,863949,020,00072,ARS-03-0052182,Essential America,Not captured,Not captured,Not captured,Passport(483822008),,,Comier,Chiemeka,Ryanae,02/21/1989,female,Not captured,Not captured,Not captured,Not captured,Not captured,Not captured,Not captured,Not captured,Not captured,Not captured,Not captured,Not captured,Not captured,,,Not captured,Not captured,Not captured,Not captured,4655 W. Birch Ave,,Fresno,California,93722,258842523672,,Not captured,Not captured,mekacomier@gmail.com,Not captured,701939737,,Not captured,Not captured,Not captured,Not captured,Not captured,Not captured,
Not captured,Not captured,08/19/2019,Not captured,Not captured,863949,020,00072,ARS-03-0052125,Essential International,Not captured,Not captured,Not captured,Passport(534479414),,,Haynes,Ashley,Rene,09/23/1996,female,Not captured,Not captured,Not captured,Not captured,Not captured,Not captured,Not captured,Not captured,Not captured,Not captured,Not captured,Not captured,Not captured,,,Not captured,Not captured,Not captured,Not captured,11 Panther Road,,Johannesburg,Gauteng,2156,+27 76 497 6279,,Not captured,Not captured,ashleyhaynes96@gmail.com,Not captured,701939646,,Not captured,Not captured,Not captured,Not captured,Not captured,Not captured,
Not captured,Not captured,08/17/2019,Not captured,Not captured,863949,020,00072,ARS-03-0051993,Essential America,Not captured,Not captured,Not captured,Passport(505571158),,,kaufman,paul,marvin,09/25/1970,male,Not captured,Not captured,Not captured,Not captured,Not captured,Not captured,Not captured,Not captured,Not captured,Not captured,Not captured,Not captured,Not captured,,,Not captured,Not captured,Not captured,Not captured,5026 Rosabelle Beach Ave,,Holland,Michigan,49424,6164030925,,Not captured,Not captured,elizapaulkaufman@gmail.com,Not captured,701939362,,Not captured,Not captured,Not captured,Not captured,Not captured,Not captured,
Not captured,Not captured,08/17/2019,Not captured,Not captured,863949,020,00072,ARS-03-0051993,Essential America,Not captured,Not captured,Not captured,,Passport(469737227),Spouse,kaufman,elizabeth,anne,09/19/1978,female,Not captured,Not captured,Not captured,Not captured,Not captured,Not captured,Not captured,Not captured,Not captured,Not captured,Not captured,Not captured,Not captured,,,Not captured,Not captured,Not captured,Not captured,5026 Rosabelle Beach Ave,,Holland,Michigan,49424,6164030925,,Not captured,Not captured,elizapaulkaufman@gmail.com,Not captured,,701939363,Not captured,Not captured,Not captured,Not captured,Not captured,Not captured,
Not captured,Not captured,08/17/2019,Not captured,Not captured,863949,020,00072,ARS-03-0051993,Essential America,Not captured,Not captured,Not captured,,Passport(565557766),Dependant,kaufman,inman,john,01/02/2008,male,Not captured,Not captured,Not captured,Not captured,Not captured,Not captured,Not captured,Not captured,Not captured,Not captured,Not captured,Not captured,Not captured,,,Not captured,Not captured,Not captured,Not captured,5026 Rosabelle Beach Ave,,Holland,Michigan,49424,6164030925,,Not captured,Not captured,elizapaulkaufman@gmail.com,Not captured,,701939364,Not captured,Not captured,Not captured,Not captured,Not captured,Not captured,
Not captured,Not captured,08/17/2019,Not captured,Not captured,863949,020,00072,ARS-03-0051993,Essential America,Not captured,Not captured,Not captured,,Passport(530001719),Dependant,kaufman,owen,paul,07/24/2009,male,Not captured,Not captured,Not captured,Not captured,Not captured,Not captured,Not captured,Not captured,Not captured,Not captured,Not captured,Not captured,Not captured,,,Not captured,Not captured,Not captured,Not captured,5026 Rosabelle Beach Ave,,Holland,Michigan,49424,6164030925,,Not captured,Not captured,elizapaulkaufman@gmail.com,Not captured,,701939365,Not captured,Not captured,Not captured,Not captured,Not captured,Not captured,
Not captured,Not captured,08/17/2019,Not captured,Not captured,863949,020,00072,ARS-03-0051993,Essential America,Not captured,Not captured,Not captured,,Passport(565557765),Dependant,kaufman,isaiah,lane,10/23/2011,male,Not captured,Not captured,Not captured,Not captured,Not captured,Not captured,Not captured,Not captured,Not captured,Not captured,Not captured,Not captured,Not captured,,,Not captured,Not captured,Not captured,Not captured,5026 Rosabelle Beach Ave,,Holland,Michigan,49424,6164030925,,Not captured,Not captured,elizapaulkaufman@gmail.com,Not captured,,701939366,Not captured,Not captured,Not captured,Not captured,Not captured,Not captured,
Not captured,Not captured,08/17/2019,Not captured,Not captured,863949,020,00072,ARS-03-0051993,Essential America,Not captured,Not captured,Not captured,,Passport(597180451),Dependant,kaufman,simeon,andrew,01/06/2014,male,Not captured,Not captured,Not captured,Not captured,Not captured,Not captured,Not captured,Not captured,Not captured,Not captured,Not captured,Not captured,Not captured,,,Not captured,Not captured,Not captured,Not captured,5026 Rosabelle Beach Ave,,Holland,Michigan,49424,6164030925,,Not captured,Not captured,elizapaulkaufman@gmail.com,Not captured,,701939367,Not captured,Not captured,Not captured,Not captured,Not captured,Not captured,
Not captured,Not captured,08/19/2019,Not captured,Not captured,863949,020,00072,ARS-02-0052248,Beacon America,Not captured,Not captured,Not captured,,,,Huang,Chi Jen,,08/01/1958,male,Not captured,Not captured,Not captured,Not captured,Not captured,Not captured,Not captured,Not captured,Not captured,Not captured,Not captured,Not captured,Not captured,Emily Hui-Min Tsao,spouse,Not captured,Not captured,Not captured,Not captured,1805 Diana Avenue,,Morgan Hill,California,95037,6698883581,,Not captured,Not captured,huang952000@gmail.com,Not captured,701939809,,Not captured,Not captured,Not captured,Not captured,Not captured,Not captured,
Not captured,Not captured,08/19/2019,Not captured,Not captured,863949,020,00072,ARS-02-0052237,Beacon America,Not captured,Not captured,Not captured,Passport(YB4050525),,,PORTO,GIUSEPPINA,B,12/12/1961,female,Not captured,Not captured,Not captured,Not captured,Not captured,Not captured,Not captured,Not captured,Not captured,Not captured,Not captured,Not captured,Not captured,MARIA PORTO,SISTER,Not captured,Not captured,Not captured,Not captured,9700 South Dixie Hwy,,Miami,Florida,33156,954-279-7508,,Not captured,Not captured,rosadomap@hotmail.com,Not captured,701939797,,Not captured,Not captured,Not captured,Not captured,Not captured,Not captured,
Not captured,Not captured,08/19/2019,Not captured,Not captured,863949,020,00072,ARS-01-0052236,Beacon International,Not captured,Not captured,Not captured,,,,Nunez,Daniella,E,03/06/1999,female,Not captured,Not captured,Not captured,Not captured,Not captured,Not captured,Not captured,Not captured,Not captured,Not captured,Not captured,Not captured,Not captured,,,Not captured,Not captured,Not captured,Not captured,12840 NW 9th street,,Miami,Florida,33182,,,Not captured,Not captured,dannienunez02@gmail.com,Not captured,701939796,,Not captured,Not captured,Not captured,Not captured,Not captured,Not captured,
Not captured,Not captured,08/19/2019,Not captured,Not captured,863949,020,00072,ARS-02-0052228,Beacon America,Not captured,Not captured,Not captured,Passport(137697850),,,PEREZ HIDALGO,LAURA CRISTINA,,12/10/1995,female,Not captured,Not captured,Not captured,Not captured,Not captured,Not captured,Not captured,Not captured,Not captured,Not captured,Not captured,Not captured,Not captured,TANYA HIDALGO,MOTHER,Not captured,Not captured,Not captured,Not captured,AV LA RIVERA SECTOR COCALITO,,TUCUPITA,Delta Amacuro,6401,+17865999708,,Not captured,Not captured,perezhidal@gmail.com,Not captured,701939788,,Not captured,Not captured,Not captured,Not captured,Not captured,Not captured,
Not captured,Not captured,08/19/2019,Not captured,Not captured,863949,020,00072,ARS-02-0052226,Beacon America,Not captured,Not captured,Not captured,,,,Deutsch,Shaindel,,12/30/2017,female,Not captured,Not captured,Not captured,Not captured,Not captured,Not captured,Not captured,Not captured,Not captured,Not captured,Not captured,Not captured,Not captured,,,Not captured,Not captured,Not captured,Not captured,2 L&apos;Chaim way,,Lakewood,New Jersey,08701,848-238-5960,,Not captured,Not captured,yealk53@gmail.com,Not captured,701939784,,Not captured,Not captured,Not captured,Not captured,Not captured,Not captured,
Not captured,Not captured,08/19/2019,Not captured,Not captured,863949,020,00072,ARS-02-0052225,Beacon America,Not captured,Not captured,Not captured,,,,Deutsch,Yitzchok,,04/04/2016,male,Not captured,Not captured,Not captured,Not captured,Not captured,Not captured,Not captured,Not captured,Not captured,Not captured,Not captured,Not captured,Not captured,,,Not captured,Not captured,Not captured,Not captured,2 L&apos;Chaim way,,Lakewood,New Jersey,08701,848-238-5960,,Not captured,Not captured,yealk53@gmail.com,Not captured,701939783,,Not captured,Not captured,Not captured,Not captured,Not captured,Not captured,
Not captured,Not captured,08/19/2019,Not captured,Not captured,863949,020,00072,ARS-02-0052224,Beacon America,Not captured,Not captured,Not captured,,,,Deutsch,Shoshana,,06/04/2014,male,Not captured,Not captured,Not captured,Not captured,Not captured,Not captured,Not captured,Not captured,Not captured,Not captured,Not captured,Not captured,Not captured,,,Not captured,Not captured,Not captured,Not captured,2 L&apos;Chaim way,,Lakewood,New Jersey,08701,848-238-5960,,Not captured,Not captured,yealk53@gmail.com,Not captured,701939782,,Not captured,Not captured,Not captured,Not captured,Not captured,Not captured,
Not captured,Not captured,08/19/2019,Not captured,Not captured,863949,020,00072,ARS-02-0052223,Beacon America,Not captured,Not captured,Not captured,,,,Deutsch,Yael,,11/12/1992,female,Not captured,Not captured,Not captured,Not captured,Not captured,Not captured,Not captured,Not captured,Not captured,Not captured,Not captured,Not captured,Not captured,,,Not captured,Not captured,Not captured,Not captured,2 L&apos;Chaim way,,Lakewood,New Jersey,08701,848-238-5960,,Not captured,Not captured,yealk53@gmail.com,Not captured,701939781,,Not captured,Not captured,Not captured,Not captured,Not captured,Not captured,
Not captured,Not captured,08/19/2019,Not captured,Not captured,863949,020,00072,ARS-02-0052222,Beacon America,Not captured,Not captured,Not captured,,,,Deutsch,Yoel,,08/09/1988,male,Not captured,Not captured,Not captured,Not captured,Not captured,Not captured,Not captured,Not captured,Not captured,Not captured,Not captured,Not captured,Not captured,,,Not captured,Not captured,Not captured,Not captured,2 L&apos;Chaim way,,Lakewood,New Jersey,08701,848-238-5960,,Not captured,Not captured,yealk53@gmail.com,Not captured,701939780,,Not captured,Not captured,Not captured,Not captured,Not captured,Not captured,
Not captured,Not captured,08/19/2019,Not captured,Not captured,863949,020,00072,ARS-01-0052221,Beacon International,Not captured,Not captured,Not captured,,,,Hershkovits,Menachem M,,08/05/1998,male,Not captured,Not captured,Not captured,Not captured,Not captured,Not captured,Not captured,Not captured,Not captured,Not captured,Not captured,Not captured,Not captured,,,Not captured,Not captured,Not captured,Not captured,1432 52nd Street,,Brooklyn,New York,11219,718-972-9425,1718-972-9425,Not captured,Not captured,chanamindy@aol.com,Not captured,701939779,,Not captured,Not captured,Not captured,Not captured,Not captured,Not captured,
Not captured,Not captured,08/19/2019,Not captured,Not captured,863949,020,00072,ARS-02-0052215,Beacon America,Not captured,Not captured,Not captured,,,,Pham,Christine,,12/14/1994,female,Not captured,Not captured,Not captured,Not captured,Not captured,Not captured,Not captured,Not captured,Not captured,Not captured,Not captured,Not captured,Not captured,,,Not captured,Not captured,Not captured,Not captured,20 rue jeanne d&rsquo;arc,,Franconville,,95130,,,Not captured,Not captured,christine_pham@hotmail.fr,Not captured,701939773,,Not captured,Not captured,Not captured,Not captured,Not captured,Not captured,
Not captured,Not captured,08/19/2019,Not captured,Not captured,863949,020,00072,ARS-01-0052214,Beacon International,Not captured,Not captured,Not captured,,,,Hermes,Ann,,11/28/1982,female,Not captured,Not captured,Not captured,Not captured,Not captured,Not captured,Not captured,Not captured,Not captured,Not captured,Not captured,Not captured,Not captured,,,Not captured,Not captured,Not captured,Not captured,556 Gates Ave. Apt. 7,,Brooklyn,New York,11221,,,Not captured,Not captured,a13luck13@yahoo.com,Not captured,701939772,,Not captured,Not captured,Not captured,Not captured,Not captured,Not captured,
Not captured,Not captured,08/19/2019,Not captured,Not captured,863949,020,00072,ARS-01-0052213,Beacon International,Not captured,Not captured,Not captured,,,,Kutner,Jeremy,,01/22/1984,male,Not captured,Not captured,Not captured,Not captured,Not captured,Not captured,Not captured,Not captured,Not captured,Not captured,Not captured,Not captured,Not captured,,,Not captured,Not captured,Not captured,Not captured,556 Gates Ave. Apt. 7,,Brooklyn,New York,11221,,,Not captured,Not captured,a13luck13@yahoo.com,Not captured,701939771,,Not captured,Not captured,Not captured,Not captured,Not captured,Not captured,
Not captured,Not captured,08/19/2019,Not captured,Not captured,863949,020,00072,ARS-01-0052212,Beacon International,Not captured,Not captured,Not captured,,,,Paterson,james,,04/11/1987,male,Not captured,Not captured,Not captured,Not captured,Not captured,Not captured,Not captured,Not captured,Not captured,Not captured,Not captured,Not captured,Not captured,,,Not captured,Not captured,Not captured,Not captured,4949 w132 terrace,,Leawood,Kansas,66209,,,Not captured,Not captured,james@agrotechusa.com,Not captured,701939770,,Not captured,Not captured,Not captured,Not captured,Not captured,Not captured,
Not captured,Not captured,08/19/2019,Not captured,Not captured,863949,020,00072,ARS-01-0052211,Beacon International,Not captured,Not captured,Not captured,,,,Seljak,Cade,,05/03/1995,male,Not captured,Not captured,Not captured,Not captured,Not captured,Not captured,Not captured,Not captured,Not captured,Not captured,Not captured,Not captured,Not captured,,,Not captured,Not captured,Not captured,Not captured,16 Maple Court,,Pittsburgh,Pennsylvania,15237,,,Not captured,Not captured,cas294@pitt.edu,Not captured,701939769,,Not captured,Not captured,Not captured,Not captured,Not captured,Not captured,
Not captured,Not captured,08/19/2019,Not captured,Not captured,863949,020,00072,ARS-02-0052208,Beacon America,Not captured,Not captured,Not captured,,,,Chasnoff,Joel,,12/15/1973,male,Not captured,Not captured,Not captured,Not captured,Not captured,Not captured,Not captured,Not captured,Not captured,Not captured,Not captured,Not captured,Not captured,,,Not captured,Not captured,Not captured,Not captured,Eliezer Yafeh 37,,Raanana,,43104,,,Not captured,Not captured,jchasnoff@icloud.com,Not captured,701939763,,Not captured,Not captured,Not captured,Not captured,Not captured,Not captured,
Not captured,Not captured,08/18/2019,Not captured,Not captured,863949,020,00072,ARS-01-0052207,Beacon International,Not captured,Not captured,Not captured,,,,Haugestaul,Gunnar,,01/21/1980,male,Not captured,Not captured,Not captured,Not captured,Not captured,Not captured,Not captured,Not captured,Not captured,Not captured,Not captured,Not captured,Not captured,,,Not captured,Not captured,Not captured,Not captured,107A Canberra Street,,Singapore,,751107,,,Not captured,Not captured,joannagunnar@gmail.com,Not captured,701939762,,Not captured,Not captured,Not captured,Not captured,Not captured,Not captured,
Not captured,Not captured,08/19/2019,Not captured,Not captured,863949,020,00072,ARS-01-0052206,Beacon International,Not captured,Not captured,Not captured,,,,Friedman,Shane,,06/15/1986,female,Not captured,Not captured,Not captured,Not captured,Not captured,Not captured,Not captured,Not captured,Not captured,Not captured,Not captured,Not captured,Not captured,,,Not captured,Not captured,Not captured,Not captured,1539 EAST 29TH STREET,,BROOKLYN,New York,11229,,,Not captured,Not captured,RACHAYLEfriedman@gmail.COM,Not captured,701939761,,Not captured,Not captured,Not captured,Not captured,Not captured,Not captured,
Not captured,Not captured,08/19/2019,Not captured,Not captured,863949,020,00072,ARS-01-0052205,Beacon International,Not captured,Not captured,Not captured,,,,Friedman,Rachel,,08/08/1981,female,Not captured,Not captured,Not captured,Not captured,Not captured,Not captured,Not captured,Not captured,Not captured,Not captured,Not captured,Not captured,Not captured,,,Not captured,Not captured,Not captured,Not captured,1539 EAST 29TH STREET,,BROOKLYN,New York,11229,,,Not captured,Not captured,RACHAYLEfriedman@gmail.COM,Not captured,701939760,,Not captured,Not captured,Not captured,Not captured,Not captured,Not captured,
Not captured,Not captured,08/18/2019,Not captured,Not captured,863949,020,00072,ARS-01-0052204,Beacon International,Not captured,Not captured,Not captured,,,,Lukshis,Tracy,,08/21/1964,female,Not captured,Not captured,Not captured,Not captured,Not captured,Not captured,Not captured,Not captured,Not captured,Not captured,Not captured,Not captured,Not captured,,,Not captured,Not captured,Not captured,Not captured,4525 N 22nd St,,Phoenix,Arizona,85016,,,Not captured,Not captured,tlukshis@yahoo.com,Not captured,701939759,,Not captured,Not captured,Not captured,Not captured,Not captured,Not captured,
Not captured,Not captured,08/18/2019,Not captured,Not captured,863949,020,00072,ARS-01-0052203,Beacon International,Not captured,Not captured,Not captured,,,,Prilmeier,Robert,,05/04/1981,male,Not captured,Not captured,Not captured,Not captured,Not captured,Not captured,Not captured,Not captured,Not captured,Not captured,Not captured,Not captured,Not captured,,,Not captured,Not captured,Not captured,Not captured,5620 HURST STREET APT D,,NEW ORLEANS,Louisiana,70115,,,Not captured,Not captured,Robert.prilmeier@gmail.com,Not captured,701939758,,Not captured,Not captured,Not captured,Not captured,Not captured,Not captured,
Not captured,Not captured,08/17/2019,Not captured,Not captured,863949,020,00072,ARS-01-0052201,Beacon International,Not captured,Not captured,Not captured,,,,Stephens,Maxwell,D,09/20/1995,male,Not captured,Not captured,Not captured,Not captured,Not captured,Not captured,Not captured,Not captured,Not captured,Not captured,Not captured,Not captured,Not captured,,,Not captured,Not captured,Not captured,Not captured,28 Burnt House Rd,,Carlisle,Pennsylvania,17015,,,Not captured,Not captured,stephensm2011@gmail.com,Not captured,701939756,,Not captured,Not captured,Not captured,Not captured,Not captured,Not captured,
Not captured,Not captured,08/18/2019,Not captured,Not captured,863949,020,00072,ARS-02-0052200,Beacon America,Not captured,Not captured,Not captured,,,,Garrels,Georgia,,09/20/2004,female,Not captured,Not captured,Not captured,Not captured,Not captured,Not captured,Not captured,Not captured,Not captured,Not captured,Not captured,Not captured,Not captured,,,Not captured,Not captured,Not captured,Not captured,3501 Clinton Ave,,Cleveland,Ontario,44113,,,Not captured,Not captured,andersongarrels@mac.com,Not captured,701939755,,Not captured,Not captured,Not captured,Not captured,Not captured,Not captured,
Not captured,Not captured,08/17/2019,Not captured,Not captured,863949,020,00072,ARS-02-0052199,Beacon America,Not captured,Not captured,Not captured,Passport(149152989),,,Farias Perez,Tulio Anibal,,11/06/1979,male,Not captured,Not captured,Not captured,Not captured,Not captured,Not captured,Not captured,Not captured,Not captured,Not captured,Not captured,Not captured,Not captured,Maria Tarbay,Esposa,Not captured,Not captured,Not captured,Not captured,CARRETERA NACIONAL VIA LA TOSCANA URB. SAN MIGUEL LA ESPERANZA 2 # 8,,Maturin,Monagas,6201,+584140979161,+13462566321,Not captured,Not captured,tuliofariasp@gmail.com,Not captured,701939754,,Not captured,Not captured,Not captured,Not captured,Not captured,Not captured,
Not captured,Not captured,08/18/2019,Not captured,Not captured,863949,020,00072,ARS-01-0052198,Beacon International,Not captured,Not captured,Not captured,,,,Valderruten,Harold,,05/04/1979,male,Not captured,Not captured,Not captured,Not captured,Not captured,Not captured,Not captured,Not captured,Not captured,Not captured,Not captured,Not captured,Not captured,Hugo Medina,Brother,Not captured,Not captured,Not captured,Not captured,Calle 20 121-234,,Cali,Valle del Cauca,760032,573165225105,,Not captured,Not captured,admin@cnx.co,Not captured,701939753,,Not captured,Not captured,Not captured,Not captured,Not captured,Not captured,
Not captured,Not captured,08/18/2019,Not captured,Not captured,863949,020,00072,ARS-01-0052197,Beacon International,Not captured,Not captured,Not captured,Passport(94521399),,,Medina,German,,05/25/1978,male,Not captured,Not captured,Not captured,Not captured,Not captured,Not captured,Not captured,Not captured,Not captured,Not captured,Not captured,Not captured,Not captured,Hugo Medina,Brother,Not captured,Not captured,Not captured,Not captured,Calle 20 121-234,,Cali,Valle del Cauca,760032,573165225105,,Not captured,Not captured,admin@cnx.co,Not captured,701939752,,Not captured,Not captured,Not captured,Not captured,Not captured,Not captured,
Not captured,Not captured,08/17/2019,Not captured,Not captured,863949,020,00072,ARS-01-0052193,Beacon International,Not captured,Not captured,Not captured,,,,Dockes,Caroline,,02/26/1996,female,Not captured,Not captured,Not captured,Not captured,Not captured,Not captured,Not captured,Not captured,Not captured,Not captured,Not captured,Not captured,Not captured,,,Not captured,Not captured,Not captured,Not captured,10 Hardwick street,,CAMBRIDGE,Massachusetts,02141,,,Not captured,Not captured,caroline.dockes@gmail.com,Not captured,701939748,,Not captured,Not captured,Not captured,Not captured,Not captured,Not captured,
Not captured,Not captured,08/17/2019,Not captured,Not captured,863949,020,00072,ARS-01-0052192,Beacon International,Not captured,Not captured,Not captured,,,,wilson,thomas,L,06/17/1989,male,Not captured,Not captured,Not captured,Not captured,Not captured,Not captured,Not captured,Not captured,Not captured,Not captured,Not captured,Not captured,Not captured,,,Not captured,Not captured,Not captured,Not captured,417 Brent St,,Winston Salem,North Carolina,27103,,,Not captured,Not captured,thomas.lawrence.wilson@gmail.com,Not captured,701939747,,Not captured,Not captured,Not captured,Not captured,Not captured,Not captured,