EE Transaction Type,Dependent Transaction Type,Effective Date,EE Signature,EE Signature Date,Control,Suffix,Account,Plan Number,Plan Name,Claim Office,Network ID Number,Customer Code,EE SSN,Dependent SSN,Dependent Relationship,Last Name,First Name,Middle Initial,DOB,Gender,Ethnicity,PCP/PCD,PCP/PCD Current Patient,Provider Cap Office Number,COB,Dep Student Indicator,Dep OOA Indicator,EE Prior Coverage Indicator,EE Late Entrant,EE Language Indicator,Hire Date,Earnings,Earnings Frequency,Beneficiary (Last Name First Name MI),Beneficiary Relationship,Continuation of Coverage Expiration Date,Continuation of Coverage Event Date,Continuation of Coverage Length of Coverage,Work Location Zip Code,Street Address Line 1,Street Address Line 2,City,State,Zip Code,Home Phone Number,Work Phone Number,Accept Code,Evidence Code,EE Email Address,Communication Disability Code,EE Alternate ID,Dep Alternate ID,Old Control,Old Suffix,Old Account,New Control,New Suffix,New Account,
Not captured,Not captured,08/17/2019,Not captured,Not captured,863949,020,00072,ARS-03-0051993,Essential America,Not captured,Not captured,Not captured,Passport(505571158),,,kaufman,paul,marvin,09/25/1970,male,Not captured,Not captured,Not captured,Not captured,Not captured,Not captured,Not captured,Not captured,Not captured,Not captured,Not captured,Not captured,Not captured,,,Not captured,Not captured,Not captured,Not captured,5026 Rosabelle Beach Ave,,Holland,Michigan,49424,6164030925,,Not captured,Not captured,elizapaulkaufman@gmail.com,Not captured,701939362,,Not captured,Not captured,Not captured,Not captured,Not captured,Not captured,
Not captured,Not captured,08/17/2019,Not captured,Not captured,863949,020,00072,ARS-03-0051993,Essential America,Not captured,Not captured,Not captured,,Passport(469737227),Spouse,kaufman,elizabeth,anne,09/19/1978,female,Not captured,Not captured,Not captured,Not captured,Not captured,Not captured,Not captured,Not captured,Not captured,Not captured,Not captured,Not captured,Not captured,,,Not captured,Not captured,Not captured,Not captured,5026 Rosabelle Beach Ave,,Holland,Michigan,49424,6164030925,,Not captured,Not captured,elizapaulkaufman@gmail.com,Not captured,,701939363,Not captured,Not captured,Not captured,Not captured,Not captured,Not captured,
Not captured,Not captured,08/17/2019,Not captured,Not captured,863949,020,00072,ARS-03-0051993,Essential America,Not captured,Not captured,Not captured,,Passport(565557766),Dependant,kaufman,inman,john,01/02/2008,male,Not captured,Not captured,Not captured,Not captured,Not captured,Not captured,Not captured,Not captured,Not captured,Not captured,Not captured,Not captured,Not captured,,,Not captured,Not captured,Not captured,Not captured,5026 Rosabelle Beach Ave,,Holland,Michigan,49424,6164030925,,Not captured,Not captured,elizapaulkaufman@gmail.com,Not captured,,701939364,Not captured,Not captured,Not captured,Not captured,Not captured,Not captured,
Not captured,Not captured,08/17/2019,Not captured,Not captured,863949,020,00072,ARS-03-0051993,Essential America,Not captured,Not captured,Not captured,,Passport(530001719),Dependant,kaufman,owen,paul,07/24/2009,male,Not captured,Not captured,Not captured,Not captured,Not captured,Not captured,Not captured,Not captured,Not captured,Not captured,Not captured,Not captured,Not captured,,,Not captured,Not captured,Not captured,Not captured,5026 Rosabelle Beach Ave,,Holland,Michigan,49424,6164030925,,Not captured,Not captured,elizapaulkaufman@gmail.com,Not captured,,701939365,Not captured,Not captured,Not captured,Not captured,Not captured,Not captured,
Not captured,Not captured,08/17/2019,Not captured,Not captured,863949,020,00072,ARS-03-0051993,Essential America,Not captured,Not captured,Not captured,,Passport(565557765),Dependant,kaufman,isaiah,lane,10/23/2011,male,Not captured,Not captured,Not captured,Not captured,Not captured,Not captured,Not captured,Not captured,Not captured,Not captured,Not captured,Not captured,Not captured,,,Not captured,Not captured,Not captured,Not captured,5026 Rosabelle Beach Ave,,Holland,Michigan,49424,6164030925,,Not captured,Not captured,elizapaulkaufman@gmail.com,Not captured,,701939366,Not captured,Not captured,Not captured,Not captured,Not captured,Not captured,
Not captured,Not captured,08/17/2019,Not captured,Not captured,863949,020,00072,ARS-03-0051993,Essential America,Not captured,Not captured,Not captured,,Passport(597180451),Dependant,kaufman,simeon,andrew,01/06/2014,male,Not captured,Not captured,Not captured,Not captured,Not captured,Not captured,Not captured,Not captured,Not captured,Not captured,Not captured,Not captured,Not captured,,,Not captured,Not captured,Not captured,Not captured,5026 Rosabelle Beach Ave,,Holland,Michigan,49424,6164030925,,Not captured,Not captured,elizapaulkaufman@gmail.com,Not captured,,701939367,Not captured,Not captured,Not captured,Not captured,Not captured,Not captured,
Not captured,Not captured,08/18/2019,Not captured,Not captured,863949,020,00072,ARS-01-0052207,Beacon International,Not captured,Not captured,Not captured,,,,Haugestaul,Gunnar,,01/21/1980,male,Not captured,Not captured,Not captured,Not captured,Not captured,Not captured,Not captured,Not captured,Not captured,Not captured,Not captured,Not captured,Not captured,,,Not captured,Not captured,Not captured,Not captured,107A Canberra Street,,Singapore,,751107,,,Not captured,Not captured,joannagunnar@gmail.com,Not captured,701939762,,Not captured,Not captured,Not captured,Not captured,Not captured,Not captured,
Not captured,Not captured,08/18/2019,Not captured,Not captured,863949,020,00072,ARS-01-0052204,Beacon International,Not captured,Not captured,Not captured,,,,Lukshis,Tracy,,08/21/1964,female,Not captured,Not captured,Not captured,Not captured,Not captured,Not captured,Not captured,Not captured,Not captured,Not captured,Not captured,Not captured,Not captured,,,Not captured,Not captured,Not captured,Not captured,4525 N 22nd St,,Phoenix,Arizona,85016,,,Not captured,Not captured,tlukshis@yahoo.com,Not captured,701939759,,Not captured,Not captured,Not captured,Not captured,Not captured,Not captured,
Not captured,Not captured,08/18/2019,Not captured,Not captured,863949,020,00072,ARS-01-0052203,Beacon International,Not captured,Not captured,Not captured,,,,Prilmeier,Robert,,05/04/1981,male,Not captured,Not captured,Not captured,Not captured,Not captured,Not captured,Not captured,Not captured,Not captured,Not captured,Not captured,Not captured,Not captured,,,Not captured,Not captured,Not captured,Not captured,5620 HURST STREET APT D,,NEW ORLEANS,Louisiana,70115,,,Not captured,Not captured,Robert.prilmeier@gmail.com,Not captured,701939758,,Not captured,Not captured,Not captured,Not captured,Not captured,Not captured,
Not captured,Not captured,08/17/2019,Not captured,Not captured,863949,020,00072,ARS-01-0052201,Beacon International,Not captured,Not captured,Not captured,,,,Stephens,Maxwell,D,09/20/1995,male,Not captured,Not captured,Not captured,Not captured,Not captured,Not captured,Not captured,Not captured,Not captured,Not captured,Not captured,Not captured,Not captured,,,Not captured,Not captured,Not captured,Not captured,28 Burnt House Rd,,Carlisle,Pennsylvania,17015,,,Not captured,Not captured,stephensm2011@gmail.com,Not captured,701939756,,Not captured,Not captured,Not captured,Not captured,Not captured,Not captured,
Not captured,Not captured,08/18/2019,Not captured,Not captured,863949,020,00072,ARS-02-0052200,Beacon America,Not captured,Not captured,Not captured,,,,Garrels,Georgia,,09/20/2004,female,Not captured,Not captured,Not captured,Not captured,Not captured,Not captured,Not captured,Not captured,Not captured,Not captured,Not captured,Not captured,Not captured,,,Not captured,Not captured,Not captured,Not captured,3501 Clinton Ave,,Cleveland,Ontario,44113,,,Not captured,Not captured,andersongarrels@mac.com,Not captured,701939755,,Not captured,Not captured,Not captured,Not captured,Not captured,Not captured,
Not captured,Not captured,08/17/2019,Not captured,Not captured,863949,020,00072,ARS-02-0052199,Beacon America,Not captured,Not captured,Not captured,Passport(149152989),,,Farias Perez,Tulio Anibal,,11/06/1979,male,Not captured,Not captured,Not captured,Not captured,Not captured,Not captured,Not captured,Not captured,Not captured,Not captured,Not captured,Not captured,Not captured,Maria Tarbay,Esposa,Not captured,Not captured,Not captured,Not captured,CARRETERA NACIONAL VIA LA TOSCANA URB. SAN MIGUEL LA ESPERANZA 2 # 8,,Maturin,Monagas,6201,+584140979161,+13462566321,Not captured,Not captured,tuliofariasp@gmail.com,Not captured,701939754,,Not captured,Not captured,Not captured,Not captured,Not captured,Not captured,
Not captured,Not captured,08/18/2019,Not captured,Not captured,863949,020,00072,ARS-01-0052198,Beacon International,Not captured,Not captured,Not captured,,,,Valderruten,Harold,,05/04/1979,male,Not captured,Not captured,Not captured,Not captured,Not captured,Not captured,Not captured,Not captured,Not captured,Not captured,Not captured,Not captured,Not captured,Hugo Medina,Brother,Not captured,Not captured,Not captured,Not captured,Calle 20 121-234,,Cali,Valle del Cauca,760032,573165225105,,Not captured,Not captured,admin@cnx.co,Not captured,701939753,,Not captured,Not captured,Not captured,Not captured,Not captured,Not captured,
Not captured,Not captured,08/18/2019,Not captured,Not captured,863949,020,00072,ARS-01-0052197,Beacon International,Not captured,Not captured,Not captured,Passport(94521399),,,Medina,German,,05/25/1978,male,Not captured,Not captured,Not captured,Not captured,Not captured,Not captured,Not captured,Not captured,Not captured,Not captured,Not captured,Not captured,Not captured,Hugo Medina,Brother,Not captured,Not captured,Not captured,Not captured,Calle 20 121-234,,Cali,Valle del Cauca,760032,573165225105,,Not captured,Not captured,admin@cnx.co,Not captured,701939752,,Not captured,Not captured,Not captured,Not captured,Not captured,Not captured,
Not captured,Not captured,08/17/2019,Not captured,Not captured,863949,020,00072,ARS-01-0052193,Beacon International,Not captured,Not captured,Not captured,,,,Dockes,Caroline,,02/26/1996,female,Not captured,Not captured,Not captured,Not captured,Not captured,Not captured,Not captured,Not captured,Not captured,Not captured,Not captured,Not captured,Not captured,,,Not captured,Not captured,Not captured,Not captured,10 Hardwick street,,CAMBRIDGE,Massachusetts,02141,,,Not captured,Not captured,caroline.dockes@gmail.com,Not captured,701939748,,Not captured,Not captured,Not captured,Not captured,Not captured,Not captured,
Not captured,Not captured,08/17/2019,Not captured,Not captured,863949,020,00072,ARS-01-0052192,Beacon International,Not captured,Not captured,Not captured,,,,wilson,thomas,L,06/17/1989,male,Not captured,Not captured,Not captured,Not captured,Not captured,Not captured,Not captured,Not captured,Not captured,Not captured,Not captured,Not captured,Not captured,,,Not captured,Not captured,Not captured,Not captured,417 Brent St,,Winston Salem,North Carolina,27103,,,Not captured,Not captured,thomas.lawrence.wilson@gmail.com,Not captured,701939747,,Not captured,Not captured,Not captured,Not captured,Not captured,Not captured,
Not captured,Not captured,08/17/2019,Not captured,Not captured,863949,020,00072,ARS-01-0052191,Beacon International,Not captured,Not captured,Not captured,,,,wilson,kathyrn,,06/07/1990,female,Not captured,Not captured,Not captured,Not captured,Not captured,Not captured,Not captured,Not captured,Not captured,Not captured,Not captured,Not captured,Not captured,,,Not captured,Not captured,Not captured,Not captured,417 Brent St,,Winston Salem,North Carolina,27103,,,Not captured,Not captured,thomas.lawrence.wilson@gmail.com,Not captured,701939746,,Not captured,Not captured,Not captured,Not captured,Not captured,Not captured,
Not captured,Not captured,08/17/2019,Not captured,Not captured,863949,020,00072,ARS-01-0052188,Beacon International,Not captured,Not captured,Not captured,,,,Moon,Seoyoung,,12/12/1986,female,Not captured,Not captured,Not captured,Not captured,Not captured,Not captured,Not captured,Not captured,Not captured,Not captured,Not captured,Not captured,Not captured,,,Not captured,Not captured,Not captured,Not captured,258 Queens Road East The Zenith Block 3 Flat F 30th Floor,,Wan Chai,,Wan Chai,,,Not captured,Not captured,chadyamagata@gmail.com,Not captured,701939743,,Not captured,Not captured,Not captured,Not captured,Not captured,Not captured,
Not captured,Not captured,08/17/2019,Not captured,Not captured,863949,020,00072,ARS-01-0052187,Beacon International,Not captured,Not captured,Not captured,,,,Yamagata,Chad,T,08/30/1977,male,Not captured,Not captured,Not captured,Not captured,Not captured,Not captured,Not captured,Not captured,Not captured,Not captured,Not captured,Not captured,Not captured,,,Not captured,Not captured,Not captured,Not captured,258 Queens Road East The Zenith Block 3 Flat F 30th Floor,,Wan Chai,,Wan Chai,,,Not captured,Not captured,chadyamagata@gmail.com,Not captured,701939742,,Not captured,Not captured,Not captured,Not captured,Not captured,Not captured,
Not captured,Not captured,08/16/2019,Not captured,Not captured,863949,020,00072,ARS-01-0052181,Beacon International,Not captured,Not captured,Not captured,,,,Felix,Rosie,,10/18/1972,female,Not captured,Not captured,Not captured,Not captured,Not captured,Not captured,Not captured,Not captured,Not captured,Not captured,Not captured,Not captured,Not captured,,,Not captured,Not captured,Not captured,Not captured,21915 WYANDOTTE ST,,Canoga Park,California,91303,,,Not captured,Not captured,romos14@gmail.com,Not captured,701939736,,Not captured,Not captured,Not captured,Not captured,Not captured,Not captured,
Not captured,Not captured,08/16/2019,Not captured,Not captured,863949,020,00072,ARS-01-0052180,Beacon International,Not captured,Not captured,Not captured,,,,Mosley,Roderick,,01/14/1975,male,Not captured,Not captured,Not captured,Not captured,Not captured,Not captured,Not captured,Not captured,Not captured,Not captured,Not captured,Not captured,Not captured,,,Not captured,Not captured,Not captured,Not captured,21915 WYANDOTTE ST,,Canoga Park,California,91303,,,Not captured,Not captured,romos14@gmail.com,Not captured,701939735,,Not captured,Not captured,Not captured,Not captured,Not captured,Not captured,
Not captured,Not captured,08/17/2019,Not captured,Not captured,863949,020,00072,ARS-02-0052179,Beacon America,Not captured,Not captured,Not captured,Passport(L8347523),,,Samson,Priscilla,,10/18/1971,female,Not captured,Not captured,Not captured,Not captured,Not captured,Not captured,Not captured,Not captured,Not captured,Not captured,Not captured,Not captured,Not captured,Evangelical Friends Mission,other,Not captured,Not captured,Not captured,Not captured,2018 W Maple,,Wichita,Kansas,67277,3034218100,,Not captured,Not captured,debby@friendsmission.com,Not captured,701939734,,Not captured,Not captured,Not captured,Not captured,Not captured,Not captured,
Not captured,Not captured,08/17/2019,Not captured,Not captured,863949,020,00072,ARS-02-0052178,Beacon America,Not captured,Not captured,Not captured,Passport(Z2906205),,,Retnaraj,Samson Prakash,,12/28/1952,male,Not captured,Not captured,Not captured,Not captured,Not captured,Not captured,Not captured,Not captured,Not captured,Not captured,Not captured,Not captured,Not captured,Evangelical Friends Mission,other,Not captured,Not captured,Not captured,Not captured,218 W Maple,,Wichita,Kansas,67277,3034218100,,Not captured,Not captured,debby@friendsmission.com,Not captured,701939733,,Not captured,Not captured,Not captured,Not captured,Not captured,Not captured,
Not captured,Not captured,08/16/2019,Not captured,Not captured,863949,020,00072,ARS-01-0052175,Beacon International,Not captured,Not captured,Not captured,,,,Sills,Georgia,,08/27/1991,female,Not captured,Not captured,Not captured,Not captured,Not captured,Not captured,Not captured,Not captured,Not captured,Not captured,Not captured,Not captured,Not captured,,,Not captured,Not captured,Not captured,Not captured,500 Hawthorn Ave,,Boulder,Colorado,80304,,,Not captured,Not captured,gsills@mac.com,Not captured,701939717,,Not captured,Not captured,Not captured,Not captured,Not captured,Not captured,
Not captured,Not captured,08/18/2019,Not captured,Not captured,863949,020,00072,ARS-01-0052174,Beacon International,Not captured,Not captured,Not captured,,,,Goldman,Esther,,01/26/1945,female,Not captured,Not captured,Not captured,Not captured,Not captured,Not captured,Not captured,Not captured,Not captured,Not captured,Not captured,Not captured,Not captured,,,Not captured,Not captured,Not captured,Not captured,1439 Northlake Dr,,Lakewood,New Jersey,08701,7328865751,,Not captured,Not captured,yzuckerman@gmail.com,Not captured,701939706,,Not captured,Not captured,Not captured,Not captured,Not captured,Not captured,
Not captured,Not captured,08/18/2019,Not captured,Not captured,863949,020,00072,ARS-01-0052173,Beacon International,Not captured,Not captured,Not captured,,,,Zuckerman,Rosalyn,,06/13/1942,female,Not captured,Not captured,Not captured,Not captured,Not captured,Not captured,Not captured,Not captured,Not captured,Not captured,Not captured,Not captured,Not captured,,,Not captured,Not captured,Not captured,Not captured,1439 Northlake Dr,,Lakewood,New Jersey,08701,7328865751,,Not captured,Not captured,yzuckerman@gmail.com,Not captured,701939705,,Not captured,Not captured,Not captured,Not captured,Not captured,Not captured,
Not captured,Not captured,08/18/2019,Not captured,Not captured,863949,020,00072,ARS-01-0052172,Beacon International,Not captured,Not captured,Not captured,,,,Zuckerman,Aliza,,06/03/2019,female,Not captured,Not captured,Not captured,Not captured,Not captured,Not captured,Not captured,Not captured,Not captured,Not captured,Not captured,Not captured,Not captured,,,Not captured,Not captured,Not captured,Not captured,1439 Northlake Dr,,Lakewood,New Jersey,08701,732-8865751,,Not captured,Not captured,yzuckerman@gmail.com,Not captured,701939704,,Not captured,Not captured,Not captured,Not captured,Not captured,Not captured,
Not captured,Not captured,08/18/2019,Not captured,Not captured,863949,020,00072,ARS-01-0052171,Beacon International,Not captured,Not captured,Not captured,,,,Zuckerman,Judah,,08/15/2019,male,Not captured,Not captured,Not captured,Not captured,Not captured,Not captured,Not captured,Not captured,Not captured,Not captured,Not captured,Not captured,Not captured,,,Not captured,Not captured,Not captured,Not captured,1439 Northlake Dr,,Lakewood,New Jersey,08701,732-8865751,,Not captured,Not captured,yzuckerman@gmail.com,Not captured,701939703,,Not captured,Not captured,Not captured,Not captured,Not captured,Not captured,
Not captured,Not captured,08/18/2019,Not captured,Not captured,863949,020,00072,ARS-01-0052170,Beacon International,Not captured,Not captured,Not captured,,,,Zuckerman,Michelle,,01/30/2015,female,Not captured,Not captured,Not captured,Not captured,Not captured,Not captured,Not captured,Not captured,Not captured,Not captured,Not captured,Not captured,Not captured,,,Not captured,Not captured,Not captured,Not captured,1439 Northlake Dr,,Lakewood,New Jersey,08701,732-8865751,,Not captured,Not captured,yzuckerman@gmail.com,Not captured,701939702,,Not captured,Not captured,Not captured,Not captured,Not captured,Not captured,
Not captured,Not captured,08/18/2019,Not captured,Not captured,863949,020,00072,ARS-01-0052169,Beacon International,Not captured,Not captured,Not captured,,,,Zuckerman,Ayala,,07/09/2009,female,Not captured,Not captured,Not captured,Not captured,Not captured,Not captured,Not captured,Not captured,Not captured,Not captured,Not captured,Not captured,Not captured,,,Not captured,Not captured,Not captured,Not captured,1439 Northlake Dr,,Lakewood,New Jersey,08701,732-8865751,,Not captured,Not captured,yzuckerman@gmail.com,Not captured,701939701,,Not captured,Not captured,Not captured,Not captured,Not captured,Not captured,
Not captured,Not captured,08/18/2019,Not captured,Not captured,863949,020,00072,ARS-01-0052168,Beacon International,Not captured,Not captured,Not captured,,,,Zuckerman,Asher,,10/01/1997,female,Not captured,Not captured,Not captured,Not captured,Not captured,Not captured,Not captured,Not captured,Not captured,Not captured,Not captured,Not captured,Not captured,,,Not captured,Not captured,Not captured,Not captured,1439 Northlake Dr,,Lakewood,New Jersey,08701,732-8865751,,Not captured,Not captured,yzuckerman@gmail.com,Not captured,701939700,,Not captured,Not captured,Not captured,Not captured,Not captured,Not captured,
Not captured,Not captured,08/18/2019,Not captured,Not captured,863949,020,00072,ARS-01-0052167,Beacon International,Not captured,Not captured,Not captured,,,,Zuckerman,Shoshana,,03/12/1974,female,Not captured,Not captured,Not captured,Not captured,Not captured,Not captured,Not captured,Not captured,Not captured,Not captured,Not captured,Not captured,Not captured,,,Not captured,Not captured,Not captured,Not captured,1439 Northlake Dr,,Lakewood,New Jersey,08701,732-8865751,,Not captured,Not captured,yzuckerman@gmail.com,Not captured,701939699,,Not captured,Not captured,Not captured,Not captured,Not captured,Not captured,
Not captured,Not captured,08/18/2019,Not captured,Not captured,863949,020,00072,ARS-01-0052166,Beacon International,Not captured,Not captured,Not captured,,,,Zuckerman,Jonathan,,07/31/1969,male,Not captured,Not captured,Not captured,Not captured,Not captured,Not captured,Not captured,Not captured,Not captured,Not captured,Not captured,Not captured,Not captured,,,Not captured,Not captured,Not captured,Not captured,1439 Northlake Dr,,Lakewood,New Jersey,08701,732-8865751,,Not captured,Not captured,yzuckerman@gmail.com,Not captured,701939698,,Not captured,Not captured,Not captured,Not captured,Not captured,Not captured,
Not captured,Not captured,08/18/2019,Not captured,Not captured,863949,020,00072,ARS-01-0052164,Beacon International,Not captured,Not captured,Not captured,Passport(aae799601),,,Pascua,Francisco Javier,,10/28/1966,male,Not captured,Not captured,Not captured,Not captured,Not captured,Not captured,Not captured,Not captured,Not captured,Not captured,Not captured,Not captured,Not captured,,,Not captured,Not captured,Not captured,Not captured,2425 Wilson Blvd,,Arlington,Virginia,22201,7038415641,,Not captured,Not captured,pamruthkumar@ncsc.org,Not captured,701939696,,Not captured,Not captured,Not captured,Not captured,Not captured,Not captured,
Not captured,Not captured,08/16/2019,Not captured,Not captured,863949,020,00072,ARS-01-0052163,Beacon International,Not captured,Not captured,Not captured,Passport(B01142157),,,Mendez Palomo,Miguel Antonio,,05/10/1966,male,Not captured,Not captured,Not captured,Not captured,Not captured,Not captured,Not captured,Not captured,Not captured,Not captured,Not captured,Not captured,Not captured,,,Not captured,Not captured,Not captured,Not captured,2425 Wilson Blvd,,Arlington,Virginia,22201,7038415641,,Not captured,Not captured,pamruthkumar@ncsc.org,Not captured,701939695,,Not captured,Not captured,Not captured,Not captured,Not captured,Not captured,
Not captured,Not captured,08/16/2019,Not captured,Not captured,863949,020,00072,ARS-01-0052158,Beacon International,Not captured,Not captured,Not captured,,,,Spitzer,Sebastian,,03/06/1992,male,Not captured,Not captured,Not captured,Not captured,Not captured,Not captured,Not captured,Not captured,Not captured,Not captured,Not captured,Not captured,Not captured,,,Not captured,Not captured,Not captured,Not captured,Plescherken 100,,Keutschach,,9074,,,Not captured,Not captured,ziranoconsulting@gmail.com,Not captured,701939687,,Not captured,Not captured,Not captured,Not captured,Not captured,Not captured,