EE Transaction Type,Dependent Transaction Type,Effective Date,EE Signature,EE Signature Date,Control,Suffix,Account,Plan Number,Plan Name,Claim Office,Network ID Number,Customer Code,EE SSN,Dependent SSN,Dependent Relationship,Last Name,First Name,Middle Initial,DOB,Gender,Ethnicity,PCP/PCD,PCP/PCD Current Patient,Provider Cap Office Number,COB,Dep Student Indicator,Dep OOA Indicator,EE Prior Coverage Indicator,EE Late Entrant,EE Language Indicator,Hire Date,Earnings,Earnings Frequency,Beneficiary (Last Name First Name MI),Beneficiary Relationship,Continuation of Coverage Expiration Date,Continuation of Coverage Event Date,Continuation of Coverage Length of Coverage,Work Location Zip Code,Street Address Line 1,Street Address Line 2,City,State,Zip Code,Home Phone Number,Work Phone Number,Accept Code,Evidence Code,EE Email Address,Communication Disability Code,EE Alternate ID,Dep Alternate ID,Old Control,Old Suffix,Old Account,New Control,New Suffix,New Account,
Not captured,Not captured,08/15/2019,Not captured,Not captured,863949,020,00072,ARS-01-0052147,Beacon International,Not captured,Not captured,Not captured,,,,Alberti,Noah,R,02/28/2003,male,Not captured,Not captured,Not captured,Not captured,Not captured,Not captured,Not captured,Not captured,Not captured,Not captured,Not captured,Not captured,Not captured,,,Not captured,Not captured,Not captured,Not captured,38 Tram Drive,,Oxford,Connecticut,06478,,,Not captured,Not captured,da30ny@gmail.com,Not captured,701939671,,Not captured,Not captured,Not captured,Not captured,Not captured,Not captured,
Not captured,Not captured,08/15/2019,Not captured,Not captured,863949,020,00072,ARS-01-0052146,Beacon International,Not captured,Not captured,Not captured,,,,Espina,Dario,,01/01/1958,male,Not captured,Not captured,Not captured,Not captured,Not captured,Not captured,Not captured,Not captured,Not captured,Not captured,Not captured,Not captured,Not captured,,,Not captured,Not captured,Not captured,Not captured,4300 Rogers Ave # 20-511,,Fort Smith,Arkansas,72903,,,Not captured,Not captured,preventionpays@aol.com,Not captured,701939670,,Not captured,Not captured,Not captured,Not captured,Not captured,Not captured,
Not captured,Not captured,08/15/2019,Not captured,Not captured,863949,020,00072,ARS-02-0052143,Beacon America,Not captured,Not captured,Not captured,,,,Basch,Moshe,,08/03/2013,male,Not captured,Not captured,Not captured,Not captured,Not captured,Not captured,Not captured,Not captured,Not captured,Not captured,Not captured,Not captured,Not captured,,,Not captured,Not captured,Not captured,Not captured,980 Park Ave,,Lakewood,New Jersey,08701,848-240-1789,,Not captured,Not captured,rsilver5765@gmail.com,Not captured,701939665,,Not captured,Not captured,Not captured,Not captured,Not captured,Not captured,
Not captured,Not captured,08/15/2019,Not captured,Not captured,863949,020,00072,ARS-02-0052142,Beacon America,Not captured,Not captured,Not captured,,,,Basch,Dovid,,07/09/2012,male,Not captured,Not captured,Not captured,Not captured,Not captured,Not captured,Not captured,Not captured,Not captured,Not captured,Not captured,Not captured,Not captured,,,Not captured,Not captured,Not captured,Not captured,980 Park Ave,,Lakewood,New Jersey,08701,848-240-1789,,Not captured,Not captured,rsilver5765@gmail.com,Not captured,701939664,,Not captured,Not captured,Not captured,Not captured,Not captured,Not captured,
Not captured,Not captured,08/15/2019,Not captured,Not captured,863949,020,00072,ARS-02-0052141,Beacon America,Not captured,Not captured,Not captured,,,,Basch,Risa,,09/18/1990,female,Not captured,Not captured,Not captured,Not captured,Not captured,Not captured,Not captured,Not captured,Not captured,Not captured,Not captured,Not captured,Not captured,,,Not captured,Not captured,Not captured,Not captured,980 Park Ave,,Lakewood,New Jersey,08701,848-240-1789,,Not captured,Not captured,rsilver5765@gmail.com,Not captured,701939663,,Not captured,Not captured,Not captured,Not captured,Not captured,Not captured,
Not captured,Not captured,08/15/2019,Not captured,Not captured,863949,020,00072,ARS-02-0052140,Beacon America,Not captured,Not captured,Not captured,,,,Basch,Shlomo,,04/28/1987,male,Not captured,Not captured,Not captured,Not captured,Not captured,Not captured,Not captured,Not captured,Not captured,Not captured,Not captured,Not captured,Not captured,,,Not captured,Not captured,Not captured,Not captured,980 Park Ave,,Lakewood,New Jersey,08701,848-240-1789,,Not captured,Not captured,rsilver5765@gmail.com,Not captured,701939662,,Not captured,Not captured,Not captured,Not captured,Not captured,Not captured,
Not captured,Not captured,08/15/2019,Not captured,Not captured,863949,020,00072,ARS-03-0052116,Essential America,Not captured,Not captured,Not captured,Passport(R163554766330),,,Rivera De Viana,Marina,,04/13/1976,female,Not captured,Not captured,Not captured,Not captured,Not captured,Not captured,Not captured,Not captured,Not captured,Not captured,Not captured,Not captured,Not captured,,,Not captured,Not captured,Not captured,Not captured,5955 NW 105th Ct. Apt. 5726,,Doral,Florida,33178,7864981599,,Not captured,Not captured,lcalas@cigasolutions.com,Not captured,701939634,,Not captured,Not captured,Not captured,Not captured,Not captured,Not captured,
Not captured,Not captured,08/15/2019,Not captured,Not captured,863949,020,00072,ARS-02-0052137,Beacon America,Not captured,Not captured,Not captured,,,,Deutsch,Ahuva,,04/11/2019,male,Not captured,Not captured,Not captured,Not captured,Not captured,Not captured,Not captured,Not captured,Not captured,Not captured,Not captured,Not captured,Not captured,,,Not captured,Not captured,Not captured,Not captured,4 Coles Lake,,Lakewood,New Jersey,08701,848-299-1973,,Not captured,Not captured,deutsch4547@gmail.com,Not captured,701939658,,Not captured,Not captured,Not captured,Not captured,Not captured,Not captured,
Not captured,Not captured,08/15/2019,Not captured,Not captured,863949,020,00072,ARS-02-0052136,Beacon America,Not captured,Not captured,Not captured,,,,Deutsch,Meyer,,04/05/2016,male,Not captured,Not captured,Not captured,Not captured,Not captured,Not captured,Not captured,Not captured,Not captured,Not captured,Not captured,Not captured,Not captured,,,Not captured,Not captured,Not captured,Not captured,4 Coles Lake,,Lakewood,New Jersey,08701,848-299-1973,,Not captured,Not captured,deutsch4547@gmail.com,Not captured,701939657,,Not captured,Not captured,Not captured,Not captured,Not captured,Not captured,
Not captured,Not captured,08/15/2019,Not captured,Not captured,863949,020,00072,ARS-02-0052135,Beacon America,Not captured,Not captured,Not captured,,,,Deutsch,Yehuda,,03/01/2014,male,Not captured,Not captured,Not captured,Not captured,Not captured,Not captured,Not captured,Not captured,Not captured,Not captured,Not captured,Not captured,Not captured,,,Not captured,Not captured,Not captured,Not captured,4 Coles Lake,,Lakewood,New Jersey,08701,848-299-1973,,Not captured,Not captured,deutsch4547@gmail.com,Not captured,701939656,,Not captured,Not captured,Not captured,Not captured,Not captured,Not captured,
Not captured,Not captured,08/15/2019,Not captured,Not captured,863949,020,00072,ARS-02-0052134,Beacon America,Not captured,Not captured,Not captured,,,,Deutsch,Rafael,,01/01/2012,male,Not captured,Not captured,Not captured,Not captured,Not captured,Not captured,Not captured,Not captured,Not captured,Not captured,Not captured,Not captured,Not captured,,,Not captured,Not captured,Not captured,Not captured,4 Coles Lake,,Lakewood,New Jersey,08701,848-299-1973,,Not captured,Not captured,deutsch4547@gmail.com,Not captured,701939655,,Not captured,Not captured,Not captured,Not captured,Not captured,Not captured,
Not captured,Not captured,08/15/2019,Not captured,Not captured,863949,020,00072,ARS-02-0052133,Beacon America,Not captured,Not captured,Not captured,,,,Deutsch,Tova,,06/24/2009,female,Not captured,Not captured,Not captured,Not captured,Not captured,Not captured,Not captured,Not captured,Not captured,Not captured,Not captured,Not captured,Not captured,,,Not captured,Not captured,Not captured,Not captured,4 Coles Lake,,Lakewood,New Jersey,08701,848-299-1973,,Not captured,Not captured,deutsch4547@gmail.com,Not captured,701939654,,Not captured,Not captured,Not captured,Not captured,Not captured,Not captured,
Not captured,Not captured,08/15/2019,Not captured,Not captured,863949,020,00072,ARS-02-0052132,Beacon America,Not captured,Not captured,Not captured,,,,Deutsch,Chana,,10/06/2007,female,Not captured,Not captured,Not captured,Not captured,Not captured,Not captured,Not captured,Not captured,Not captured,Not captured,Not captured,Not captured,Not captured,,,Not captured,Not captured,Not captured,Not captured,4 Coles Lake,,Lakewood,New Jersey,08701,848-299-1973,,Not captured,Not captured,deutsch4547@gmail.com,Not captured,701939653,,Not captured,Not captured,Not captured,Not captured,Not captured,Not captured,
Not captured,Not captured,08/15/2019,Not captured,Not captured,863949,020,00072,ARS-02-0052131,Beacon America,Not captured,Not captured,Not captured,,,,Deutsch,Rachel,,01/26/1985,female,Not captured,Not captured,Not captured,Not captured,Not captured,Not captured,Not captured,Not captured,Not captured,Not captured,Not captured,Not captured,Not captured,,,Not captured,Not captured,Not captured,Not captured,4 Coles Lake,,Lakewood,New Jersey,08701,848-299-1973,,Not captured,Not captured,deutsch4547@gmail.com,Not captured,701939652,,Not captured,Not captured,Not captured,Not captured,Not captured,Not captured,
Not captured,Not captured,08/15/2019,Not captured,Not captured,863949,020,00072,ARS-02-0052130,Beacon America,Not captured,Not captured,Not captured,,,,Deutsch,Naftaly,,12/03/1980,male,Not captured,Not captured,Not captured,Not captured,Not captured,Not captured,Not captured,Not captured,Not captured,Not captured,Not captured,Not captured,Not captured,,,Not captured,Not captured,Not captured,Not captured,4 Coles Lake,,Lakewood,New Jersey,08701,848-299-1973,,Not captured,Not captured,deutsch4547@gmail.com,Not captured,701939651,,Not captured,Not captured,Not captured,Not captured,Not captured,Not captured,
Not captured,Not captured,08/15/2019,Not captured,Not captured,863949,020,00072,ARS-02-0052128,Beacon America,Not captured,Not captured,Not captured,,,,PARK,MI JUNG,,03/01/1979,female,Not captured,Not captured,Not captured,Not captured,Not captured,Not captured,Not captured,Not captured,Not captured,Not captured,Not captured,Not captured,Not captured,,,Not captured,Not captured,Not captured,Not captured,160 BOYLSTON ST APT 1219,,Chestnut Hill,Massachusetts,02467,,,Not captured,Not captured,biapark@gmail.com,Not captured,701939649,,Not captured,Not captured,Not captured,Not captured,Not captured,Not captured,
Not captured,Not captured,08/15/2019,Not captured,Not captured,863949,020,00072,ARS-02-0052127,Beacon America,Not captured,Not captured,Not captured,,,,CHOI,SEOWOO,,03/29/2011,female,Not captured,Not captured,Not captured,Not captured,Not captured,Not captured,Not captured,Not captured,Not captured,Not captured,Not captured,Not captured,Not captured,,,Not captured,Not captured,Not captured,Not captured,160 BOYLSTON ST APT 1219,,Chestnut Hill,Massachusetts,02467,,,Not captured,Not captured,biapark@gmail.com,Not captured,701939648,,Not captured,Not captured,Not captured,Not captured,Not captured,Not captured,
Not captured,Not captured,08/15/2019,Not captured,Not captured,863949,020,00072,ARS-01-0052121,Beacon International,Not captured,Not captured,Not captured,,,,Mezerette,David,L,04/12/1976,male,Not captured,Not captured,Not captured,Not captured,Not captured,Not captured,Not captured,Not captured,Not captured,Not captured,Not captured,Not captured,Not captured,,,Not captured,Not captured,Not captured,Not captured,1405 S Cherry Street,,Denver,Colorado,80222,,,Not captured,Not captured,david.mezerette@yahoo.com,Not captured,701939642,,Not captured,Not captured,Not captured,Not captured,Not captured,Not captured,
Not captured,Not captured,08/14/2019,Not captured,Not captured,863949,020,00072,ARS-01-0052119,Beacon International,Not captured,Not captured,Not captured,,,,Ma,Aliza Xiao Qing,,09/07/1986,female,Not captured,Not captured,Not captured,Not captured,Not captured,Not captured,Not captured,Not captured,Not captured,Not captured,Not captured,Not captured,Not captured,,,Not captured,Not captured,Not captured,Not captured,5417 31st Ave,,Woodside,New York,11377,,,Not captured,Not captured,benmccarthy21@gmail.com,Not captured,701939637,,Not captured,Not captured,Not captured,Not captured,Not captured,Not captured,
Not captured,Not captured,08/14/2019,Not captured,Not captured,863949,020,00072,ARS-01-0052118,Beacon International,Not captured,Not captured,Not captured,,,,McCarthy,Benjamin,C,05/03/1993,male,Not captured,Not captured,Not captured,Not captured,Not captured,Not captured,Not captured,Not captured,Not captured,Not captured,Not captured,Not captured,Not captured,,,Not captured,Not captured,Not captured,Not captured,5417 31st Ave,,Woodside,New York,11377,,,Not captured,Not captured,benmccarthy21@gmail.com,Not captured,701939636,,Not captured,Not captured,Not captured,Not captured,Not captured,Not captured,
Not captured,Not captured,08/14/2019,Not captured,Not captured,863949,020,00072,ARS-02-0052115,Beacon America,Not captured,Not captured,Not captured,,,,Gold,Tan,,04/21/1977,female,Not captured,Not captured,Not captured,Not captured,Not captured,Not captured,Not captured,Not captured,Not captured,Not captured,Not captured,Not captured,Not captured,,,Not captured,Not captured,Not captured,Not captured,6 Oakland Street,,Cambridge,Massachusetts,02139,,,Not captured,Not captured,tanya_gold@hotmail.com,Not captured,701939624,,Not captured,Not captured,Not captured,Not captured,Not captured,Not captured,
Not captured,Not captured,08/14/2019,Not captured,Not captured,863949,020,00072,ARS-02-0052114,Beacon America,Not captured,Not captured,Not captured,,,,Cade,Brian,E,10/17/1974,male,Not captured,Not captured,Not captured,Not captured,Not captured,Not captured,Not captured,Not captured,Not captured,Not captured,Not captured,Not captured,Not captured,,,Not captured,Not captured,Not captured,Not captured,6 Oakland Street,,Cambridge,Massachusetts,02139,,,Not captured,Not captured,tanya_gold@hotmail.com,Not captured,701939623,,Not captured,Not captured,Not captured,Not captured,Not captured,Not captured,
Not captured,Not captured,08/14/2019,Not captured,Not captured,863949,020,00072,ARS-02-0052112,Beacon America,Not captured,Not captured,Not captured,Passport(526710487),,,Wallace,Sally,,07/21/1981,female,Not captured,Not captured,Not captured,Not captured,Not captured,Not captured,Not captured,Not captured,Not captured,Not captured,Not captured,Not captured,Not captured,,,Not captured,Not captured,Not captured,Not captured,1 Waterfield Drive.,,Warrington Surrey,England,cr59hpuk,5613924487,,Not captured,Not captured,wallaceoliver@hotmail.com,Not captured,701939621,,Not captured,Not captured,Not captured,Not captured,Not captured,Not captured,
Not captured,Not captured,08/14/2019,Not captured,Not captured,863949,020,00072,ARS-01-0052107,Beacon International,Not captured,Not captured,Not captured,,,,Schwartz,Abigail,,11/20/2007,female,Not captured,Not captured,Not captured,Not captured,Not captured,Not captured,Not captured,Not captured,Not captured,Not captured,Not captured,Not captured,Not captured,,,Not captured,Not captured,Not captured,Not captured,685 River Avenue,,Lakewood,New Jersey,08701,,,Not captured,Not captured,tovak@tendertouch.com,Not captured,701939615,,Not captured,Not captured,Not captured,Not captured,Not captured,Not captured,
Not captured,Not captured,08/14/2019,Not captured,Not captured,863949,020,00072,ARS-01-0052106,Beacon International,Not captured,Not captured,Not captured,,,,Schwartz,Chany,,12/13/1969,female,Not captured,Not captured,Not captured,Not captured,Not captured,Not captured,Not captured,Not captured,Not captured,Not captured,Not captured,Not captured,Not captured,,,Not captured,Not captured,Not captured,Not captured,685 River Avenue,,Lakewood,New Jersey,08701,,,Not captured,Not captured,tovak@tendertouch.com,Not captured,701939614,,Not captured,Not captured,Not captured,Not captured,Not captured,Not captured,
Not captured,Not captured,08/14/2019,Not captured,Not captured,863949,020,00072,ARS-01-0052105,Beacon International,Not captured,Not captured,Not captured,,,,Schwartz,Moses,,09/17/1968,male,Not captured,Not captured,Not captured,Not captured,Not captured,Not captured,Not captured,Not captured,Not captured,Not captured,Not captured,Not captured,Not captured,,,Not captured,Not captured,Not captured,Not captured,685 River Avenue,,Lakewood,New Jersey,08701,,,Not captured,Not captured,tovak@tendertouch.com,Not captured,701939613,,Not captured,Not captured,Not captured,Not captured,Not captured,Not captured,
Not captured,Not captured,08/14/2019,Not captured,Not captured,863949,020,00072,ARS-03-0052094,Essential America,Not captured,Not captured,Not captured,Passport(544155484),,,Wallace,sam,,09/25/2016,male,Not captured,Not captured,Not captured,Not captured,Not captured,Not captured,Not captured,Not captured,Not captured,Not captured,Not captured,Not captured,Not captured,,,Not captured,Not captured,Not captured,Not captured,1 Waterfield Drive.,,Warlingham,England,cr69hp,447931637163,,Not captured,Not captured,wallaceoliver@hotmail.com,Not captured,701939499,,Not captured,Not captured,Not captured,Not captured,Not captured,Not captured,
Not captured,Not captured,08/14/2019,Not captured,Not captured,863949,020,00072,ARS-03-0052068,Essential America,Not captured,Not captured,Not captured,Passport(523158575),,,Wallace,Oliver,,12/31/1980,male,Not captured,Not captured,Not captured,Not captured,Not captured,Not captured,Not captured,Not captured,Not captured,Not captured,Not captured,Not captured,Not captured,,,Not captured,Not captured,Not captured,Not captured,1 Waterfield Dr.,,Warlingham,England,ck69hp,447931637163,,Not captured,Not captured,wallaceoliver@hotmail.com,Not captured,701939456,,Not captured,Not captured,Not captured,Not captured,Not captured,Not captured,
Not captured,Not captured,08/15/2019,Not captured,Not captured,863949,020,00072,ARS-03-0052071,Essential America,Not captured,Not captured,Not captured,Passport(545578461),,,Larson,John ,Peter,04/06/1968,male,Not captured,Not captured,Not captured,Not captured,Not captured,Not captured,Not captured,Not captured,Not captured,Not captured,Not captured,Not captured,Not captured,,,Not captured,Not captured,Not captured,Not captured,Residencial Cocoyoles,,Merida,Yucatan,97000,6123092374,,Not captured,Not captured,john@brighthouseinc.com,Not captured,701939460,,Not captured,Not captured,Not captured,Not captured,Not captured,Not captured,
Not captured,Not captured,08/15/2019,Not captured,Not captured,863949,020,00072,ARS-03-0052071,Essential America,Not captured,Not captured,Not captured,,Passport(545521618),Spouse,Nelson,Nicolle,Renee,12/26/1971,female,Not captured,Not captured,Not captured,Not captured,Not captured,Not captured,Not captured,Not captured,Not captured,Not captured,Not captured,Not captured,Not captured,,,Not captured,Not captured,Not captured,Not captured,Residencial Cocoyoles,,Merida,Yucatan,97000,6123092374,,Not captured,Not captured,john@brighthouseinc.com,Not captured,,701939461,Not captured,Not captured,Not captured,Not captured,Not captured,Not captured,
Not captured,Not captured,08/15/2019,Not captured,Not captured,863949,020,00072,ARS-03-0052071,Essential America,Not captured,Not captured,Not captured,,Passport(549986109),Dependant,Larson,Carolina ,Claudia,11/17/2006,female,Not captured,Not captured,Not captured,Not captured,Not captured,Not captured,Not captured,Not captured,Not captured,Not captured,Not captured,Not captured,Not captured,,,Not captured,Not captured,Not captured,Not captured,Residencial Cocoyoles,,Merida,Yucatan,97000,6123092374,,Not captured,Not captured,john@brighthouseinc.com,Not captured,,701939462,Not captured,Not captured,Not captured,Not captured,Not captured,Not captured,
Not captured,Not captured,08/14/2019,Not captured,Not captured,863949,020,00072,ARS-01-0052104,Beacon International,Not captured,Not captured,Not captured,,,,McCubbin,Conner,,12/02/1993,male,Not captured,Not captured,Not captured,Not captured,Not captured,Not captured,Not captured,Not captured,Not captured,Not captured,Not captured,Not captured,Not captured,,,Not captured,Not captured,Not captured,Not captured,1892 Hillsboro Dr,,Henderson,Nevada,89074,,,Not captured,Not captured,connergmccubbin@gmail.com,Not captured,701939612,,Not captured,Not captured,Not captured,Not captured,Not captured,Not captured,
Not captured,Not captured,08/14/2019,Not captured,Not captured,863949,020,00072,ARS-01-0052103,Beacon International,Not captured,Not captured,Not captured,,,,Wells,Katherine,,07/12/1992,female,Not captured,Not captured,Not captured,Not captured,Not captured,Not captured,Not captured,Not captured,Not captured,Not captured,Not captured,Not captured,Not captured,,,Not captured,Not captured,Not captured,Not captured,1892 Hillsboro Dr,,Henderson,Nevada,89074,,,Not captured,Not captured,connergmccubbin@gmail.com,Not captured,701939611,,Not captured,Not captured,Not captured,Not captured,Not captured,Not captured,
Not captured,Not captured,08/14/2019,Not captured,Not captured,863949,020,00072,ARS-01-0052102,Beacon International,Not captured,Not captured,Not captured,,,,Tadmor,Amitay,,03/14/2001,male,Not captured,Not captured,Not captured,Not captured,Not captured,Not captured,Not captured,Not captured,Not captured,Not captured,Not captured,Not captured,Not captured,,,Not captured,Not captured,Not captured,Not captured,11412 Georgetowne Dr,,Potomac,Maryland,20854,,,Not captured,Not captured,mtadmor@gmail.com,Not captured,701939610,,Not captured,Not captured,Not captured,Not captured,Not captured,Not captured,
Not captured,Not captured,08/14/2019,Not captured,Not captured,863949,020,00072,ARS-01-0052101,Beacon International,Not captured,Not captured,Not captured,,,,Joffe,Erel,,12/19/1977,male,Not captured,Not captured,Not captured,Not captured,Not captured,Not captured,Not captured,Not captured,Not captured,Not captured,Not captured,Not captured,Not captured,,,Not captured,Not captured,Not captured,Not captured,401 E 80 st,,New York,New York,10075,,,Not captured,Not captured,EJOFFE@HOTMAIL.COM,Not captured,701939506,,Not captured,Not captured,Not captured,Not captured,Not captured,Not captured,
Not captured,Not captured,08/15/2019,Not captured,Not captured,863949,020,00072,ARS-01-0052099,Beacon International,Not captured,Not captured,Not captured,Passport(545786977),,,bell,stacy,l,12/16/1983,female,Not captured,Not captured,Not captured,Not captured,Not captured,Not captured,Not captured,Not captured,Not captured,Not captured,Not captured,Not captured,Not captured,,,Not captured,Not captured,Not captured,Not captured,2/26 eversfield place,,hastings,England,tn376by,447445602284,,Not captured,Not captured,stacyleebell66@gmail.com,Not captured,701939504,,Not captured,Not captured,Not captured,Not captured,Not captured,Not captured,
Not captured,Not captured,08/13/2019,Not captured,Not captured,863949,020,00072,ARS-02-0052098,Beacon America,Not captured,Not captured,Not captured,Passport(055240537),,,CSUTAK,ESZTERA,,10/18/1952,female,Not captured,Not captured,Not captured,Not captured,Not captured,Not captured,Not captured,Not captured,Not captured,Not captured,Not captured,Not captured,Not captured,RICHARD DIEHR,HUSBAND,Not captured,Not captured,Not captured,Not captured,94 FORD ROAD,,GERMANTOWN,New York,12526,5185376647,5185376647,Not captured,Not captured,GUARDALL10@AOL.COM,Not captured,701939503,,Not captured,Not captured,Not captured,Not captured,Not captured,Not captured,