EE Transaction Type,Dependent Transaction Type,Effective Date,EE Signature,EE Signature Date,Control,Suffix,Account,Plan Number,Plan Name,Claim Office,Network ID Number,Customer Code,EE SSN,Dependent SSN,Dependent Relationship,Last Name,First Name,Middle Initial,DOB,Gender,Ethnicity,PCP/PCD,PCP/PCD Current Patient,Provider Cap Office Number,COB,Dep Student Indicator,Dep OOA Indicator,EE Prior Coverage Indicator,EE Late Entrant,EE Language Indicator,Hire Date,Earnings,Earnings Frequency,Beneficiary (Last Name First Name MI),Beneficiary Relationship,Continuation of Coverage Expiration Date,Continuation of Coverage Event Date,Continuation of Coverage Length of Coverage,Work Location Zip Code,Street Address Line 1,Street Address Line 2,City,State,Zip Code,Home Phone Number,Work Phone Number,Accept Code,Evidence Code,EE Email Address,Communication Disability Code,EE Alternate ID,Dep Alternate ID,Old Control,Old Suffix,Old Account,New Control,New Suffix,New Account,
Not captured,Not captured,08/13/2019,Not captured,Not captured,863949,020,00072,ARS-02-0052098,Beacon America,Not captured,Not captured,Not captured,Passport(055240537),,,CSUTAK,ESZTERA,,10/18/1952,female,Not captured,Not captured,Not captured,Not captured,Not captured,Not captured,Not captured,Not captured,Not captured,Not captured,Not captured,Not captured,Not captured,RICHARD DIEHR,HUSBAND,Not captured,Not captured,Not captured,Not captured,94 FORD ROAD,,GERMANTOWN,New York,12526,5185376647,5185376647,Not captured,Not captured,GUARDALL10@AOL.COM,Not captured,701939503,,Not captured,Not captured,Not captured,Not captured,Not captured,Not captured,
Not captured,Not captured,08/13/2019,Not captured,Not captured,863949,020,00072,ARS-01-0052097,Beacon International,Not captured,Not captured,Not captured,,,,kazerooni,farnazossadat,,04/15/1990,female,Not captured,Not captured,Not captured,Not captured,Not captured,Not captured,Not captured,Not captured,Not captured,Not captured,Not captured,Not captured,Not captured,reza kazerooni,brother,Not captured,Not captured,Not captured,Not captured,600 Wilcrest Dr,,Houston,Texas,77042,2818789876,,Not captured,Not captured,farnaz_kazerooni@yahoo.com,Not captured,701939502,,Not captured,Not captured,Not captured,Not captured,Not captured,Not captured,
Not captured,Not captured,08/13/2019,Not captured,Not captured,863949,020,00072,ARS-03-0051839,Essential America,Not captured,Not captured,Not captured,Passport(561645625),,,Kwak,Scott,,02/29/1980,male,Not captured,Not captured,Not captured,Not captured,Not captured,Not captured,Not captured,Not captured,Not captured,Not captured,Not captured,Not captured,Not captured,,,Not captured,Not captured,Not captured,Not captured,1244 Murray Ct,,Lebanon,Tennessee,37087,9145008145,,Not captured,Not captured,scottkwak@gmail.com,Not captured,701939131,,Not captured,Not captured,Not captured,Not captured,Not captured,Not captured,
Not captured,Not captured,08/13/2019,Not captured,Not captured,863949,020,00072,ARS-03-0051839,Essential America,Not captured,Not captured,Not captured,,Passport(545883094),Spouse,Eichler,Christina,,12/11/1989,female,Not captured,Not captured,Not captured,Not captured,Not captured,Not captured,Not captured,Not captured,Not captured,Not captured,Not captured,Not captured,Not captured,,,Not captured,Not captured,Not captured,Not captured,1244 Murray Ct,,Lebanon,Tennessee,37087,9145008145,,Not captured,Not captured,scottkwak@gmail.com,Not captured,,701939132,Not captured,Not captured,Not captured,Not captured,Not captured,Not captured,
Not captured,Not captured,08/13/2019,Not captured,Not captured,863949,020,00072,ARS-02-0052092,Beacon America,Not captured,Not captured,Not captured,,,,Rieder,Rachel,,11/04/1982,female,Not captured,Not captured,Not captured,Not captured,Not captured,Not captured,Not captured,Not captured,Not captured,Not captured,Not captured,Not captured,Not captured,,,Not captured,Not captured,Not captured,Not captured,56 Lyncrest Drive,,Monsey,New York,10952,212-430-1726,,Not captured,Not captured,erieder@castlelanterra.com,Not captured,701939497,,Not captured,Not captured,Not captured,Not captured,Not captured,Not captured,
Not captured,Not captured,08/13/2019,Not captured,Not captured,863949,020,00072,ARS-02-0052091,Beacon America,Not captured,Not captured,Not captured,,,,Rieder,Elie,,12/09/1980,male,Not captured,Not captured,Not captured,Not captured,Not captured,Not captured,Not captured,Not captured,Not captured,Not captured,Not captured,Not captured,Not captured,,,Not captured,Not captured,Not captured,Not captured,56 Lyncrest Drive,,Monsey,New York,10952,212-430-1726,,Not captured,Not captured,erieder@castlelanterra.com,Not captured,701939496,,Not captured,Not captured,Not captured,Not captured,Not captured,Not captured,
Not captured,Not captured,08/13/2019,Not captured,Not captured,863949,020,00072,ARS-02-0052090,Beacon America,Not captured,Not captured,Not captured,,,,Rieder,Sara,,08/13/2013,male,Not captured,Not captured,Not captured,Not captured,Not captured,Not captured,Not captured,Not captured,Not captured,Not captured,Not captured,Not captured,Not captured,,,Not captured,Not captured,Not captured,Not captured,56 Lyncrest drive,,Monsey,New York,10952,212-430-1726,,Not captured,Not captured,erieder@castlelanterra.com,Not captured,701939495,,Not captured,Not captured,Not captured,Not captured,Not captured,Not captured,
Not captured,Not captured,08/13/2019,Not captured,Not captured,863949,020,00072,ARS-02-0052089,Beacon America,Not captured,Not captured,Not captured,,,,Rieder,Tom,,10/17/2008,male,Not captured,Not captured,Not captured,Not captured,Not captured,Not captured,Not captured,Not captured,Not captured,Not captured,Not captured,Not captured,Not captured,,,Not captured,Not captured,Not captured,Not captured,56 Lyncrest drive,,Monsey,New York,10952,212-430-1726,,Not captured,Not captured,erieder@castlelanterra.com,Not captured,701939494,,Not captured,Not captured,Not captured,Not captured,Not captured,Not captured,
Not captured,Not captured,08/13/2019,Not captured,Not captured,863949,020,00072,ARS-02-0052088,Beacon America,Not captured,Not captured,Not captured,,,,Rieder,Chaya,,12/02/2005,female,Not captured,Not captured,Not captured,Not captured,Not captured,Not captured,Not captured,Not captured,Not captured,Not captured,Not captured,Not captured,Not captured,,,Not captured,Not captured,Not captured,Not captured,56 Lyncrest drive,,Monsey,New York,10952,212-430-1726,,Not captured,Not captured,erieder@castlelanterra.com,Not captured,701939493,,Not captured,Not captured,Not captured,Not captured,Not captured,Not captured,
Not captured,Not captured,08/13/2019,Not captured,Not captured,863949,020,00072,ARS-01-0052086,Beacon International,Not captured,Not captured,Not captured,,,,Garcia Franzon,Ana,,03/30/1992,female,Not captured,Not captured,Not captured,Not captured,Not captured,Not captured,Not captured,Not captured,Not captured,Not captured,Not captured,Not captured,Not captured,,,Not captured,Not captured,Not captured,Not captured,225 East 36th St,,New York,New York,10016,,,Not captured,Not captured,ana.franzon@hotmail.com,Not captured,701939491,,Not captured,Not captured,Not captured,Not captured,Not captured,Not captured,
Not captured,Not captured,08/13/2019,Not captured,Not captured,863949,020,00072,ARS-01-0052085,Beacon International,Not captured,Not captured,Not captured,,,,Loebenstein,Rochel,S,08/20/2018,female,Not captured,Not captured,Not captured,Not captured,Not captured,Not captured,Not captured,Not captured,Not captured,Not captured,Not captured,Not captured,Not captured,,,Not captured,Not captured,Not captured,Not captured,315 8th St apt 6B,,Lakewood,New Jersey,08701,,,Not captured,Not captured,baylaglustein@gmail.com,Not captured,701939490,,Not captured,Not captured,Not captured,Not captured,Not captured,Not captured,
Not captured,Not captured,08/13/2019,Not captured,Not captured,863949,020,00072,ARS-01-0052084,Beacon International,Not captured,Not captured,Not captured,,,,Loebenstein,Bayla,,09/17/1996,female,Not captured,Not captured,Not captured,Not captured,Not captured,Not captured,Not captured,Not captured,Not captured,Not captured,Not captured,Not captured,Not captured,,,Not captured,Not captured,Not captured,Not captured,315 8th St apt 6B,,Lakewood,New Jersey,08701,,,Not captured,Not captured,baylaglustein@gmail.com,Not captured,701939489,,Not captured,Not captured,Not captured,Not captured,Not captured,Not captured,
Not captured,Not captured,08/13/2019,Not captured,Not captured,863949,020,00072,ARS-01-0052083,Beacon International,Not captured,Not captured,Not captured,,,,Loebenstein,Meir,s,10/13/1993,male,Not captured,Not captured,Not captured,Not captured,Not captured,Not captured,Not captured,Not captured,Not captured,Not captured,Not captured,Not captured,Not captured,,,Not captured,Not captured,Not captured,Not captured,315 8th St apt 6B,,Lakewood,New Jersey,08701,,,Not captured,Not captured,baylaglustein@gmail.com,Not captured,701939488,,Not captured,Not captured,Not captured,Not captured,Not captured,Not captured,
Not captured,Not captured,08/13/2019,Not captured,Not captured,863949,020,00072,ARS-01-0052075,Beacon International,Not captured,Not captured,Not captured,,,,Reese,Veronica,J,01/23/1969,female,Not captured,Not captured,Not captured,Not captured,Not captured,Not captured,Not captured,Not captured,Not captured,Not captured,Not captured,Not captured,Not captured,,,Not captured,Not captured,Not captured,Not captured,3821 Primrose Drive,,Waldorf,Maryland,20602,,,Not captured,Not captured,westies11v@verizon.net,Not captured,701939480,,Not captured,Not captured,Not captured,Not captured,Not captured,Not captured,
Not captured,Not captured,08/13/2019,Not captured,Not captured,863949,020,00072,ARS-03-0051786,Essential America,Not captured,Not captured,Not captured,Passport(556539790),,,Oakes,Ian,,11/19/1970,male,Not captured,Not captured,Not captured,Not captured,Not captured,Not captured,Not captured,Not captured,Not captured,Not captured,Not captured,Not captured,Not captured,,,Not captured,Not captured,Not captured,Not captured,6 Swallow Close Barton Seagrave,,Northants,Northern Ireland,NN15 6PJ,07941170361,,Not captured,Not captured,ian.oakes@orange.fr,Not captured,701939025,,Not captured,Not captured,Not captured,Not captured,Not captured,Not captured,
Not captured,Not captured,08/13/2019,Not captured,Not captured,863949,020,00072,ARS-03-0051786,Essential America,Not captured,Not captured,Not captured,,Passport(556768843),Spouse,Oakes,Helen,,04/17/1971,female,Not captured,Not captured,Not captured,Not captured,Not captured,Not captured,Not captured,Not captured,Not captured,Not captured,Not captured,Not captured,Not captured,,,Not captured,Not captured,Not captured,Not captured,6 Swallow Close Barton Seagrave,,Northants,Northern Ireland,NN15 6PJ,07941170361,,Not captured,Not captured,ian.oakes@orange.fr,Not captured,,701939026,Not captured,Not captured,Not captured,Not captured,Not captured,Not captured,
Not captured,Not captured,08/13/2019,Not captured,Not captured,863949,020,00072,ARS-03-0051786,Essential America,Not captured,Not captured,Not captured,,Passport(525087960),Dependant,Oakes,Jack,,07/22/2000,male,Not captured,Not captured,Not captured,Not captured,Not captured,Not captured,Not captured,Not captured,Not captured,Not captured,Not captured,Not captured,Not captured,,,Not captured,Not captured,Not captured,Not captured,6 Swallow Close Barton Seagrave,,Northants,Northern Ireland,NN15 6PJ,07941170361,,Not captured,Not captured,ian.oakes@orange.fr,Not captured,,701939027,Not captured,Not captured,Not captured,Not captured,Not captured,Not captured,
Not captured,Not captured,08/13/2019,Not captured,Not captured,863949,020,00072,ARS-03-0051786,Essential America,Not captured,Not captured,Not captured,,Passport(561073578),Dependant,Oakes,Harry,,06/04/2003,male,Not captured,Not captured,Not captured,Not captured,Not captured,Not captured,Not captured,Not captured,Not captured,Not captured,Not captured,Not captured,Not captured,,,Not captured,Not captured,Not captured,Not captured,6 Swallow Close Barton Seagrave,,Northants,Northern Ireland,NN15 6PJ,07941170361,,Not captured,Not captured,ian.oakes@orange.fr,Not captured,,701939028,Not captured,Not captured,Not captured,Not captured,Not captured,Not captured,
Not captured,Not captured,08/13/2019,Not captured,Not captured,863949,020,00072,ARS-03-0051786,Essential America,Not captured,Not captured,Not captured,,Passport(561428574),Dependant,Oakes,Thomas,,06/04/2003,male,Not captured,Not captured,Not captured,Not captured,Not captured,Not captured,Not captured,Not captured,Not captured,Not captured,Not captured,Not captured,Not captured,,,Not captured,Not captured,Not captured,Not captured,6 Swallow Close Barton Seagrave,,Northants,Northern Ireland,NN15 6PJ,07941170361,,Not captured,Not captured,ian.oakes@orange.fr,Not captured,,701939029,Not captured,Not captured,Not captured,Not captured,Not captured,Not captured,
Not captured,Not captured,08/13/2019,Not captured,Not captured,863949,020,00072,OVI-28-0052041,OverseasCare Visitors Insurance Plan,Not captured,Not captured,Not captured,Passport(K9170078),,,Avvari,Venkateswar,,05/17/1963,male,Not captured,Not captured,Not captured,Not captured,Not captured,Not captured,Not captured,Not captured,Not captured,Not captured,Not captured,Not captured,Not captured,Ramya Sri Avvari,Daughter,Not captured,Not captured,Not captured,Not captured,2633 steece way,,leander,Texas,78641,2143563903,,Not captured,Not captured,ramya.avvari@gmail.com,Not captured,701939428,,Not captured,Not captured,Not captured,Not captured,Not captured,Not captured,
Not captured,Not captured,08/13/2019,Not captured,Not captured,863949,020,00072,OVI-28-0052017,OverseasCare Visitors Insurance Plan,Not captured,Not captured,Not captured,,,,Alla,Gajendralakshmi,,07/05/1972,female,Not captured,Not captured,Not captured,Not captured,Not captured,Not captured,Not captured,Not captured,Not captured,Not captured,Not captured,Not captured,Not captured,Thanmaiyee Alla,Daughter,Not captured,Not captured,Not captured,Not captured,27 GOLF VIEW DR,,NEWARK,Delaware,19702,3095330329,,Not captured,Not captured,velagapudiraja@gmail.com,Not captured,701939403,,Not captured,Not captured,Not captured,Not captured,Not captured,Not captured,
Not captured,Not captured,08/13/2019,Not captured,Not captured,863949,020,00072,ARS-01-0052002,Beacon International,Not captured,Not captured,Not captured,,,,Mermelstein,Meir Yechiel,,04/29/2003,male,Not captured,Not captured,Not captured,Not captured,Not captured,Not captured,Not captured,Not captured,Not captured,Not captured,Not captured,Not captured,Not captured,,,Not captured,Not captured,Not captured,Not captured,275 Ridge Ave,,Lakewood,New Jersey,08701,347-515-1692,,Not captured,Not captured,merms275@gmail.com,Not captured,701939383,,Not captured,Not captured,Not captured,Not captured,Not captured,Not captured,
Not captured,Not captured,08/13/2019,Not captured,Not captured,863949,020,00072,ARS-01-0051944,Beacon International,Not captured,Not captured,Not captured,,,,Nussbaum,Leah,,04/20/2002,female,Not captured,Not captured,Not captured,Not captured,Not captured,Not captured,Not captured,Not captured,Not captured,Not captured,Not captured,Not captured,Not captured,,,Not captured,Not captured,Not captured,Not captured,112 Hadassah Lane,,Lakewood,New Jersey,08701,732-245-2264,,Not captured,Not captured,devorah@yeshivanet.com,Not captured,701939301,,Not captured,Not captured,Not captured,Not captured,Not captured,Not captured,
Not captured,Not captured,08/13/2019,Not captured,Not captured,863949,020,00072,ARS-01-0051920,Beacon International,Not captured,Not captured,Not captured,,,,Katz,Schmuel,,04/23/2001,male,Not captured,Not captured,Not captured,Not captured,Not captured,Not captured,Not captured,Not captured,Not captured,Not captured,Not captured,Not captured,Not captured,,,Not captured,Not captured,Not captured,Not captured,141 Thorndike Ave,,Lakewood,New Jersey,08701,908-670-4686,,Not captured,Not captured,ckchayakatz@gmail.com,Not captured,701939271,,Not captured,Not captured,Not captured,Not captured,Not captured,Not captured,
Not captured,Not captured,08/13/2019,Not captured,Not captured,863949,020,00072,ARS-01-0051919,Beacon International,Not captured,Not captured,Not captured,,,,Katz,Tehila,,10/06/2007,female,Not captured,Not captured,Not captured,Not captured,Not captured,Not captured,Not captured,Not captured,Not captured,Not captured,Not captured,Not captured,Not captured,,,Not captured,Not captured,Not captured,Not captured,141 Thorndike Ave,,Lakewood,New Jersey,08701,908-670-4686,,Not captured,Not captured,ckchayakatz@gmail.com,Not captured,701939270,,Not captured,Not captured,Not captured,Not captured,Not captured,Not captured,
Not captured,Not captured,08/13/2019,Not captured,Not captured,863949,020,00072,ARS-01-0051918,Beacon International,Not captured,Not captured,Not captured,,,,Katz,Cherie,,06/10/1979,female,Not captured,Not captured,Not captured,Not captured,Not captured,Not captured,Not captured,Not captured,Not captured,Not captured,Not captured,Not captured,Not captured,,,Not captured,Not captured,Not captured,Not captured,141 Thorndike Ave,,Lakewood,New Jersey,08701,908-670-4686,,Not captured,Not captured,ckchayakatz@gmail.com,Not captured,701939269,,Not captured,Not captured,Not captured,Not captured,Not captured,Not captured,
Not captured,Not captured,08/13/2019,Not captured,Not captured,863949,020,00072,ARS-01-0051917,Beacon International,Not captured,Not captured,Not captured,,,,katz,Aron,,06/22/1977,male,Not captured,Not captured,Not captured,Not captured,Not captured,Not captured,Not captured,Not captured,Not captured,Not captured,Not captured,Not captured,Not captured,,,Not captured,Not captured,Not captured,Not captured,141 Thorndike Ave,,Lakewood,New Jersey,08701,908-670-4686,,Not captured,Not captured,ckchayakatz@gmail.com,Not captured,701939268,,Not captured,Not captured,Not captured,Not captured,Not captured,Not captured,
Not captured,Not captured,08/13/2019,Not captured,Not captured,863949,020,00072,ARS-01-0051853,Beacon International,Not captured,Not captured,Not captured,,,,Friedman,Joshua C,,06/16/2014,female,Not captured,Not captured,Not captured,Not captured,Not captured,Not captured,Not captured,Not captured,Not captured,Not captured,Not captured,Not captured,Not captured,,,Not captured,Not captured,Not captured,Not captured,160 Pine Circle Dr,,Lakewood,New Jersey,08701,848-223-8158,,Not captured,Not captured,Miriamfriedman160@gmail.com,Not captured,701939146,,Not captured,Not captured,Not captured,Not captured,Not captured,Not captured,
Not captured,Not captured,08/13/2019,Not captured,Not captured,863949,020,00072,ARS-01-0051852,Beacon International,Not captured,Not captured,Not captured,,,,Friedman,Kayla,,08/28/2012,female,Not captured,Not captured,Not captured,Not captured,Not captured,Not captured,Not captured,Not captured,Not captured,Not captured,Not captured,Not captured,Not captured,,,Not captured,Not captured,Not captured,Not captured,160 Pine Circle Dr,,Lakewood,New Jersey,08701,848-223-8158,,Not captured,Not captured,Miriamfriedman160@gmail.com,Not captured,701939145,,Not captured,Not captured,Not captured,Not captured,Not captured,Not captured,
Not captured,Not captured,08/13/2019,Not captured,Not captured,863949,020,00072,ARS-01-0051851,Beacon International,Not captured,Not captured,Not captured,,,,Friedman,Raquel,,01/12/2010,female,Not captured,Not captured,Not captured,Not captured,Not captured,Not captured,Not captured,Not captured,Not captured,Not captured,Not captured,Not captured,Not captured,,,Not captured,Not captured,Not captured,Not captured,160 Pine Circle Dr,,Lakewood,New Jersey,08701,848-223-8158,,Not captured,Not captured,Miriamfriedman160@gmail.com,Not captured,701939144,,Not captured,Not captured,Not captured,Not captured,Not captured,Not captured,
Not captured,Not captured,08/13/2019,Not captured,Not captured,863949,020,00072,ARS-01-0051850,Beacon International,Not captured,Not captured,Not captured,,,,Friedman,Charles J,,01/27/2006,male,Not captured,Not captured,Not captured,Not captured,Not captured,Not captured,Not captured,Not captured,Not captured,Not captured,Not captured,Not captured,Not captured,,,Not captured,Not captured,Not captured,Not captured,160 Pine Circle Dr,,Lakewood,New Jersey,08701,848-223-8158,,Not captured,Not captured,Miriamfriedman160@gmail.com,Not captured,701939143,,Not captured,Not captured,Not captured,Not captured,Not captured,Not captured,
Not captured,Not captured,08/13/2019,Not captured,Not captured,863949,020,00072,ARS-01-0051849,Beacon International,Not captured,Not captured,Not captured,,,,Friedman,Boruch,,03/11/2002,male,Not captured,Not captured,Not captured,Not captured,Not captured,Not captured,Not captured,Not captured,Not captured,Not captured,Not captured,Not captured,Not captured,,,Not captured,Not captured,Not captured,Not captured,160 Pine Circle Dr,,Lakewood,New Jersey,08701,848-223-8158,,Not captured,Not captured,Miriamfriedman160@gmail.com,Not captured,701939142,,Not captured,Not captured,Not captured,Not captured,Not captured,Not captured,
Not captured,Not captured,08/13/2019,Not captured,Not captured,863949,020,00072,ARS-01-0051848,Beacon International,Not captured,Not captured,Not captured,,,,Friedman,Faigy,,06/16/1999,female,Not captured,Not captured,Not captured,Not captured,Not captured,Not captured,Not captured,Not captured,Not captured,Not captured,Not captured,Not captured,Not captured,,,Not captured,Not captured,Not captured,Not captured,160 Pine Circle Dr,,Lakewood,New Jersey,08701,848-223-8158,,Not captured,Not captured,Miriamfriedman160@gmail.com,Not captured,701939141,,Not captured,Not captured,Not captured,Not captured,Not captured,Not captured,
Not captured,Not captured,08/13/2019,Not captured,Not captured,863949,020,00072,ARS-01-0051847,Beacon International,Not captured,Not captured,Not captured,,,,Friedman,Mark,,07/26/1996,male,Not captured,Not captured,Not captured,Not captured,Not captured,Not captured,Not captured,Not captured,Not captured,Not captured,Not captured,Not captured,Not captured,,,Not captured,Not captured,Not captured,Not captured,160 Pine Circle Dr,,Lakewood,New Jersey,08701,848-223-8158,,Not captured,Not captured,Miriamfriedman160@gmail.com,Not captured,701939140,,Not captured,Not captured,Not captured,Not captured,Not captured,Not captured,
Not captured,Not captured,08/13/2019,Not captured,Not captured,863949,020,00072,ARS-01-0051846,Beacon International,Not captured,Not captured,Not captured,,,,Friedman,Miriam,,07/08/1973,female,Not captured,Not captured,Not captured,Not captured,Not captured,Not captured,Not captured,Not captured,Not captured,Not captured,Not captured,Not captured,Not captured,,,Not captured,Not captured,Not captured,Not captured,160 Pine Circle Dr,,Lakewood,New Jersey,08701,848-223-8158,,Not captured,Not captured,Miriamfriedman160@gmail.com,Not captured,701939139,,Not captured,Not captured,Not captured,Not captured,Not captured,Not captured,
Not captured,Not captured,08/13/2019,Not captured,Not captured,863949,020,00072,ARS-01-0051845,Beacon International,Not captured,Not captured,Not captured,,,,Friedman,Jacob,,10/06/1970,male,Not captured,Not captured,Not captured,Not captured,Not captured,Not captured,Not captured,Not captured,Not captured,Not captured,Not captured,Not captured,Not captured,,,Not captured,Not captured,Not captured,Not captured,160 Pine Circle Dr,,Lakewood,New Jersey,08701,848-223-8158,,Not captured,Not captured,Miriamfriedman160@gmail.com,Not captured,701939138,,Not captured,Not captured,Not captured,Not captured,Not captured,Not captured,