EE Transaction Type,Dependent Transaction Type,Effective Date,EE Signature,EE Signature Date,Control,Suffix,Account,Plan Number,Plan Name,Claim Office,Network ID Number,Customer Code,EE SSN,Dependent SSN,Dependent Relationship,Last Name,First Name,Middle Initial,DOB,Gender,Ethnicity,PCP/PCD,PCP/PCD Current Patient,Provider Cap Office Number,COB,Dep Student Indicator,Dep OOA Indicator,EE Prior Coverage Indicator,EE Late Entrant,EE Language Indicator,Hire Date,Earnings,Earnings Frequency,Beneficiary (Last Name First Name MI),Beneficiary Relationship,Continuation of Coverage Expiration Date,Continuation of Coverage Event Date,Continuation of Coverage Length of Coverage,Work Location Zip Code,Street Address Line 1,Street Address Line 2,City,State,Zip Code,Home Phone Number,Work Phone Number,Accept Code,Evidence Code,EE Email Address,Communication Disability Code,EE Alternate ID,Dep Alternate ID,Old Control,Old Suffix,Old Account,New Control,New Suffix,New Account,
Not captured,Not captured,08/12/2019,Not captured,Not captured,863949,020,00072,ARS-01-0052069,Beacon International,Not captured,Not captured,Not captured,,,,Maamaatuaiahutapu,Turaga,M,02/19/2002,male,Not captured,Not captured,Not captured,Not captured,Not captured,Not captured,Not captured,Not captured,Not captured,Not captured,Not captured,Not captured,Not captured,,,Not captured,Not captured,Not captured,Not captured,67 Station Road North,,Newcastle -upon-Tyne,,NE12 7AS,,,Not captured,Not captured,stig2723@gmail.com,Not captured,701939457,,Not captured,Not captured,Not captured,Not captured,Not captured,Not captured,
Not captured,Not captured,08/12/2019,Not captured,Not captured,863949,020,00072,ARS-01-0052067,Beacon International,Not captured,Not captured,Not captured,,,,Gombo,Moshe,,08/13/1970,male,Not captured,Not captured,Not captured,Not captured,Not captured,Not captured,Not captured,Not captured,Not captured,Not captured,Not captured,Not captured,Not captured,,,Not captured,Not captured,Not captured,Not captured,Harav landau 1,,Bnei brak,,5155018,,,Not captured,Not captured,moshegombo@gmail.com,Not captured,701939455,,Not captured,Not captured,Not captured,Not captured,Not captured,Not captured,
Not captured,Not captured,08/12/2019,Not captured,Not captured,863949,020,00072,ARS-01-0052066,Beacon International,Not captured,Not captured,Not captured,,,,Vallach,David,,03/30/2000,male,Not captured,Not captured,Not captured,Not captured,Not captured,Not captured,Not captured,Not captured,Not captured,Not captured,Not captured,Not captured,Not captured,,,Not captured,Not captured,Not captured,Not captured,Harav landau 1,,Bnei brak,,5155018,,,Not captured,Not captured,moshegombo@gmail.com,Not captured,701939454,,Not captured,Not captured,Not captured,Not captured,Not captured,Not captured,
Not captured,Not captured,08/12/2019,Not captured,Not captured,863949,020,00072,ARS-01-0052065,Beacon International,Not captured,Not captured,Not captured,,,,Meisels,Elazer,L,04/21/1999,male,Not captured,Not captured,Not captured,Not captured,Not captured,Not captured,Not captured,Not captured,Not captured,Not captured,Not captured,Not captured,Not captured,,,Not captured,Not captured,Not captured,Not captured,Harav landau 1,,Bnei brak,,5155018,,,Not captured,Not captured,moshegombo@gmail.com,Not captured,701939453,,Not captured,Not captured,Not captured,Not captured,Not captured,Not captured,
Not captured,Not captured,08/12/2019,Not captured,Not captured,863949,020,00072,ARS-01-0052064,Beacon International,Not captured,Not captured,Not captured,,,,Rubinstein,Jacob,,09/03/1999,male,Not captured,Not captured,Not captured,Not captured,Not captured,Not captured,Not captured,Not captured,Not captured,Not captured,Not captured,Not captured,Not captured,,,Not captured,Not captured,Not captured,Not captured,Harav landau 1,,Bnei brak,,5155018,,,Not captured,Not captured,moshegombo@gmail.com,Not captured,701939452,,Not captured,Not captured,Not captured,Not captured,Not captured,Not captured,
Not captured,Not captured,08/12/2019,Not captured,Not captured,863949,020,00072,ARS-01-0052063,Beacon International,Not captured,Not captured,Not captured,,,,Hoffman,Leiby,,05/15/1999,male,Not captured,Not captured,Not captured,Not captured,Not captured,Not captured,Not captured,Not captured,Not captured,Not captured,Not captured,Not captured,Not captured,,,Not captured,Not captured,Not captured,Not captured,Harav landau 1,,Bnei brak,,5155018,,,Not captured,Not captured,moshegombo@gmail.com,Not captured,701939451,,Not captured,Not captured,Not captured,Not captured,Not captured,Not captured,
Not captured,Not captured,08/12/2019,Not captured,Not captured,863949,020,00072,ARS-02-0052062,Beacon America,Not captured,Not captured,Not captured,,,,Hershkovits,Chaim,,07/30/2014,male,Not captured,Not captured,Not captured,Not captured,Not captured,Not captured,Not captured,Not captured,Not captured,Not captured,Not captured,Not captured,Not captured,,,Not captured,Not captured,Not captured,Not captured,1432 52nd Street,,Brooklyn,New York,11219,718-972-9425,,Not captured,Not captured,chanamindy@aol.com,Not captured,701939450,,Not captured,Not captured,Not captured,Not captured,Not captured,Not captured,
Not captured,Not captured,08/12/2019,Not captured,Not captured,863949,020,00072,ARS-02-0052061,Beacon America,Not captured,Not captured,Not captured,,,,Hershkovits,Yehuda,,02/22/2011,male,Not captured,Not captured,Not captured,Not captured,Not captured,Not captured,Not captured,Not captured,Not captured,Not captured,Not captured,Not captured,Not captured,,,Not captured,Not captured,Not captured,Not captured,1432 52nd Street,,Brooklyn,New York,11219,718-972-9425,,Not captured,Not captured,chanamindy@aol.com,Not captured,701939449,,Not captured,Not captured,Not captured,Not captured,Not captured,Not captured,
Not captured,Not captured,08/12/2019,Not captured,Not captured,863949,020,00072,ARS-02-0052060,Beacon America,Not captured,Not captured,Not captured,,,,Hershkovits,Roizy,,05/06/2009,female,Not captured,Not captured,Not captured,Not captured,Not captured,Not captured,Not captured,Not captured,Not captured,Not captured,Not captured,Not captured,Not captured,,,Not captured,Not captured,Not captured,Not captured,1432 52nd Street,,Brooklyn,New York,11219,718-972-9425,,Not captured,Not captured,chanamindy@aol.com,Not captured,701939448,,Not captured,Not captured,Not captured,Not captured,Not captured,Not captured,
Not captured,Not captured,08/12/2019,Not captured,Not captured,863949,020,00072,ARS-02-0052059,Beacon America,Not captured,Not captured,Not captured,,,,Hershkovits,Goldy,,05/02/2007,female,Not captured,Not captured,Not captured,Not captured,Not captured,Not captured,Not captured,Not captured,Not captured,Not captured,Not captured,Not captured,Not captured,,,Not captured,Not captured,Not captured,Not captured,1432 52nd Street,,Brooklyn,New York,11219,718-972-9425,,Not captured,Not captured,chanamindy@aol.com,Not captured,701939447,,Not captured,Not captured,Not captured,Not captured,Not captured,Not captured,
Not captured,Not captured,08/12/2019,Not captured,Not captured,863949,020,00072,ARS-02-0052058,Beacon America,Not captured,Not captured,Not captured,,,,Hershkovits,Chana M,,11/29/1973,female,Not captured,Not captured,Not captured,Not captured,Not captured,Not captured,Not captured,Not captured,Not captured,Not captured,Not captured,Not captured,Not captured,,,Not captured,Not captured,Not captured,Not captured,1432 52nd Street,,Brooklyn,New York,11219,718-972-9425,,Not captured,Not captured,chanamindy@aol.com,Not captured,701939446,,Not captured,Not captured,Not captured,Not captured,Not captured,Not captured,
Not captured,Not captured,08/12/2019,Not captured,Not captured,863949,020,00072,ARS-02-0052057,Beacon America,Not captured,Not captured,Not captured,,,,Hershkovits,Joseph D,,12/16/1972,male,Not captured,Not captured,Not captured,Not captured,Not captured,Not captured,Not captured,Not captured,Not captured,Not captured,Not captured,Not captured,Not captured,,,Not captured,Not captured,Not captured,Not captured,1432 52nd Street,,Brooklyn,New York,11219,718-972-9425,,Not captured,Not captured,chanamindy@aol.com,Not captured,701939445,,Not captured,Not captured,Not captured,Not captured,Not captured,Not captured,
Not captured,Not captured,08/12/2019,Not captured,Not captured,863949,020,00072,ARS-01-0052052,Beacon International,Not captured,Not captured,Not captured,,,,Friedman,Schmuel,,10/15/2005,male,Not captured,Not captured,Not captured,Not captured,Not captured,Not captured,Not captured,Not captured,Not captured,Not captured,Not captured,Not captured,Not captured,,,Not captured,Not captured,Not captured,Not captured,158 Chateau Drive,,Lakewood,New Jersey,08701,732-364-6832,,Not captured,Not captured,shaya@primeins.com,Not captured,701939439,,Not captured,Not captured,Not captured,Not captured,Not captured,Not captured,
Not captured,Not captured,08/12/2019,Not captured,Not captured,863949,020,00072,ARS-01-0052051,Beacon International,Not captured,Not captured,Not captured,,,,Friedman,Chaim,,02/04/1981,male,Not captured,Not captured,Not captured,Not captured,Not captured,Not captured,Not captured,Not captured,Not captured,Not captured,Not captured,Not captured,Not captured,,,Not captured,Not captured,Not captured,Not captured,158 Chateau Drive,,Lakewood,New Jersey,08701,732-364-6832,,Not captured,Not captured,shaya@primeins.com,Not captured,701939438,,Not captured,Not captured,Not captured,Not captured,Not captured,Not captured,
Not captured,Not captured,08/12/2019,Not captured,Not captured,863949,020,00072,ARS-01-0052049,Beacon International,Not captured,Not captured,Not captured,,,,Stender,Rivka,,01/22/2002,female,Not captured,Not captured,Not captured,Not captured,Not captured,Not captured,Not captured,Not captured,Not captured,Not captured,Not captured,Not captured,Not captured,,,Not captured,Not captured,Not captured,Not captured,966 e 28 street,,Brooklyn,New York,11210,,,Not captured,Not captured,csstender@verizon.net,Not captured,701939436,,Not captured,Not captured,Not captured,Not captured,Not captured,Not captured,
Not captured,Not captured,08/12/2019,Not captured,Not captured,863949,020,00072,ARS-01-0052048,Beacon International,Not captured,Not captured,Not captured,,,,Stender,Michael,,03/16/2000,male,Not captured,Not captured,Not captured,Not captured,Not captured,Not captured,Not captured,Not captured,Not captured,Not captured,Not captured,Not captured,Not captured,,,Not captured,Not captured,Not captured,Not captured,966 e 28 street,,Brooklyn,New York,11210,,,Not captured,Not captured,csstender@verizon.net,Not captured,701939435,,Not captured,Not captured,Not captured,Not captured,Not captured,Not captured,
Not captured,Not captured,08/12/2019,Not captured,Not captured,863949,020,00072,ARS-01-0052047,Beacon International,Not captured,Not captured,Not captured,,,,Stender,Howard,,09/23/1961,male,Not captured,Not captured,Not captured,Not captured,Not captured,Not captured,Not captured,Not captured,Not captured,Not captured,Not captured,Not captured,Not captured,,,Not captured,Not captured,Not captured,Not captured,966 e 28 street,,Brooklyn,New York,11210,,,Not captured,Not captured,csstender@verizon.net,Not captured,701939434,,Not captured,Not captured,Not captured,Not captured,Not captured,Not captured,
Not captured,Not captured,08/12/2019,Not captured,Not captured,863949,020,00072,ARS-01-0052044,Beacon International,Not captured,Not captured,Not captured,,,,David,Ian,,08/17/1988,male,Not captured,Not captured,Not captured,Not captured,Not captured,Not captured,Not captured,Not captured,Not captured,Not captured,Not captured,Not captured,Not captured,,,Not captured,Not captured,Not captured,Not captured,28-07 Ditmars Boulevard,,Astoria,New York,11105,,,Not captured,Not captured,ian.dimitri.david@gmail.com,Not captured,701939431,,Not captured,Not captured,Not captured,Not captured,Not captured,Not captured,
Not captured,Not captured,08/12/2019,Not captured,Not captured,863949,020,00072,ARS-02-0052043,Beacon America,Not captured,Not captured,Not captured,,,,Hoang,Sanh,T,05/08/1936,female,Not captured,Not captured,Not captured,Not captured,Not captured,Not captured,Not captured,Not captured,Not captured,Not captured,Not captured,Not captured,Not captured,,,Not captured,Not captured,Not captured,Not captured,5211 Danielle Dr,,Burlington,Ontario,L7L 7L1,,,Not captured,Not captured,hydoiqic@yahoo.com,Not captured,701939430,,Not captured,Not captured,Not captured,Not captured,Not captured,Not captured,
Not captured,Not captured,08/12/2019,Not captured,Not captured,863949,020,00072,ARS-02-0052042,Beacon America,Not captured,Not captured,Not captured,Passport(108462456),,,GONZALEZ,IRAIZA VESTALIA,,05/28/1940,female,Not captured,Not captured,Not captured,Not captured,Not captured,Not captured,Not captured,Not captured,Not captured,Not captured,Not captured,Not captured,Not captured,MARIA HORTENCIA SANCHEZ GONZALEZ,HIJA,Not captured,Not captured,Not captured,Not captured,URB.LOS SAMANES CASA #26 SAN CRISTOBAL TACHIRA VENEZUELA,,SAN CRISTOBAL,Tachira,0000,584141779051,,Not captured,Not captured,MARIHORTS@GMAIL.COM,Not captured,701939429,,Not captured,Not captured,Not captured,Not captured,Not captured,Not captured,
Not captured,Not captured,08/10/2019,Not captured,Not captured,863949,020,00072,OVI-28-0052034,OverseasCare Visitors Insurance Plan,Not captured,Not captured,Not captured,,,,Rayudu,Nanditha,,01/20/2001,female,Not captured,Not captured,Not captured,Not captured,Not captured,Not captured,Not captured,Not captured,Not captured,Not captured,Not captured,Not captured,Not captured,Harshavardhan Rayudu,Son,Not captured,Not captured,Not captured,Not captured,22294 Lonsdale Dr,,Ashburn,Virginia,20148,7035797949,,Not captured,Not captured,ckancherla@yahoo.com,Not captured,701939420,,Not captured,Not captured,Not captured,Not captured,Not captured,Not captured,
Not captured,Not captured,08/10/2019,Not captured,Not captured,863949,020,00072,OVI-28-0052033,OverseasCare Visitors Insurance Plan,Not captured,Not captured,Not captured,,,,Rayudu,Sangeetha,,06/25/1972,female,Not captured,Not captured,Not captured,Not captured,Not captured,Not captured,Not captured,Not captured,Not captured,Not captured,Not captured,Not captured,Not captured,Harshavardhan Rayudu,Son,Not captured,Not captured,Not captured,Not captured,22294 Lonsdale Dr,,Ashburn,Virginia,20148,7035797949,,Not captured,Not captured,ckancherla@yahoo.com,Not captured,701939419,,Not captured,Not captured,Not captured,Not captured,Not captured,Not captured,
Not captured,Not captured,08/10/2019,Not captured,Not captured,863949,020,00072,OVI-28-0052032,OverseasCare Visitors Insurance Plan,Not captured,Not captured,Not captured,,,,Rayudu,Srinivas ,,05/10/1971,male,Not captured,Not captured,Not captured,Not captured,Not captured,Not captured,Not captured,Not captured,Not captured,Not captured,Not captured,Not captured,Not captured,Harshavardhan Rayudu,Son,Not captured,Not captured,Not captured,Not captured,22294 Lonsdale Dr,,Ashburn,Virginia,20148,7035797949,,Not captured,Not captured,ckancherla@yahoo.com,Not captured,701939418,,Not captured,Not captured,Not captured,Not captured,Not captured,Not captured,
Not captured,Not captured,08/10/2019,Not captured,Not captured,863949,020,00072,ARS-02-0052031,Beacon America,Not captured,Not captured,Not captured,Passport(P1940804),,,Bhalla,Rajni,,11/20/1959,female,Not captured,Not captured,Not captured,Not captured,Not captured,Not captured,Not captured,Not captured,Not captured,Not captured,Not captured,Not captured,Not captured,Gaurav Bhalla,Son,Not captured,Not captured,Not captured,Not captured,1938 Saint Clair St,,Port Huron,Michigan,48060,313-899-8469,,Not captured,Not captured,gauravbhalla85@gmail.com,Not captured,701939417,,Not captured,Not captured,Not captured,Not captured,Not captured,Not captured,
Not captured,Not captured,08/10/2019,Not captured,Not captured,863949,020,00072,ARS-01-0052030,Beacon International,Not captured,Not captured,Not captured,,,,Chan,Kwun wah,B,04/26/1974,male,Not captured,Not captured,Not captured,Not captured,Not captured,Not captured,Not captured,Not captured,Not captured,Not captured,Not captured,Not captured,Not captured,,,Not captured,Not captured,Not captured,Not captured,21102 Woodglen Ct,,Walnut,California,91789,,,Not captured,Not captured,winnie415@hotmail.com,Not captured,701939416,,Not captured,Not captured,Not captured,Not captured,Not captured,Not captured,
Not captured,Not captured,08/10/2019,Not captured,Not captured,863949,020,00072,ARS-01-0052029,Beacon International,Not captured,Not captured,Not captured,,,,fung,Rowina,w,04/15/1980,female,Not captured,Not captured,Not captured,Not captured,Not captured,Not captured,Not captured,Not captured,Not captured,Not captured,Not captured,Not captured,Not captured,,,Not captured,Not captured,Not captured,Not captured,21102 Woodglen Ct,,Walnut,California,91789,,,Not captured,Not captured,winnie415@hotmail.com,Not captured,701939415,,Not captured,Not captured,Not captured,Not captured,Not captured,Not captured,
Not captured,Not captured,08/10/2019,Not captured,Not captured,863949,020,00072,ARS-01-0052028,Beacon International,Not captured,Not captured,Not captured,,,,chan,Avery,Y,04/11/2015,male,Not captured,Not captured,Not captured,Not captured,Not captured,Not captured,Not captured,Not captured,Not captured,Not captured,Not captured,Not captured,Not captured,,,Not captured,Not captured,Not captured,Not captured,21102 Woodglen Ct,,Walnut,California,91789,,,Not captured,Not captured,winnie415@hotmail.com,Not captured,701939414,,Not captured,Not captured,Not captured,Not captured,Not captured,Not captured,
Not captured,Not captured,08/10/2019,Not captured,Not captured,863949,020,00072,ARS-01-0052026,Beacon International,Not captured,Not captured,Not captured,,,,Gouge,Gary,L,12/26/1957,male,Not captured,Not captured,Not captured,Not captured,Not captured,Not captured,Not captured,Not captured,Not captured,Not captured,Not captured,Not captured,Not captured,,,Not captured,Not captured,Not captured,Not captured,447 Silver Creek Dr,,Duncanville,Texas,75137-4577,,,Not captured,Not captured,gary.gouge@gmail.com,Not captured,701939412,,Not captured,Not captured,Not captured,Not captured,Not captured,Not captured,
Not captured,Not captured,08/09/2019,Not captured,Not captured,863949,020,00072,ARS-01-0052025,Beacon International,Not captured,Not captured,Not captured,,,,Kenyon,Daniel,A,07/28/1988,male,Not captured,Not captured,Not captured,Not captured,Not captured,Not captured,Not captured,Not captured,Not captured,Not captured,Not captured,Not captured,Not captured,,,Not captured,Not captured,Not captured,Not captured,138 overlook dr,,Greenville,New Hampshire,03048,,,Not captured,Not captured,kenyoncarpentry@comcast.net,Not captured,701939411,,Not captured,Not captured,Not captured,Not captured,Not captured,Not captured,
Not captured,Not captured,08/09/2019,Not captured,Not captured,863949,020,00072,ARS-01-0052024,Beacon International,Not captured,Not captured,Not captured,,,,Codyer,Thomas,,10/20/1988,male,Not captured,Not captured,Not captured,Not captured,Not captured,Not captured,Not captured,Not captured,Not captured,Not captured,Not captured,Not captured,Not captured,,,Not captured,Not captured,Not captured,Not captured,122 Townsend St,,Pepperell,Massachusetts,01463,,,Not captured,Not captured,thomascodyer@gmail.com,Not captured,701939410,,Not captured,Not captured,Not captured,Not captured,Not captured,Not captured,
Not captured,Not captured,08/10/2019,Not captured,Not captured,863949,020,00072,OVI-28-0052023,OverseasCare Visitors Insurance Plan,Not captured,Not captured,Not captured,,,,Barquin,Victoria,P,09/30/1954,female,Not captured,Not captured,Not captured,Not captured,Not captured,Not captured,Not captured,Not captured,Not captured,Not captured,Not captured,Not captured,Not captured,Joarhne Cata-ag,Daughter,Not captured,Not captured,Not captured,Not captured,1665 Randolph Pl #2,,Memphis,Tennessee,38120,9015178211,,Not captured,Not captured,enhraoj20@yahoo.com,Not captured,701939409,,Not captured,Not captured,Not captured,Not captured,Not captured,Not captured,
Not captured,Not captured,08/09/2019,Not captured,Not captured,863949,020,00072,ARS-02-0052022,Beacon America,Not captured,Not captured,Not captured,,,,Hamel,Cassandre,,04/27/2002,female,Not captured,Not captured,Not captured,Not captured,Not captured,Not captured,Not captured,Not captured,Not captured,Not captured,Not captured,Not captured,Not captured,,,Not captured,Not captured,Not captured,Not captured,524 Dovecote ln Unit 4,,Livermore,California,94551,,,Not captured,Not captured,sylvie_bis@hotmail.com,Not captured,701939408,,Not captured,Not captured,Not captured,Not captured,Not captured,Not captured,
Not captured,Not captured,08/11/2019,Not captured,Not captured,863949,020,00072,ARS-01-0052021,Beacon International,Not captured,Not captured,Not captured,Passport(C01292142),,,Miranda Boville,Maria Luisa,,09/14/1963,female,Not captured,Not captured,Not captured,Not captured,Not captured,Not captured,Not captured,Not captured,Not captured,Not captured,Not captured,Not captured,Not captured,,,Not captured,Not captured,Not captured,Not captured,2425 Wilson Blvd,,Arlington,Virginia,22201,7038415641,,Not captured,Not captured,pamruthkumar@ncsc.org,Not captured,701939407,,Not captured,Not captured,Not captured,Not captured,Not captured,Not captured,
Not captured,Not captured,08/11/2019,Not captured,Not captured,863949,020,00072,ARS-01-0052020,Beacon International,Not captured,Not captured,Not captured,Passport(C01467009),,,Valenzuela Averruz,Tanya Walkyria,,10/19/1977,female,Not captured,Not captured,Not captured,Not captured,Not captured,Not captured,Not captured,Not captured,Not captured,Not captured,Not captured,Not captured,Not captured,,,Not captured,Not captured,Not captured,Not captured,2425 Wilson Blvd,,Arlington,Virginia,22201,7038415641,,Not captured,Not captured,pamruthkumar@ncsc.org,Not captured,701939406,,Not captured,Not captured,Not captured,Not captured,Not captured,Not captured,
Not captured,Not captured,08/11/2019,Not captured,Not captured,863949,020,00072,ARS-01-0052019,Beacon International,Not captured,Not captured,Not captured,Passport(YC136544),,,Rodrigues,Renata Maria,,07/25/1962,female,Not captured,Not captured,Not captured,Not captured,Not captured,Not captured,Not captured,Not captured,Not captured,Not captured,Not captured,Not captured,Not captured,,,Not captured,Not captured,Not captured,Not captured,2425 Wilson Blvd,,Arlington,Virginia,22201,7038415641,,Not captured,Not captured,pamruthkumar@ncsc.org,Not captured,701939405,,Not captured,Not captured,Not captured,Not captured,Not captured,Not captured,
Not captured,Not captured,08/10/2019,Not captured,Not captured,863949,020,00072,ARS-03-0052008,Essential America,Not captured,Not captured,Not captured,Passport(473363472),,,Humphreys,David,Roger,12/07/1960,male,Not captured,Not captured,Not captured,Not captured,Not captured,Not captured,Not captured,Not captured,Not captured,Not captured,Not captured,Not captured,Not captured,,,Not captured,Not captured,Not captured,Not captured,784 Old Frankfort Pike,,Versailles,Kentucky,40383,5044151502,,Not captured,Not captured,david@newworldresources.com,Not captured,701939391,,Not captured,Not captured,Not captured,Not captured,Not captured,Not captured,