EE Transaction Type,Dependent Transaction Type,Effective Date,EE Signature,EE Signature Date,Control,Suffix,Account,Plan Number,Plan Name,Claim Office,Network ID Number,Customer Code,EE SSN,Dependent SSN,Dependent Relationship,Last Name,First Name,Middle Initial,DOB,Gender,Ethnicity,PCP/PCD,PCP/PCD Current Patient,Provider Cap Office Number,COB,Dep Student Indicator,Dep OOA Indicator,EE Prior Coverage Indicator,EE Late Entrant,EE Language Indicator,Hire Date,Earnings,Earnings Frequency,Beneficiary (Last Name First Name MI),Beneficiary Relationship,Continuation of Coverage Expiration Date,Continuation of Coverage Event Date,Continuation of Coverage Length of Coverage,Work Location Zip Code,Street Address Line 1,Street Address Line 2,City,State,Zip Code,Home Phone Number,Work Phone Number,Accept Code,Evidence Code,EE Email Address,Communication Disability Code,EE Alternate ID,Dep Alternate ID,Old Control,Old Suffix,Old Account,New Control,New Suffix,New Account,
Not captured,Not captured,08/10/2019,Not captured,Not captured,863949,020,00072,OVI-28-0052034,OverseasCare Visitors Insurance Plan,Not captured,Not captured,Not captured,,,,Rayudu,Nanditha,,01/20/2001,female,Not captured,Not captured,Not captured,Not captured,Not captured,Not captured,Not captured,Not captured,Not captured,Not captured,Not captured,Not captured,Not captured,Harshavardhan Rayudu,Son,Not captured,Not captured,Not captured,Not captured,22294 Lonsdale Dr,,Ashburn,Virginia,20148,7035797949,,Not captured,Not captured,ckancherla@yahoo.com,Not captured,701939420,,Not captured,Not captured,Not captured,Not captured,Not captured,Not captured,
Not captured,Not captured,08/10/2019,Not captured,Not captured,863949,020,00072,OVI-28-0052033,OverseasCare Visitors Insurance Plan,Not captured,Not captured,Not captured,,,,Rayudu,Sangeetha,,06/25/1972,female,Not captured,Not captured,Not captured,Not captured,Not captured,Not captured,Not captured,Not captured,Not captured,Not captured,Not captured,Not captured,Not captured,Harshavardhan Rayudu,Son,Not captured,Not captured,Not captured,Not captured,22294 Lonsdale Dr,,Ashburn,Virginia,20148,7035797949,,Not captured,Not captured,ckancherla@yahoo.com,Not captured,701939419,,Not captured,Not captured,Not captured,Not captured,Not captured,Not captured,
Not captured,Not captured,08/10/2019,Not captured,Not captured,863949,020,00072,OVI-28-0052032,OverseasCare Visitors Insurance Plan,Not captured,Not captured,Not captured,,,,Rayudu,Srinivas ,,05/10/1971,male,Not captured,Not captured,Not captured,Not captured,Not captured,Not captured,Not captured,Not captured,Not captured,Not captured,Not captured,Not captured,Not captured,Harshavardhan Rayudu,Son,Not captured,Not captured,Not captured,Not captured,22294 Lonsdale Dr,,Ashburn,Virginia,20148,7035797949,,Not captured,Not captured,ckancherla@yahoo.com,Not captured,701939418,,Not captured,Not captured,Not captured,Not captured,Not captured,Not captured,
Not captured,Not captured,08/10/2019,Not captured,Not captured,863949,020,00072,ARS-02-0052031,Beacon America,Not captured,Not captured,Not captured,Passport(P1940804),,,Bhalla,Rajni,,11/20/1959,female,Not captured,Not captured,Not captured,Not captured,Not captured,Not captured,Not captured,Not captured,Not captured,Not captured,Not captured,Not captured,Not captured,Gaurav Bhalla,Son,Not captured,Not captured,Not captured,Not captured,1938 Saint Clair St,,Port Huron,Michigan,48060,313-899-8469,,Not captured,Not captured,gauravbhalla85@gmail.com,Not captured,701939417,,Not captured,Not captured,Not captured,Not captured,Not captured,Not captured,
Not captured,Not captured,08/10/2019,Not captured,Not captured,863949,020,00072,ARS-01-0052030,Beacon International,Not captured,Not captured,Not captured,,,,Chan,Kwun wah,B,04/26/1974,male,Not captured,Not captured,Not captured,Not captured,Not captured,Not captured,Not captured,Not captured,Not captured,Not captured,Not captured,Not captured,Not captured,,,Not captured,Not captured,Not captured,Not captured,21102 Woodglen Ct,,Walnut,California,91789,,,Not captured,Not captured,winnie415@hotmail.com,Not captured,701939416,,Not captured,Not captured,Not captured,Not captured,Not captured,Not captured,
Not captured,Not captured,08/10/2019,Not captured,Not captured,863949,020,00072,ARS-01-0052029,Beacon International,Not captured,Not captured,Not captured,,,,fung,Rowina,w,04/15/1980,female,Not captured,Not captured,Not captured,Not captured,Not captured,Not captured,Not captured,Not captured,Not captured,Not captured,Not captured,Not captured,Not captured,,,Not captured,Not captured,Not captured,Not captured,21102 Woodglen Ct,,Walnut,California,91789,,,Not captured,Not captured,winnie415@hotmail.com,Not captured,701939415,,Not captured,Not captured,Not captured,Not captured,Not captured,Not captured,
Not captured,Not captured,08/10/2019,Not captured,Not captured,863949,020,00072,ARS-01-0052028,Beacon International,Not captured,Not captured,Not captured,,,,chan,Avery,Y,04/11/2015,male,Not captured,Not captured,Not captured,Not captured,Not captured,Not captured,Not captured,Not captured,Not captured,Not captured,Not captured,Not captured,Not captured,,,Not captured,Not captured,Not captured,Not captured,21102 Woodglen Ct,,Walnut,California,91789,,,Not captured,Not captured,winnie415@hotmail.com,Not captured,701939414,,Not captured,Not captured,Not captured,Not captured,Not captured,Not captured,
Not captured,Not captured,08/10/2019,Not captured,Not captured,863949,020,00072,ARS-01-0052026,Beacon International,Not captured,Not captured,Not captured,,,,Gouge,Gary,L,12/26/1957,male,Not captured,Not captured,Not captured,Not captured,Not captured,Not captured,Not captured,Not captured,Not captured,Not captured,Not captured,Not captured,Not captured,,,Not captured,Not captured,Not captured,Not captured,447 Silver Creek Dr,,Duncanville,Texas,75137-4577,,,Not captured,Not captured,gary.gouge@gmail.com,Not captured,701939412,,Not captured,Not captured,Not captured,Not captured,Not captured,Not captured,
Not captured,Not captured,08/09/2019,Not captured,Not captured,863949,020,00072,ARS-01-0052025,Beacon International,Not captured,Not captured,Not captured,,,,Kenyon,Daniel,A,07/28/1988,male,Not captured,Not captured,Not captured,Not captured,Not captured,Not captured,Not captured,Not captured,Not captured,Not captured,Not captured,Not captured,Not captured,,,Not captured,Not captured,Not captured,Not captured,138 overlook dr,,Greenville,New Hampshire,03048,,,Not captured,Not captured,kenyoncarpentry@comcast.net,Not captured,701939411,,Not captured,Not captured,Not captured,Not captured,Not captured,Not captured,
Not captured,Not captured,08/09/2019,Not captured,Not captured,863949,020,00072,ARS-01-0052024,Beacon International,Not captured,Not captured,Not captured,,,,Codyer,Thomas,,10/20/1988,male,Not captured,Not captured,Not captured,Not captured,Not captured,Not captured,Not captured,Not captured,Not captured,Not captured,Not captured,Not captured,Not captured,,,Not captured,Not captured,Not captured,Not captured,122 Townsend St,,Pepperell,Massachusetts,01463,,,Not captured,Not captured,thomascodyer@gmail.com,Not captured,701939410,,Not captured,Not captured,Not captured,Not captured,Not captured,Not captured,
Not captured,Not captured,08/10/2019,Not captured,Not captured,863949,020,00072,OVI-28-0052023,OverseasCare Visitors Insurance Plan,Not captured,Not captured,Not captured,,,,Barquin,Victoria,P,09/30/1954,female,Not captured,Not captured,Not captured,Not captured,Not captured,Not captured,Not captured,Not captured,Not captured,Not captured,Not captured,Not captured,Not captured,Joarhne Cata-ag,Daughter,Not captured,Not captured,Not captured,Not captured,1665 Randolph Pl #2,,Memphis,Tennessee,38120,9015178211,,Not captured,Not captured,enhraoj20@yahoo.com,Not captured,701939409,,Not captured,Not captured,Not captured,Not captured,Not captured,Not captured,
Not captured,Not captured,08/09/2019,Not captured,Not captured,863949,020,00072,ARS-02-0052022,Beacon America,Not captured,Not captured,Not captured,,,,Hamel,Cassandre,,04/27/2002,female,Not captured,Not captured,Not captured,Not captured,Not captured,Not captured,Not captured,Not captured,Not captured,Not captured,Not captured,Not captured,Not captured,,,Not captured,Not captured,Not captured,Not captured,524 Dovecote ln Unit 4,,Livermore,California,94551,,,Not captured,Not captured,sylvie_bis@hotmail.com,Not captured,701939408,,Not captured,Not captured,Not captured,Not captured,Not captured,Not captured,
Not captured,Not captured,08/11/2019,Not captured,Not captured,863949,020,00072,ARS-01-0052021,Beacon International,Not captured,Not captured,Not captured,Passport(C01292142),,,Miranda Boville,Maria Luisa,,09/14/1963,female,Not captured,Not captured,Not captured,Not captured,Not captured,Not captured,Not captured,Not captured,Not captured,Not captured,Not captured,Not captured,Not captured,,,Not captured,Not captured,Not captured,Not captured,2425 Wilson Blvd,,Arlington,Virginia,22201,7038415641,,Not captured,Not captured,pamruthkumar@ncsc.org,Not captured,701939407,,Not captured,Not captured,Not captured,Not captured,Not captured,Not captured,
Not captured,Not captured,08/11/2019,Not captured,Not captured,863949,020,00072,ARS-01-0052020,Beacon International,Not captured,Not captured,Not captured,Passport(C01467009),,,Valenzuela Averruz,Tanya Walkyria,,10/19/1977,female,Not captured,Not captured,Not captured,Not captured,Not captured,Not captured,Not captured,Not captured,Not captured,Not captured,Not captured,Not captured,Not captured,,,Not captured,Not captured,Not captured,Not captured,2425 Wilson Blvd,,Arlington,Virginia,22201,7038415641,,Not captured,Not captured,pamruthkumar@ncsc.org,Not captured,701939406,,Not captured,Not captured,Not captured,Not captured,Not captured,Not captured,
Not captured,Not captured,08/11/2019,Not captured,Not captured,863949,020,00072,ARS-01-0052019,Beacon International,Not captured,Not captured,Not captured,Passport(YC136544),,,Rodrigues,Renata Maria,,07/25/1962,female,Not captured,Not captured,Not captured,Not captured,Not captured,Not captured,Not captured,Not captured,Not captured,Not captured,Not captured,Not captured,Not captured,,,Not captured,Not captured,Not captured,Not captured,2425 Wilson Blvd,,Arlington,Virginia,22201,7038415641,,Not captured,Not captured,pamruthkumar@ncsc.org,Not captured,701939405,,Not captured,Not captured,Not captured,Not captured,Not captured,Not captured,
Not captured,Not captured,08/10/2019,Not captured,Not captured,863949,020,00072,ARS-03-0052008,Essential America,Not captured,Not captured,Not captured,Passport(473363472),,,Humphreys,David,Roger,12/07/1960,male,Not captured,Not captured,Not captured,Not captured,Not captured,Not captured,Not captured,Not captured,Not captured,Not captured,Not captured,Not captured,Not captured,,,Not captured,Not captured,Not captured,Not captured,784 Old Frankfort Pike,,Versailles,Kentucky,40383,5044151502,,Not captured,Not captured,david@newworldresources.com,Not captured,701939391,,Not captured,Not captured,Not captured,Not captured,Not captured,Not captured,
Not captured,Not captured,08/10/2019,Not captured,Not captured,863949,020,00072,ARS-03-0052008,Essential America,Not captured,Not captured,Not captured,,Passport(558808970),Spouse,Humphreys,Natalie,Gernhauser,12/24/1963,female,Not captured,Not captured,Not captured,Not captured,Not captured,Not captured,Not captured,Not captured,Not captured,Not captured,Not captured,Not captured,Not captured,,,Not captured,Not captured,Not captured,Not captured,784 Old Frankfort Pike,,Versailles,Kentucky,40383,5044151502,,Not captured,Not captured,david@newworldresources.com,Not captured,,701939392,Not captured,Not captured,Not captured,Not captured,Not captured,Not captured,
Not captured,Not captured,08/10/2019,Not captured,Not captured,863949,020,00072,ARS-03-0052008,Essential America,Not captured,Not captured,Not captured,,Passport(558761926),Dependant,Humphreys,Liam,James,08/19/2004,male,Not captured,Not captured,Not captured,Not captured,Not captured,Not captured,Not captured,Not captured,Not captured,Not captured,Not captured,Not captured,Not captured,,,Not captured,Not captured,Not captured,Not captured,784 Old Frankfort Pike,,Versailles,Kentucky,40383,5044151502,,Not captured,Not captured,david@newworldresources.com,Not captured,,701939393,Not captured,Not captured,Not captured,Not captured,Not captured,Not captured,
Not captured,Not captured,08/09/2019,Not captured,Not captured,863949,020,00072,ARS-03-0052007,Essential America,Not captured,Not captured,Not captured,Passport(Y3656847),,,Qian,Li,,07/15/1997,female,Not captured,Not captured,Not captured,Not captured,Not captured,Not captured,Not captured,Not captured,Not captured,Not captured,Not captured,Not captured,Not captured,,,Not captured,Not captured,Not captured,Not captured,10706 Ohio Ave.,,Los Angeles,California,90024,4243201626,,Not captured,Not captured,bharati@visitorsinsurance.com,Not captured,701939390,,Not captured,Not captured,Not captured,Not captured,Not captured,Not captured,
Not captured,Not captured,08/09/2019,Not captured,Not captured,863949,020,00072,ARS-01-0052016,Beacon International,Not captured,Not captured,Not captured,,,,Lauritsen,Maiken,,04/30/1976,female,Not captured,Not captured,Not captured,Not captured,Not captured,Not captured,Not captured,Not captured,Not captured,Not captured,Not captured,Not captured,Not captured,,,Not captured,Not captured,Not captured,Not captured,206 Avenue B Apt 7,,New York,New York,10009,,,Not captured,Not captured,mailau@um.dk,Not captured,701939402,,Not captured,Not captured,Not captured,Not captured,Not captured,Not captured,
Not captured,Not captured,08/09/2019,Not captured,Not captured,863949,020,00072,ARS-01-0052015,Beacon International,Not captured,Not captured,Not captured,,,,Swanson,Hezekiah,J,02/22/2018,male,Not captured,Not captured,Not captured,Not captured,Not captured,Not captured,Not captured,Not captured,Not captured,Not captured,Not captured,Not captured,Not captured,,,Not captured,Not captured,Not captured,Not captured,16319 158th Ave NE,,Woodinville,Washington,98072,,,Not captured,Not captured,kemcclung@gmail.com,Not captured,701939400,,Not captured,Not captured,Not captured,Not captured,Not captured,Not captured,
Not captured,Not captured,08/09/2019,Not captured,Not captured,863949,020,00072,ARS-01-0052014,Beacon International,Not captured,Not captured,Not captured,,,,Swanson,Michael,D,06/21/1981,male,Not captured,Not captured,Not captured,Not captured,Not captured,Not captured,Not captured,Not captured,Not captured,Not captured,Not captured,Not captured,Not captured,,,Not captured,Not captured,Not captured,Not captured,16319 158th Ave NE,,Woodinville,Washington,98072,,,Not captured,Not captured,kemcclung@gmail.com,Not captured,701939399,,Not captured,Not captured,Not captured,Not captured,Not captured,Not captured,
Not captured,Not captured,08/09/2019,Not captured,Not captured,863949,020,00072,ARS-01-0052013,Beacon International,Not captured,Not captured,Not captured,,,,Swanson,Katherine,E,11/13/1982,female,Not captured,Not captured,Not captured,Not captured,Not captured,Not captured,Not captured,Not captured,Not captured,Not captured,Not captured,Not captured,Not captured,,,Not captured,Not captured,Not captured,Not captured,16319 158th Ave NE,,Woodinville,Washington,98072,,,Not captured,Not captured,kemcclung@gmail.com,Not captured,701939398,,Not captured,Not captured,Not captured,Not captured,Not captured,Not captured,
Not captured,Not captured,08/09/2019,Not captured,Not captured,863949,020,00072,ARS-02-0052012,Beacon America,Not captured,Not captured,Not captured,,,,BAKER,SHANTEL,K,05/22/1990,female,Not captured,Not captured,Not captured,Not captured,Not captured,Not captured,Not captured,Not captured,Not captured,Not captured,Not captured,Not captured,Not captured,,,Not captured,Not captured,Not captured,Not captured,3 PAUL BOGLE PATH,,KINGSTON,,876,,,Not captured,Not captured,shantel.k.baker@hotmail.com,Not captured,701939397,,Not captured,Not captured,Not captured,Not captured,Not captured,Not captured,
Not captured,Not captured,08/11/2019,Not captured,Not captured,863949,020,00072,ARS-03-0051946,Essential America,Not captured,Not captured,Not captured,Passport(513398285),,,Stewart,Jessie,Lee,01/29/1977,male,Not captured,Not captured,Not captured,Not captured,Not captured,Not captured,Not captured,Not captured,Not captured,Not captured,Not captured,Not captured,Not captured,,,Not captured,Not captured,Not captured,Not captured,27 Chipping Way,,Bulawayo,,Burnside,9184976506,,Not captured,Not captured,jessieleestewart@gmail.com,Not captured,701939303,,Not captured,Not captured,Not captured,Not captured,Not captured,Not captured,
Not captured,Not captured,08/11/2019,Not captured,Not captured,863949,020,00072,ARS-03-0051946,Essential America,Not captured,Not captured,Not captured,,Passport(541955329),Spouse,Stewart,Billy,Jo,02/01/1977,female,Not captured,Not captured,Not captured,Not captured,Not captured,Not captured,Not captured,Not captured,Not captured,Not captured,Not captured,Not captured,Not captured,,,Not captured,Not captured,Not captured,Not captured,27 Chipping Way,,Bulawayo,,Burnside,9184976506,,Not captured,Not captured,jessieleestewart@gmail.com,Not captured,,701939304,Not captured,Not captured,Not captured,Not captured,Not captured,Not captured,
Not captured,Not captured,08/11/2019,Not captured,Not captured,863949,020,00072,ARS-03-0051946,Essential America,Not captured,Not captured,Not captured,,Passport(640218993),Dependant,Stewart,Ashlynn,Cheyenne,11/10/2001,female,Not captured,Not captured,Not captured,Not captured,Not captured,Not captured,Not captured,Not captured,Not captured,Not captured,Not captured,Not captured,Not captured,,,Not captured,Not captured,Not captured,Not captured,27 Chipping Way,,Bulawayo,,Burnside,9184976506,,Not captured,Not captured,jessieleestewart@gmail.com,Not captured,,701939305,Not captured,Not captured,Not captured,Not captured,Not captured,Not captured,
Not captured,Not captured,08/11/2019,Not captured,Not captured,863949,020,00072,ARS-03-0051946,Essential America,Not captured,Not captured,Not captured,,Passport(640218992),Dependant,Stewart,Hayden,James,08/01/2003,male,Not captured,Not captured,Not captured,Not captured,Not captured,Not captured,Not captured,Not captured,Not captured,Not captured,Not captured,Not captured,Not captured,,,Not captured,Not captured,Not captured,Not captured,27 Chipping Way,,Bulawayo,,Burnside,9184976506,,Not captured,Not captured,jessieleestewart@gmail.com,Not captured,,701939306,Not captured,Not captured,Not captured,Not captured,Not captured,Not captured,
Not captured,Not captured,08/11/2019,Not captured,Not captured,863949,020,00072,ARS-02-0051960,Beacon America,Not captured,Not captured,Not captured,Passport(na),,,Rincon Zambrano,William Oswaldo,,09/29/1969,male,Not captured,Not captured,Not captured,Not captured,Not captured,Not captured,Not captured,Not captured,Not captured,Not captured,Not captured,Not captured,Not captured,estate,na,Not captured,Not captured,Not captured,Not captured,National Center for State Courts,,Bogota,Distrito Capltal de Santa Fe de Bogot&atilde;,na,5714898640 114,,Not captured,Not captured,yrodriguez@ncsc.co,Not captured,701939320,,Not captured,Not captured,Not captured,Not captured,Not captured,Not captured,
Not captured,Not captured,08/11/2019,Not captured,Not captured,863949,020,00072,ARS-02-0051957,Beacon America,Not captured,Not captured,Not captured,Passport(na),,,Soler Roldan,Luis Eduardo,,10/09/1969,male,Not captured,Not captured,Not captured,Not captured,Not captured,Not captured,Not captured,Not captured,Not captured,Not captured,Not captured,Not captured,Not captured,estate,na,Not captured,Not captured,Not captured,Not captured,National Center for State Courts,,Bogota,Distrito Capltal de Santa Fe de Bogot&atilde;,na,5714898640 114,,Not captured,Not captured,yrodriguez@ncsc.co,Not captured,701939317,,Not captured,Not captured,Not captured,Not captured,Not captured,Not captured,
Not captured,Not captured,08/11/2019,Not captured,Not captured,863949,020,00072,ARS-02-0051956,Beacon America,Not captured,Not captured,Not captured,Passport(na),,,Vargas Cuadros,Jose Olivo,,10/31/1976,male,Not captured,Not captured,Not captured,Not captured,Not captured,Not captured,Not captured,Not captured,Not captured,Not captured,Not captured,Not captured,Not captured,estate,na,Not captured,Not captured,Not captured,Not captured,National Center for State Courts,,Bogota,Distrito Capltal de Santa Fe de Bogot&atilde;,na,5714898640 114,,Not captured,Not captured,yrodriguez@ncsc.co,Not captured,701939316,,Not captured,Not captured,Not captured,Not captured,Not captured,Not captured,
Not captured,Not captured,08/11/2019,Not captured,Not captured,863949,020,00072,ARS-02-0051955,Beacon America,Not captured,Not captured,Not captured,Passport(na),,,Zafra Tristancho,Harold Alexis,,02/09/1983,male,Not captured,Not captured,Not captured,Not captured,Not captured,Not captured,Not captured,Not captured,Not captured,Not captured,Not captured,Not captured,Not captured,estate,na,Not captured,Not captured,Not captured,Not captured,National Center for State Courts,,Bogota,Distrito Capltal de Santa Fe de Bogot&atilde;,na,5714898640 114,,Not captured,Not captured,yrodriguez@ncsc.co,Not captured,701939315,,Not captured,Not captured,Not captured,Not captured,Not captured,Not captured,
Not captured,Not captured,08/11/2019,Not captured,Not captured,863949,020,00072,ARS-02-0051954,Beacon America,Not captured,Not captured,Not captured,Passport(na),,,Casilimas Murcia,Edwin Alexander,,11/09/1979,male,Not captured,Not captured,Not captured,Not captured,Not captured,Not captured,Not captured,Not captured,Not captured,Not captured,Not captured,Not captured,Not captured,estate,na,Not captured,Not captured,Not captured,Not captured,National Center for State Courts,,Bogota,Distrito Capltal de Santa Fe de Bogot&atilde;,na,5714898640 114,,Not captured,Not captured,yrodriguez@ncsc.co,Not captured,701939314,,Not captured,Not captured,Not captured,Not captured,Not captured,Not captured,
Not captured,Not captured,08/09/2019,Not captured,Not captured,863949,020,00072,ARS-01-0051938,Beacon International,Not captured,Not captured,Not captured,,,,Agbonavbare,macmillan,,04/17/1994,male,Not captured,Not captured,Not captured,Not captured,Not captured,Not captured,Not captured,Not captured,Not captured,Not captured,Not captured,Not captured,Not captured,,,Not captured,Not captured,Not captured,Not captured,697 Tejo St,,Rexburg,Idaho,83440,,,Not captured,Not captured,brittanypaigehalliday@gmail.com,Not captured,701939295,,Not captured,Not captured,Not captured,Not captured,Not captured,Not captured,
Not captured,Not captured,08/09/2019,Not captured,Not captured,863949,020,00072,ARS-01-0051937,Beacon International,Not captured,Not captured,Not captured,,,,Halliday,Brittany,,06/14/1996,female,Not captured,Not captured,Not captured,Not captured,Not captured,Not captured,Not captured,Not captured,Not captured,Not captured,Not captured,Not captured,Not captured,,,Not captured,Not captured,Not captured,Not captured,697 Tejo St,,Rexburg,Idaho,83440,,,Not captured,Not captured,brittanypaigehalliday@gmail.com,Not captured,701939294,,Not captured,Not captured,Not captured,Not captured,Not captured,Not captured,