EE Transaction Type,Dependent Transaction Type,Effective Date,EE Signature,EE Signature Date,Control,Suffix,Account,Plan Number,Plan Name,Claim Office,Network ID Number,Customer Code,EE SSN,Dependent SSN,Dependent Relationship,Last Name,First Name,Middle Initial,DOB,Gender,Ethnicity,PCP/PCD,PCP/PCD Current Patient,Provider Cap Office Number,COB,Dep Student Indicator,Dep OOA Indicator,EE Prior Coverage Indicator,EE Late Entrant,EE Language Indicator,Hire Date,Earnings,Earnings Frequency,Beneficiary (Last Name First Name MI),Beneficiary Relationship,Continuation of Coverage Expiration Date,Continuation of Coverage Event Date,Continuation of Coverage Length of Coverage,Work Location Zip Code,Street Address Line 1,Street Address Line 2,City,State,Zip Code,Home Phone Number,Work Phone Number,Accept Code,Evidence Code,EE Email Address,Communication Disability Code,EE Alternate ID,Dep Alternate ID,Old Control,Old Suffix,Old Account,New Control,New Suffix,New Account,
Not captured,Not captured,08/08/2019,Not captured,Not captured,863949,020,00072,OVI-28-0052010,OverseasCare Visitors Insurance Plan,Not captured,Not captured,Not captured,Passport(P1629652),,,sridharan,Selvi,,01/13/1962,female,Not captured,Not captured,Not captured,Not captured,Not captured,Not captured,Not captured,Not captured,Not captured,Not captured,Not captured,Not captured,Not captured,Sindhu sridharan,Daughter,Not captured,Not captured,Not captured,Not captured,5008 hunter hill court,,Glen allen,Virginia,23059,7049539960,,Not captured,Not captured,Sugumar14@gmail.com,Not captured,701939395,,Not captured,Not captured,Not captured,Not captured,Not captured,Not captured,
Not captured,Not captured,08/08/2019,Not captured,Not captured,863949,020,00072,ARS-01-0052005,Beacon International,Not captured,Not captured,Not captured,,,,Hindle,Holly,,10/03/2010,female,Not captured,Not captured,Not captured,Not captured,Not captured,Not captured,Not captured,Not captured,Not captured,Not captured,Not captured,Not captured,Not captured,,,Not captured,Not captured,Not captured,Not captured,1128 Gambelli Drive,,York Town Heights,New York,10598,,,Not captured,Not captured,veronikahindle@gmail.com,Not captured,701939386,,Not captured,Not captured,Not captured,Not captured,Not captured,Not captured,
Not captured,Not captured,08/08/2019,Not captured,Not captured,863949,020,00072,ARS-01-0052004,Beacon International,Not captured,Not captured,Not captured,,,,Hindle,Keith,,08/29/1969,male,Not captured,Not captured,Not captured,Not captured,Not captured,Not captured,Not captured,Not captured,Not captured,Not captured,Not captured,Not captured,Not captured,,,Not captured,Not captured,Not captured,Not captured,1128 Gambelli Drive,,York Town Heights,New York,10598,,,Not captured,Not captured,veronikahindle@gmail.com,Not captured,701939385,,Not captured,Not captured,Not captured,Not captured,Not captured,Not captured,
Not captured,Not captured,08/08/2019,Not captured,Not captured,863949,020,00072,ARS-01-0052003,Beacon International,Not captured,Not captured,Not captured,,,,Hindle,Veronika,,08/12/1976,female,Not captured,Not captured,Not captured,Not captured,Not captured,Not captured,Not captured,Not captured,Not captured,Not captured,Not captured,Not captured,Not captured,,,Not captured,Not captured,Not captured,Not captured,1128 Gambelli Drive,,York Town Heights,New York,10598,,,Not captured,Not captured,veronikahindle@gmail.com,Not captured,701939384,,Not captured,Not captured,Not captured,Not captured,Not captured,Not captured,
Not captured,Not captured,08/08/2019,Not captured,Not captured,863949,020,00072,ARS-01-0051999,Beacon International,Not captured,Not captured,Not captured,,,,ROSE,REBECCA,,11/27/1955,female,Not captured,Not captured,Not captured,Not captured,Not captured,Not captured,Not captured,Not captured,Not captured,Not captured,Not captured,Not captured,Not captured,,,Not captured,Not captured,Not captured,Not captured,rebecca rose,,Florence,Massachusetts,01062,,,Not captured,Not captured,r.rose55@gmail.com,Not captured,701939374,,Not captured,Not captured,Not captured,Not captured,Not captured,Not captured,
Not captured,Not captured,08/08/2019,Not captured,Not captured,863949,020,00072,ARS-01-0051985,Beacon International,Not captured,Not captured,Not captured,,,,Volwater Hirales,Sofia Anthoniette,,03/24/2016,female,Not captured,Not captured,Not captured,Not captured,Not captured,Not captured,Not captured,Not captured,Not captured,Not captured,Not captured,Not captured,Not captured,Andrea del Pilar Hirales Cota,girlfriend / mother of my children,Not captured,Not captured,Not captured,Not captured,Bulevard villas de cortez,,San jose del cabo,Baja California Sur,23427,+5216241267528,,Not captured,Not captured,b.a.volwater@gmail.com,Not captured,701939349,,Not captured,Not captured,Not captured,Not captured,Not captured,Not captured,
Not captured,Not captured,08/08/2019,Not captured,Not captured,863949,020,00072,ARS-01-0051984,Beacon International,Not captured,Not captured,Not captured,Passport(NS901KB75),,,Volwater,Bernardus Adrianus,,06/02/1985,male,Not captured,Not captured,Not captured,Not captured,Not captured,Not captured,Not captured,Not captured,Not captured,Not captured,Not captured,Not captured,Not captured,Andrea del Pilar Hirales Cota,girlfriend / mother of my children,Not captured,Not captured,Not captured,Not captured,Bulevard villas de cortez,,San jose del cabo,Baja California Sur,23427,+5216241267528,,Not captured,Not captured,b.a.volwater@gmail.com,Not captured,701939348,,Not captured,Not captured,Not captured,Not captured,Not captured,Not captured,
Not captured,Not captured,08/08/2019,Not captured,Not captured,863949,020,00072,ARS-02-0051982,Beacon America,Not captured,Not captured,Not captured,,,,Ravikumar,Akanksha,,11/23/2008,female,Not captured,Not captured,Not captured,Not captured,Not captured,Not captured,Not captured,Not captured,Not captured,Not captured,Not captured,Not captured,Not captured,Sharada Ramaiah,Mother,Not captured,Not captured,Not captured,Not captured,7496 WYNDHURST PL,,Germantown,TN,38138,9014939147,,Not captured,Not captured,h.ravi.k@gmail.com,Not captured,701939346,,Not captured,Not captured,Not captured,Not captured,Not captured,Not captured,
Not captured,Not captured,08/08/2019,Not captured,Not captured,863949,020,00072,ARS-02-0051981,Beacon America,Not captured,Not captured,Not captured,,,,Ravikumar,Adithya,,10/01/2004,male,Not captured,Not captured,Not captured,Not captured,Not captured,Not captured,Not captured,Not captured,Not captured,Not captured,Not captured,Not captured,Not captured,Sharada Ramaiah,Mother,Not captured,Not captured,Not captured,Not captured,7496 WYNDHURST PL,,Germantown,TN,38138,9014939147,,Not captured,Not captured,h.ravi.k@gmail.com,Not captured,701939345,,Not captured,Not captured,Not captured,Not captured,Not captured,Not captured,
Not captured,Not captured,08/08/2019,Not captured,Not captured,863949,020,00072,ARS-02-0051980,Beacon America,Not captured,Not captured,Not captured,,,,Santhemavathur Puttaswamaiah,Deepa,,03/29/1979,female,Not captured,Not captured,Not captured,Not captured,Not captured,Not captured,Not captured,Not captured,Not captured,Not captured,Not captured,Not captured,Not captured,Sharada Ramaiah,Mother,Not captured,Not captured,Not captured,Not captured,7496 WYNDHURST PL,,Germantown,TN,38138,9014939147,,Not captured,Not captured,h.ravi.k@gmail.com,Not captured,701939344,,Not captured,Not captured,Not captured,Not captured,Not captured,Not captured,
Not captured,Not captured,08/08/2019,Not captured,Not captured,863949,020,00072,ARS-02-0051979,Beacon America,Not captured,Not captured,Not captured,Passport(Z4118598),,,Hanumaiah,Ravikumar,,03/24/1972,male,Not captured,Not captured,Not captured,Not captured,Not captured,Not captured,Not captured,Not captured,Not captured,Not captured,Not captured,Not captured,Not captured,Sharada Ramaiah,Mother,Not captured,Not captured,Not captured,Not captured,7496 WYNDHURST PL,,Germantown,TN,38138,9014939147,,Not captured,Not captured,h.ravi.k@gmail.com,Not captured,701939343,,Not captured,Not captured,Not captured,Not captured,Not captured,Not captured,
Not captured,Not captured,08/08/2019,Not captured,Not captured,863949,020,00072,ARS-02-0051924,Beacon America,Not captured,Not captured,Not captured,,,,Kaufman,Rosa C,,02/09/2019,female,Not captured,Not captured,Not captured,Not captured,Not captured,Not captured,Not captured,Not captured,Not captured,Not captured,Not captured,Not captured,Not captured,,,Not captured,Not captured,Not captured,Not captured,411 Lawrence Ave w,,Toronto,Ontario,M5M 1c1,467838784,,Not captured,Not captured,estifinkel1@gmail.com,Not captured,701939276,,Not captured,Not captured,Not captured,Not captured,Not captured,Not captured,
Not captured,Not captured,08/08/2019,Not captured,Not captured,863949,020,00072,ARS-02-0051923,Beacon America,Not captured,Not captured,Not captured,,,,kaufman,Dovid,,10/07/2016,male,Not captured,Not captured,Not captured,Not captured,Not captured,Not captured,Not captured,Not captured,Not captured,Not captured,Not captured,Not captured,Not captured,,,Not captured,Not captured,Not captured,Not captured,411 Lawrence Ave w,,Toronto,Ontario,M5M 1c1,467838784,,Not captured,Not captured,estifinkel1@gmail.com,Not captured,701939275,,Not captured,Not captured,Not captured,Not captured,Not captured,Not captured,
Not captured,Not captured,08/08/2019,Not captured,Not captured,863949,020,00072,ARS-02-0051922,Beacon America,Not captured,Not captured,Not captured,,,,Kaufman,Esther,,09/28/1995,female,Not captured,Not captured,Not captured,Not captured,Not captured,Not captured,Not captured,Not captured,Not captured,Not captured,Not captured,Not captured,Not captured,,,Not captured,Not captured,Not captured,Not captured,411 Lawrence Ave w,,Toronto,Ontario,M5M 1c1,467838784,,Not captured,Not captured,estifinkel1@gmail.com,Not captured,701939274,,Not captured,Not captured,Not captured,Not captured,Not captured,Not captured,
Not captured,Not captured,08/08/2019,Not captured,Not captured,863949,020,00072,ARS-02-0051921,Beacon America,Not captured,Not captured,Not captured,,,,Kaufman,Avroham,,07/12/1991,male,Not captured,Not captured,Not captured,Not captured,Not captured,Not captured,Not captured,Not captured,Not captured,Not captured,Not captured,Not captured,Not captured,,,Not captured,Not captured,Not captured,Not captured,411 Lawrence Ave w,,Toronto,Ontario,M5M 1c1,467838784,,Not captured,Not captured,estifinkel1@gmail.com,Not captured,701939273,,Not captured,Not captured,Not captured,Not captured,Not captured,Not captured,
Not captured,Not captured,08/08/2019,Not captured,Not captured,863949,020,00072,ARS-02-0051718,Beacon America,Not captured,Not captured,Not captured,,,,Drezel,Tzvi,,06/06/2019,male,Not captured,Not captured,Not captured,Not captured,Not captured,Not captured,Not captured,Not captured,Not captured,Not captured,Not captured,Not captured,Not captured,,,Not captured,Not captured,Not captured,Not captured,6 Bartenura road,,Lakewood,New Jersey,08701,732-364-2118,,Not captured,Not captured,miriamdrezel@gmail.com,Not captured,701938893,,Not captured,Not captured,Not captured,Not captured,Not captured,Not captured,
Not captured,Not captured,08/08/2019,Not captured,Not captured,863949,020,00072,ARS-02-0051717,Beacon America,Not captured,Not captured,Not captured,,,,drezel,Mordechai,,07/12/2017,male,Not captured,Not captured,Not captured,Not captured,Not captured,Not captured,Not captured,Not captured,Not captured,Not captured,Not captured,Not captured,Not captured,,,Not captured,Not captured,Not captured,Not captured,6 Bartenura road,,Lakewood,New Jersey,08701,732-364-2118,,Not captured,Not captured,miriamdrezel@gmail.com,Not captured,701938892,,Not captured,Not captured,Not captured,Not captured,Not captured,Not captured,
Not captured,Not captured,08/08/2019,Not captured,Not captured,863949,020,00072,ARS-02-0051716,Beacon America,Not captured,Not captured,Not captured,,,,Drezel,Simcha,,07/06/2015,male,Not captured,Not captured,Not captured,Not captured,Not captured,Not captured,Not captured,Not captured,Not captured,Not captured,Not captured,Not captured,Not captured,,,Not captured,Not captured,Not captured,Not captured,6 Bartenura road,,Lakewood,New Jersey,08701,732-364-2118,,Not captured,Not captured,miriamdrezel@gmail.com,Not captured,701938891,,Not captured,Not captured,Not captured,Not captured,Not captured,Not captured,
Not captured,Not captured,08/08/2019,Not captured,Not captured,863949,020,00072,ARS-02-0051715,Beacon America,Not captured,Not captured,Not captured,,,,Brezel,Yaakov,,08/01/1989,male,Not captured,Not captured,Not captured,Not captured,Not captured,Not captured,Not captured,Not captured,Not captured,Not captured,Not captured,Not captured,Not captured,,,Not captured,Not captured,Not captured,Not captured,6 Bartenura road,,Lakewood,New Jersey,08701,732-364-2118,,Not captured,Not captured,miriamdrezel@gmail.com,Not captured,701938890,,Not captured,Not captured,Not captured,Not captured,Not captured,Not captured,
Not captured,Not captured,08/08/2019,Not captured,Not captured,863949,020,00072,ARS-01-0051503,Beacon International,Not captured,Not captured,Not captured,,,,Grunbaum,Naftuli,,01/17/2001,male,Not captured,Not captured,Not captured,Not captured,Not captured,Not captured,Not captured,Not captured,Not captured,Not captured,Not captured,Not captured,Not captured,,,Not captured,Not captured,Not captured,Not captured,2 Hawghorne street,,lakewood,New Jersey,08701,908-910-8753,,Not captured,Not captured,edgrunbaum@gmail.com,Not captured,701938411,,Not captured,Not captured,Not captured,Not captured,Not captured,Not captured,
Not captured,Not captured,08/08/2019,Not captured,Not captured,863949,020,00072,ARS-01-0051452,Beacon International,Not captured,Not captured,Not captured,Passport(K0421104),,,TESFAENDRIAS,TSLAL,AFEWERKI,08/30/1998,female,Not captured,Not captured,Not captured,Not captured,Not captured,Not captured,Not captured,Not captured,Not captured,Not captured,Not captured,Not captured,Not captured,,,Not captured,Not captured,Not captured,Not captured,denicapi12@gmail.com,,ASMARA,Central (Maekel),589,5434140785,5434140785,Not captured,Not captured,denicapi12@gmail.com,Not captured,701938336,,Not captured,Not captured,Not captured,Not captured,Not captured,Not captured,
Not captured,Not captured,08/08/2019,Not captured,Not captured,863949,020,00072,ARS-01-0051398,Beacon International,Not captured,Not captured,Not captured,Passport(0923089619),,,sarasti miranda,jose mitchel,,08/10/1982,male,Not captured,Not captured,Not captured,Not captured,Not captured,Not captured,Not captured,Not captured,Not captured,Not captured,Not captured,Not captured,Not captured,attilio c leonardi,spouse,Not captured,Not captured,Not captured,Not captured,321 east 78th str,,new york,New York,10075,212-772-0770,212-772-0770,Not captured,Not captured,mitchelsarasti@gmail.com,Not captured,701938261,,Not captured,Not captured,Not captured,Not captured,Not captured,Not captured,
Not captured,Not captured,08/08/2019,Not captured,Not captured,863949,020,00072,ARS-01-0051097,Beacon International,Not captured,Not captured,Not captured,,,,Sehr,Genevieve,R,03/05/1984,female,Not captured,Not captured,Not captured,Not captured,Not captured,Not captured,Not captured,Not captured,Not captured,Not captured,Not captured,Not captured,Not captured,,,Not captured,Not captured,Not captured,Not captured,145m al este del EBAIS,,Nosara,,0000,,,Not captured,Not captured,gigisehr@gmail.com,Not captured,701937595,,Not captured,Not captured,Not captured,Not captured,Not captured,Not captured,
Not captured,Not captured,08/08/2019,Not captured,Not captured,863949,020,00072,ARS-36-0049010,Beacon Student Elite,Not captured,Not captured,Not captured,Passport(141045366),,,RODRIGUES DE ABREU,NADREA ,,07/16/1999,male,Not captured,Not captured,Not captured,Not captured,Not captured,Not captured,Not captured,Not captured,Not captured,Not captured,Not captured,Not captured,Not captured,PATRICIA RODRIGUES,MOTHER,Not captured,Not captured,Not captured,Not captured,AVE. VENEZUELA CALLE 32. URB. LA PRADERA,,ACARIGUA-ARAURE,Portuguesa,3303,3053937543,,Not captured,Not captured,ARODR1274@FIU.EDU,Not captured,701932497,,Not captured,Not captured,Not captured,Not captured,Not captured,Not captured,
Not captured,Not captured,08/08/2019,Not captured,Not captured,863949,020,00072,ARS-01-0048440,Beacon International,Not captured,Not captured,Not captured,,,,Bitteng Ndjibbo,Aristide,C,05/27/1981,male,Not captured,Not captured,Not captured,Not captured,Not captured,Not captured,Not captured,Not captured,Not captured,Not captured,Not captured,Not captured,Not captured,,,Not captured,Not captured,Not captured,Not captured,20118 Oneals Place,,Hagerstown,Maryland,21742,,,Not captured,Not captured,chrystellesong@yahoo.com,Not captured,701931478,,Not captured,Not captured,Not captured,Not captured,Not captured,Not captured