EE Transaction Type,Dependent Transaction Type,Effective Date,EE Signature,EE Signature Date,Control,Suffix,Account,Plan Number,Plan Name,Claim Office,Network ID Number,Customer Code,EE SSN,Dependent SSN,Dependent Relationship,Last Name,First Name,Middle Initial,DOB,Gender,Ethnicity,PCP/PCD,PCP/PCD Current Patient,Provider Cap Office Number,COB,Dep Student Indicator,Dep OOA Indicator,EE Prior Coverage Indicator,EE Late Entrant,EE Language Indicator,Hire Date,Earnings,Earnings Frequency,Beneficiary (Last Name First Name MI),Beneficiary Relationship,Continuation of Coverage Expiration Date,Continuation of Coverage Event Date,Continuation of Coverage Length of Coverage,Work Location Zip Code,Street Address Line 1,Street Address Line 2,City,State,Zip Code,Home Phone Number,Work Phone Number,Accept Code,Evidence Code,EE Email Address,Communication Disability Code,EE Alternate ID,Dep Alternate ID,Old Control,Old Suffix,Old Account,New Control,New Suffix,New Account,
Not captured,Not captured,08/07/2019,Not captured,Not captured,863949,020,00072,ARS-01-0051996,Beacon International,Not captured,Not captured,Not captured,,,,Pokelsek,Kirsten,N,08/11/1993,female,Not captured,Not captured,Not captured,Not captured,Not captured,Not captured,Not captured,Not captured,Not captured,Not captured,Not captured,Not captured,Not captured,,,Not captured,Not captured,Not captured,Not captured,2414 Shadow Ln,,Stow,Ohio,44224,,,Not captured,Not captured,pokelskn@miamioh.edu,Not captured,701939370,,Not captured,Not captured,Not captured,Not captured,Not captured,Not captured,
Not captured,Not captured,08/07/2019,Not captured,Not captured,863949,020,00072,ARS-02-0051995,Beacon America,Not captured,Not captured,Not captured,Passport(U10830786),,,Tuncel,Nur,O,12/06/1990,female,Not captured,Not captured,Not captured,Not captured,Not captured,Not captured,Not captured,Not captured,Not captured,Not captured,Not captured,Not captured,Not captured,,,Not captured,Not captured,Not captured,Not captured,3033 Woods Circle,,Davis,CA,95616,5108664591,,Not captured,Not captured,oykutuncel@gmail.com,Not captured,701939369,,Not captured,Not captured,Not captured,Not captured,Not captured,Not captured,
Not captured,Not captured,08/07/2019,Not captured,Not captured,863949,020,00072,ARS-03-0051964,Essential America,Not captured,Not captured,Not captured,Passport(538671345),,,Wolf,Erin,,08/31/1979,female,Not captured,Not captured,Not captured,Not captured,Not captured,Not captured,Not captured,Not captured,Not captured,Not captured,Not captured,Not captured,Not captured,,,Not captured,Not captured,Not captured,Not captured,Grand Anse,,St Georges,,000,+14734220453,,Not captured,Not captured,wolferin01@gmail.com,Not captured,701939324,,Not captured,Not captured,Not captured,Not captured,Not captured,Not captured,
Not captured,Not captured,08/07/2019,Not captured,Not captured,863949,020,00072,ARS-03-0051964,Essential America,Not captured,Not captured,Not captured,,Passport(546272919),Dependant,Wolf,Beckett,,06/19/2008,male,Not captured,Not captured,Not captured,Not captured,Not captured,Not captured,Not captured,Not captured,Not captured,Not captured,Not captured,Not captured,Not captured,,,Not captured,Not captured,Not captured,Not captured,Grand Anse,,St Georges,,000,+14734220453,,Not captured,Not captured,wolferin01@gmail.com,Not captured,,701939325,Not captured,Not captured,Not captured,Not captured,Not captured,Not captured,
Not captured,Not captured,08/07/2019,Not captured,Not captured,863949,020,00072,ARS-03-0051964,Essential America,Not captured,Not captured,Not captured,,Passport(546314668),Dependant,Wolf,Averie,,03/14/2011,female,Not captured,Not captured,Not captured,Not captured,Not captured,Not captured,Not captured,Not captured,Not captured,Not captured,Not captured,Not captured,Not captured,,,Not captured,Not captured,Not captured,Not captured,Grand Anse,,St Georges,,000,+14734220453,,Not captured,Not captured,wolferin01@gmail.com,Not captured,,701939326,Not captured,Not captured,Not captured,Not captured,Not captured,Not captured,
Not captured,Not captured,08/07/2019,Not captured,Not captured,863949,020,00072,ARS-03-0051964,Essential America,Not captured,Not captured,Not captured,,Passport(525598711),Dependant,Wolf,Elodie,,01/14/2015,female,Not captured,Not captured,Not captured,Not captured,Not captured,Not captured,Not captured,Not captured,Not captured,Not captured,Not captured,Not captured,Not captured,,,Not captured,Not captured,Not captured,Not captured,Grand Anse,,St Georges,,000,+14734220453,,Not captured,Not captured,wolferin01@gmail.com,Not captured,,701939327,Not captured,Not captured,Not captured,Not captured,Not captured,Not captured,
Not captured,Not captured,08/07/2019,Not captured,Not captured,863949,020,00072,ARS-02-0051987,Beacon America,Not captured,Not captured,Not captured,Passport(L8611286),,,Ghosh,Sukumar,,05/12/1944,male,Not captured,Not captured,Not captured,Not captured,Not captured,Not captured,Not captured,Not captured,Not captured,Not captured,Not captured,Not captured,Not captured,Kalyan Ghosh,Brother,Not captured,Not captured,Not captured,Not captured,10005 Hammock Bend,,Chapel Hill,North Carolina,27517,9199605727,,Not captured,Not captured,ghosh4320@gmail.com,Not captured,701939356,,Not captured,Not captured,Not captured,Not captured,Not captured,Not captured,
Not captured,Not captured,08/07/2019,Not captured,Not captured,863949,020,00072,ARS-01-0051978,Beacon International,Not captured,Not captured,Not captured,,,,CARMONA,SEBASTIAN,,02/26/2008,male,Not captured,Not captured,Not captured,Not captured,Not captured,Not captured,Not captured,Not captured,Not captured,Not captured,Not captured,Not captured,Not captured,MAIBY ARANGO,ESPOSA,Not captured,Not captured,Not captured,Not captured,14221 SW 120th ST STE 127,,MIAMI,Florida,33186,3053785210,584147392040,Not captured,Not captured,JOSEAFRANIOCARMONA@HOTMAIL.COM,Not captured,701939342,,Not captured,Not captured,Not captured,Not captured,Not captured,Not captured,
Not captured,Not captured,08/07/2019,Not captured,Not captured,863949,020,00072,ARS-01-0051977,Beacon International,Not captured,Not captured,Not captured,,,,CARMONA,SANTIAGO JOSE,,03/21/2005,male,Not captured,Not captured,Not captured,Not captured,Not captured,Not captured,Not captured,Not captured,Not captured,Not captured,Not captured,Not captured,Not captured,MAIBY ARANGO,ESPOSA,Not captured,Not captured,Not captured,Not captured,14221 SW 120th ST STE 127,,MIAMI,Florida,33186,3053785210,584147392040,Not captured,Not captured,JOSEAFRANIOCARMONA@HOTMAIL.COM,Not captured,701939341,,Not captured,Not captured,Not captured,Not captured,Not captured,Not captured,
Not captured,Not captured,08/07/2019,Not captured,Not captured,863949,020,00072,ARS-01-0051976,Beacon International,Not captured,Not captured,Not captured,,,,ARANGO,MAIBY,,08/15/1975,female,Not captured,Not captured,Not captured,Not captured,Not captured,Not captured,Not captured,Not captured,Not captured,Not captured,Not captured,Not captured,Not captured,MAIBY ARANGO,ESPOSA,Not captured,Not captured,Not captured,Not captured,14221 SW 120th ST STE 127,,MIAMI,Florida,33186,3053785210,584147392040,Not captured,Not captured,JOSEAFRANIOCARMONA@HOTMAIL.COM,Not captured,701939340,,Not captured,Not captured,Not captured,Not captured,Not captured,Not captured,
Not captured,Not captured,08/07/2019,Not captured,Not captured,863949,020,00072,ARS-01-0051975,Beacon International,Not captured,Not captured,Not captured,Passport(118360997),,,CARMONA,JOSE AFRANIO,,10/04/1972,male,Not captured,Not captured,Not captured,Not captured,Not captured,Not captured,Not captured,Not captured,Not captured,Not captured,Not captured,Not captured,Not captured,MAIBY ARANGO,ESPOSA,Not captured,Not captured,Not captured,Not captured,14221 SW 120th ST STE 127,,MIAMI,Florida,33186,3053785210,584147392040,Not captured,Not captured,JOSEAFRANIOCARMONA@HOTMAIL.COM,Not captured,701939339,,Not captured,Not captured,Not captured,Not captured,Not captured,Not captured,
Not captured,Not captured,08/07/2019,Not captured,Not captured,863949,020,00072,OVI-28-0051961,OverseasCare Visitors Insurance Plan,Not captured,Not captured,Not captured,Passport(M9033783),,,Hebbalmath  Umesh,Lavanya,,10/21/1994,female,Not captured,Not captured,Not captured,Not captured,Not captured,Not captured,Not captured,Not captured,Not captured,Not captured,Not captured,Not captured,Not captured,Mahesh Hebbalmath,Uncle,Not captured,Not captured,Not captured,Not captured,43612 Dunhill Cup Sq,,ashburn,Virginia,20147,7034708589,,Not captured,Not captured,mmatt36@hotmail.com,Not captured,701939321,,Not captured,Not captured,Not captured,Not captured,Not captured,Not captured,
Not captured,Not captured,08/07/2019,Not captured,Not captured,863949,020,00072,OVI-28-0051959,OverseasCare Visitors Insurance Plan,Not captured,Not captured,Not captured,Passport(T4542560),,,Hebbalmath,Veena,T4543723,03/05/1973,male,Not captured,Not captured,Not captured,Not captured,Not captured,Not captured,Not captured,Not captured,Not captured,Not captured,Not captured,Not captured,Not captured,Mahesh Hebbalmath,Brother,Not captured,Not captured,Not captured,Not captured,43612 Dunhill Cup Sq,,Ashburn,,20147,7034708589,,Not captured,Not captured,mmatt36@hotmail.com,Not captured,701939319,,Not captured,Not captured,Not captured,Not captured,Not captured,Not captured,
Not captured,Not captured,08/07/2019,Not captured,Not captured,863949,020,00072,OVI-28-0051958,OverseasCare Visitors Insurance Plan,Not captured,Not captured,Not captured,Passport(T4542560),,,Hebbalmath,Umesh,,06/02/1962,male,Not captured,Not captured,Not captured,Not captured,Not captured,Not captured,Not captured,Not captured,Not captured,Not captured,Not captured,Not captured,Not captured,Mahesh Hebbalmath,Brother,Not captured,Not captured,Not captured,Not captured,43612 Dunhill Cup Sq,,Ashburn,,20147,7034708589,,Not captured,Not captured,mmatt36@hotmail.com,Not captured,701939318,,Not captured,Not captured,Not captured,Not captured,Not captured,Not captured,
Not captured,Not captured,08/07/2019,Not captured,Not captured,863949,020,00072,OVI-28-0051902,OverseasCare Visitors Insurance Plan,Not captured,Not captured,Not captured,Passport(R3780615),,,Rangadurai,Lakshmi,,08/15/1956,female,Not captured,Not captured,Not captured,Not captured,Not captured,Not captured,Not captured,Not captured,Not captured,Not captured,Not captured,Not captured,Not captured,Poornima Rangadurai,Daughter,Not captured,Not captured,Not captured,Not captured,5945 Southeast Davis Road,,Hillsboro,Oregon,97123,4132300461,,Not captured,Not captured,icrackbadjokes@gmail.com,Not captured,701939248,,Not captured,Not captured,Not captured,Not captured,Not captured,Not captured,
Not captured,Not captured,08/07/2019,Not captured,Not captured,863949,020,00072,ARS-01-0051898,Beacon International,Not captured,Not captured,Not captured,Passport(084889),,,El Kurdi,Ahmad,i,01/01/1985,male,Not captured,Not captured,Not captured,Not captured,Not captured,Not captured,Not captured,Not captured,Not captured,Not captured,Not captured,Not captured,Not captured,Ibrahim El Kurdi,Father,Not captured,Not captured,Not captured,Not captured,mazraa,,Beirut,Beirut,1105,0096170111945,,Not captured,Not captured,ahmadelk@gmail.com,Not captured,701939244,,Not captured,Not captured,Not captured,Not captured,Not captured,Not captured,
Not captured,Not captured,08/07/2019,Not captured,Not captured,863949,020,00072,ARS-01-0051710,Beacon International,Not captured,Not captured,Not captured,,,,Masson,Lisa,A,10/31/1989,female,Not captured,Not captured,Not captured,Not captured,Not captured,Not captured,Not captured,Not captured,Not captured,Not captured,Not captured,Not captured,Not captured,,,Not captured,Not captured,Not captured,Not captured,1988 Donna Drive,,Laguna Beach,California,92651,,,Not captured,Not captured,pierremasson@mac.com,Not captured,701938885,,Not captured,Not captured,Not captured,Not captured,Not captured,Not captured,
Not captured,Not captured,08/07/2019,Not captured,Not captured,863949,020,00072,ARS-01-0051709,Beacon International,Not captured,Not captured,Not captured,,,,Masson,Pierre,P,11/30/1989,male,Not captured,Not captured,Not captured,Not captured,Not captured,Not captured,Not captured,Not captured,Not captured,Not captured,Not captured,Not captured,Not captured,,,Not captured,Not captured,Not captured,Not captured,1988 Donna Drive,,Laguna Beach,California,92651,,,Not captured,Not captured,pierremasson@mac.com,Not captured,701938884,,Not captured,Not captured,Not captured,Not captured,Not captured,Not captured,
Not captured,Not captured,08/07/2019,Not captured,Not captured,863949,020,00072,ARS-01-0051451,Beacon International,Not captured,Not captured,Not captured,Passport(K0415998),,,WELDESLASIE,TOMAS,TESFALDET,11/11/1998,male,Not captured,Not captured,Not captured,Not captured,Not captured,Not captured,Not captured,Not captured,Not captured,Not captured,Not captured,Not captured,Not captured,,,Not captured,Not captured,Not captured,Not captured,denicapi12@gmail.com,,ASMARA,Central (Maekel),589,5434140785,5434140785,Not captured,Not captured,denicapi12@gmail.com,Not captured,701938335,,Not captured,Not captured,Not captured,Not captured,Not captured,Not captured,
Not captured,Not captured,08/07/2019,Not captured,Not captured,863949,020,00072,ARS-01-0050730,Beacon International,Not captured,Not captured,Not captured,Passport(150270793),,,MERCADO,MABY,M,01/05/1998,female,Not captured,Not captured,Not captured,Not captured,Not captured,Not captured,Not captured,Not captured,Not captured,Not captured,Not captured,Not captured,Not captured,FANNY C PEREZ,MADRE,Not captured,Not captured,Not captured,Not captured,BARRIO EL PARAISO CALLE PRINCIPAL CASA 1-18 LA CONCORDIA SAN CRISTOBAL ESTADO TACHIRA,,SAN CRISTOBAL,Tachira,5001,584247442668,584147113594,Not captured,Not captured,mercadomaby@gmail.com,Not captured,701936685,,Not captured,Not captured,Not captured,Not captured,Not captured,Not captured