EE Transaction Type,Dependent Transaction Type,Effective Date,EE Signature,EE Signature Date,Control,Suffix,Account,Plan Number,Plan Name,Claim Office,Network ID Number,Customer Code,EE SSN,Dependent SSN,Dependent Relationship,Last Name,First Name,Middle Initial,DOB,Gender,Ethnicity,PCP/PCD,PCP/PCD Current Patient,Provider Cap Office Number,COB,Dep Student Indicator,Dep OOA Indicator,EE Prior Coverage Indicator,EE Late Entrant,EE Language Indicator,Hire Date,Earnings,Earnings Frequency,Beneficiary (Last Name First Name MI),Beneficiary Relationship,Continuation of Coverage Expiration Date,Continuation of Coverage Event Date,Continuation of Coverage Length of Coverage,Work Location Zip Code,Street Address Line 1,Street Address Line 2,City,State,Zip Code,Home Phone Number,Work Phone Number,Accept Code,Evidence Code,EE Email Address,Communication Disability Code,EE Alternate ID,Dep Alternate ID,Old Control,Old Suffix,Old Account,New Control,New Suffix,New Account,
Not captured,Not captured,08/06/2019,Not captured,Not captured,863949,020,00072,ARS-01-0051973,Beacon International,Not captured,Not captured,Not captured,,,,Clark,Sam,J,09/03/1993,male,Not captured,Not captured,Not captured,Not captured,Not captured,Not captured,Not captured,Not captured,Not captured,Not captured,Not captured,Not captured,Not captured,,,Not captured,Not captured,Not captured,Not captured,129B Grizzly Street,,Banff,Alberta,T1L1A8,,,Not captured,Not captured,sjclark1993@gmail.com,Not captured,701939336,,Not captured,Not captured,Not captured,Not captured,Not captured,Not captured,
Not captured,Not captured,08/06/2019,Not captured,Not captured,863949,020,00072,ARS-01-0051972,Beacon International,Not captured,Not captured,Not captured,,,,MIELE,GINA,L,01/17/2002,female,Not captured,Not captured,Not captured,Not captured,Not captured,Not captured,Not captured,Not captured,Not captured,Not captured,Not captured,Not captured,Not captured,,,Not captured,Not captured,Not captured,Not captured,109 Dalview Drive,,Forney,Texas,75126,,,Not captured,Not captured,FMIELE@PEGASUSLECTURES.COM,Not captured,701939335,,Not captured,Not captured,Not captured,Not captured,Not captured,Not captured,
Not captured,Not captured,08/06/2019,Not captured,Not captured,863949,020,00072,ARS-01-0051971,Beacon International,Not captured,Not captured,Not captured,,,,Miele,Carol,G,08/05/1959,female,Not captured,Not captured,Not captured,Not captured,Not captured,Not captured,Not captured,Not captured,Not captured,Not captured,Not captured,Not captured,Not captured,,,Not captured,Not captured,Not captured,Not captured,109 Dalview Drive,,Forney,Texas,75126,,,Not captured,Not captured,FMIELE@PEGASUSLECTURES.COM,Not captured,701939334,,Not captured,Not captured,Not captured,Not captured,Not captured,Not captured,
Not captured,Not captured,08/06/2019,Not captured,Not captured,863949,020,00072,ARS-01-0051970,Beacon International,Not captured,Not captured,Not captured,,,,Miele,Frank,R,02/09/1965,male,Not captured,Not captured,Not captured,Not captured,Not captured,Not captured,Not captured,Not captured,Not captured,Not captured,Not captured,Not captured,Not captured,,,Not captured,Not captured,Not captured,Not captured,109 Dalview Drive,,Forney,Texas,75126,,,Not captured,Not captured,FMIELE@PEGASUSLECTURES.COM,Not captured,701939333,,Not captured,Not captured,Not captured,Not captured,Not captured,Not captured,
Not captured,Not captured,08/06/2019,Not captured,Not captured,863949,020,00072,ARS-01-0051966,Beacon International,Not captured,Not captured,Not captured,,,,Clark,Sam,J,09/03/1993,male,Not captured,Not captured,Not captured,Not captured,Not captured,Not captured,Not captured,Not captured,Not captured,Not captured,Not captured,Not captured,Not captured,,,Not captured,Not captured,Not captured,Not captured,129B grizzly street,,Banff,Alberta,T1L1A8,,,Not captured,Not captured,sjclark1993@gmail.com,Not captured,701939329,,Not captured,Not captured,Not captured,Not captured,Not captured,Not captured,
Not captured,Not captured,08/06/2019,Not captured,Not captured,863949,020,00072,ARS-02-0051965,Beacon America,Not captured,Not captured,Not captured,,,,Vlouhos Apostolis,Efmorfia,,07/04/1959,female,Not captured,Not captured,Not captured,Not captured,Not captured,Not captured,Not captured,Not captured,Not captured,Not captured,Not captured,Not captured,Not captured,,,Not captured,Not captured,Not captured,Not captured,7761 N. Via Del Sendero,,Scottsdale,Arizona,85258,,,Not captured,Not captured,morfia7@gmail.com,Not captured,701939328,,Not captured,Not captured,Not captured,Not captured,Not captured,Not captured,
Not captured,Not captured,08/06/2019,Not captured,Not captured,863949,020,00072,ARS-01-0051963,Beacon International,Not captured,Not captured,Not captured,,,,Munoz,Elias,M,04/30/1980,male,Not captured,Not captured,Not captured,Not captured,Not captured,Not captured,Not captured,Not captured,Not captured,Not captured,Not captured,Not captured,Not captured,Elias M Munoz,Father,Not captured,Not captured,Not captured,Not captured,1107 NW 125Th Path,,Miami,Florida,33182,7869301690,,Not captured,Not captured,eliahwood@gmail.com,Not captured,701939323,,Not captured,Not captured,Not captured,Not captured,Not captured,Not captured,
Not captured,Not captured,08/06/2019,Not captured,Not captured,863949,020,00072,ARS-01-0051962,Beacon International,Not captured,Not captured,Not captured,,,,Tran,Phuong,,03/01/1983,female,Not captured,Not captured,Not captured,Not captured,Not captured,Not captured,Not captured,Not captured,Not captured,Not captured,Not captured,Not captured,Not captured,,,Not captured,Not captured,Not captured,Not captured,90t saigon pearl,,Hi chi minh,,Phuong 22,,,Not captured,Not captured,stuart@propertyfinder.ae,Not captured,701939322,,Not captured,Not captured,Not captured,Not captured,Not captured,Not captured,
Not captured,Not captured,08/06/2019,Not captured,Not captured,863949,020,00072,ARS-01-0051953,Beacon International,Not captured,Not captured,Not captured,,,,Link,Chloe,,03/11/2011,female,Not captured,Not captured,Not captured,Not captured,Not captured,Not captured,Not captured,Not captured,Not captured,Not captured,Not captured,Not captured,Not captured,,,Not captured,Not captured,Not captured,Not captured,2717 Little John,,Austin,Texas,78704,,,Not captured,Not captured,cbharnden@gmail.com,Not captured,701939313,,Not captured,Not captured,Not captured,Not captured,Not captured,Not captured,
Not captured,Not captured,08/06/2019,Not captured,Not captured,863949,020,00072,ARS-01-0051952,Beacon International,Not captured,Not captured,Not captured,,,,Link,Barry,,08/05/1965,male,Not captured,Not captured,Not captured,Not captured,Not captured,Not captured,Not captured,Not captured,Not captured,Not captured,Not captured,Not captured,Not captured,,,Not captured,Not captured,Not captured,Not captured,2717 Little John,,Austin,Texas,78704,,,Not captured,Not captured,cbharnden@gmail.com,Not captured,701939312,,Not captured,Not captured,Not captured,Not captured,Not captured,Not captured,
Not captured,Not captured,08/06/2019,Not captured,Not captured,863949,020,00072,ARS-01-0051951,Beacon International,Not captured,Not captured,Not captured,,,,Link,Courtney,,11/25/1973,female,Not captured,Not captured,Not captured,Not captured,Not captured,Not captured,Not captured,Not captured,Not captured,Not captured,Not captured,Not captured,Not captured,,,Not captured,Not captured,Not captured,Not captured,2717 Little John,,Austin,Texas,78704,,,Not captured,Not captured,cbharnden@gmail.com,Not captured,701939311,,Not captured,Not captured,Not captured,Not captured,Not captured,Not captured,
Not captured,Not captured,08/06/2019,Not captured,Not captured,863949,020,00072,ARS-01-0051950,Beacon International,Not captured,Not captured,Not captured,,,,Pruzensky,Binyomin,,05/19/2001,male,Not captured,Not captured,Not captured,Not captured,Not captured,Not captured,Not captured,Not captured,Not captured,Not captured,Not captured,Not captured,Not captured,,,Not captured,Not captured,Not captured,Not captured,960 County Line rd,,Lakewood,New Jersey,08701,732-771-4353,,Not captured,Not captured,aronpruz@gmail.com,Not captured,701939310,,Not captured,Not captured,Not captured,Not captured,Not captured,Not captured,
Not captured,Not captured,08/06/2019,Not captured,Not captured,863949,020,00072,ARS-01-0051949,Beacon International,Not captured,Not captured,Not captured,,,,Pruzensky,Aron,,04/08/1972,male,Not captured,Not captured,Not captured,Not captured,Not captured,Not captured,Not captured,Not captured,Not captured,Not captured,Not captured,Not captured,Not captured,,,Not captured,Not captured,Not captured,Not captured,960 County Line rd,,Lakewood,New Jersey,08701,732-771-4353,,Not captured,Not captured,aronpruz@gmail.com,Not captured,701939309,,Not captured,Not captured,Not captured,Not captured,Not captured,Not captured,
Not captured,Not captured,08/06/2019,Not captured,Not captured,863949,020,00072,ARS-01-0051948,Beacon International,Not captured,Not captured,Not captured,,,,Hornig,Avrohom C,,01/30/2003,male,Not captured,Not captured,Not captured,Not captured,Not captured,Not captured,Not captured,Not captured,Not captured,Not captured,Not captured,Not captured,Not captured,,,Not captured,Not captured,Not captured,Not captured,9 Grossmere Street,,Lakewood,New Jersey,08701,732-330-7039,,Not captured,Not captured,mhornig3@gmail.com,Not captured,701939308,,Not captured,Not captured,Not captured,Not captured,Not captured,Not captured,
Not captured,Not captured,08/06/2019,Not captured,Not captured,863949,020,00072,ARS-01-0051947,Beacon International,Not captured,Not captured,Not captured,,,,Hornig,Tzvi,,01/05/2000,male,Not captured,Not captured,Not captured,Not captured,Not captured,Not captured,Not captured,Not captured,Not captured,Not captured,Not captured,Not captured,Not captured,,,Not captured,Not captured,Not captured,Not captured,9 Grossmere Street,,Lakewood,New Jersey,08701,732-330-7039,,Not captured,Not captured,mhornig3@gmail.com,Not captured,701939307,,Not captured,Not captured,Not captured,Not captured,Not captured,Not captured,
Not captured,Not captured,08/06/2019,Not captured,Not captured,863949,020,00072,ARS-01-0051945,Beacon International,Not captured,Not captured,Not captured,,,,Lothian,Jordan,J,01/19/1993,male,Not captured,Not captured,Not captured,Not captured,Not captured,Not captured,Not captured,Not captured,Not captured,Not captured,Not captured,Not captured,Not captured,,,Not captured,Not captured,Not captured,Not captured,129B Grizzly Street,,Banff,Alberta,T1L1A8,,,Not captured,Not captured,jordan_hfc@hotmail.com,Not captured,701939302,,Not captured,Not captured,Not captured,Not captured,Not captured,Not captured,
Not captured,Not captured,08/06/2019,Not captured,Not captured,863949,020,00072,ARS-03-0051803,Essential America,Not captured,Not captured,Not captured,SSN(426750173),,,Rodgers,Katherine,Elizabeth,12/06/1992,female,Not captured,Not captured,Not captured,Not captured,Not captured,Not captured,Not captured,Not captured,Not captured,Not captured,Not captured,Not captured,Not captured,,,Not captured,Not captured,Not captured,Not captured,120 Rhodes Lane,,Canton,Mississippi,39046,6626452478,,Not captured,Not captured,katherinerodgers3@gmail.com,Not captured,701939090,,Not captured,Not captured,Not captured,Not captured,Not captured,Not captured,
Not captured,Not captured,08/06/2019,Not captured,Not captured,863949,020,00072,ARS-01-0051943,Beacon International,Not captured,Not captured,Not captured,,,,Julien,Anna,M,11/26/2014,female,Not captured,Not captured,Not captured,Not captured,Not captured,Not captured,Not captured,Not captured,Not captured,Not captured,Not captured,Not captured,Not captured,,,Not captured,Not captured,Not captured,Not captured,868 Carol Rd,,Bowling Green,Ohio,43402,,,Not captured,Not captured,jayson.julien@gmail.com,Not captured,701939300,,Not captured,Not captured,Not captured,Not captured,Not captured,Not captured,
Not captured,Not captured,08/06/2019,Not captured,Not captured,863949,020,00072,ARS-01-0051942,Beacon International,Not captured,Not captured,Not captured,,,,Bessmeltseva,Maria,S,06/18/1983,female,Not captured,Not captured,Not captured,Not captured,Not captured,Not captured,Not captured,Not captured,Not captured,Not captured,Not captured,Not captured,Not captured,,,Not captured,Not captured,Not captured,Not captured,868 Carol Rd,,Bowling Green,Ohio,43402,,,Not captured,Not captured,jayson.julien@gmail.com,Not captured,701939299,,Not captured,Not captured,Not captured,Not captured,Not captured,Not captured,
Not captured,Not captured,08/06/2019,Not captured,Not captured,863949,020,00072,ARS-01-0051940,Beacon International,Not captured,Not captured,Not captured,,,,Bernardo,Rynier Mark,,08/27/1991,male,Not captured,Not captured,Not captured,Not captured,Not captured,Not captured,Not captured,Not captured,Not captured,Not captured,Not captured,Not captured,Not captured,,,Not captured,Not captured,Not captured,Not captured,Room 705 Royals Parks,,Tokyo,,206-0824,,,Not captured,Not captured,helenedj@webmail.co.za,Not captured,701939297,,Not captured,Not captured,Not captured,Not captured,Not captured,Not captured,
Not captured,Not captured,08/06/2019,Not captured,Not captured,863949,020,00072,ARS-01-0051939,Beacon International,Not captured,Not captured,Not captured,,,,Bernardo,Helene,,04/12/1992,female,Not captured,Not captured,Not captured,Not captured,Not captured,Not captured,Not captured,Not captured,Not captured,Not captured,Not captured,Not captured,Not captured,,,Not captured,Not captured,Not captured,Not captured,Room 705 Royals Parks,,Tokyo,,206-0824,,,Not captured,Not captured,helenedj@webmail.co.za,Not captured,701939296,,Not captured,Not captured,Not captured,Not captured,Not captured,Not captured,
Not captured,Not captured,08/05/2019,Not captured,Not captured,863949,020,00072,ARS-02-0051928,Beacon America,Not captured,Not captured,Not captured,Passport(BR0830374),,,BASHER,IRFANUL,,11/01/1989,male,Not captured,Not captured,Not captured,Not captured,Not captured,Not captured,Not captured,Not captured,Not captured,Not captured,Not captured,Not captured,Not captured,korobi basher,sister,Not captured,Not captured,Not captured,Not captured,2074 HICKORY LEAF DR,,ROCHESTER HILLS,Michigan,48309,3135051445,,Not captured,Not captured,korobi_basher03@yahoo.com,Not captured,701939285,,Not captured,Not captured,Not captured,Not captured,Not captured,Not captured,
Not captured,Not captured,08/05/2019,Not captured,Not captured,863949,020,00072,ARS-03-0051871,Essential America,Not captured,Not captured,Not captured,Passport(EA3313179),,,Wang,Xuanyi,,07/16/2005,male,Not captured,Not captured,Not captured,Not captured,Not captured,Not captured,Not captured,Not captured,Not captured,Not captured,Not captured,Not captured,Not captured,,,Not captured,Not captured,Not captured,Not captured,5500 Wake Academy Dr,,raleigh,North Carolina,27603,8036995079,,Not captured,Not captured,xbhuang4@gmail.com,Not captured,701939209,,Not captured,Not captured,Not captured,Not captured,Not captured,Not captured,
Not captured,Not captured,08/05/2019,Not captured,Not captured,863949,020,00072,ARS-03-0051872,Essential America,Not captured,Not captured,Not captured,Passport(E91908508),,,Bao,Xifei,,12/27/2004,female,Not captured,Not captured,Not captured,Not captured,Not captured,Not captured,Not captured,Not captured,Not captured,Not captured,Not captured,Not captured,Not captured,,,Not captured,Not captured,Not captured,Not captured,5500 Wake Academy Dr,,raleigh,North Carolina,27603,8036995079,,Not captured,Not captured,xbhuang4@gmail.com,Not captured,701939210,,Not captured,Not captured,Not captured,Not captured,Not captured,Not captured,
Not captured,Not captured,08/05/2019,Not captured,Not captured,863949,020,00072,ARS-03-0051873,Essential America,Not captured,Not captured,Not captured,Passport(EA2232783),,,He,Yuling,,03/11/2005,female,Not captured,Not captured,Not captured,Not captured,Not captured,Not captured,Not captured,Not captured,Not captured,Not captured,Not captured,Not captured,Not captured,,,Not captured,Not captured,Not captured,Not captured,304 Black Walnut Drive ,,Lexington,South Carolina,29072,803-261-9434 ,,Not captured,Not captured,xbhuang4@gmail.com,Not captured,701939211,,Not captured,Not captured,Not captured,Not captured,Not captured,Not captured,
Not captured,Not captured,08/06/2019,Not captured,Not captured,863949,020,00072,ARS-02-0051914,Beacon America,Not captured,Not captured,Not captured,,,,Thau,Shulamis,,11/19/1996,female,Not captured,Not captured,Not captured,Not captured,Not captured,Not captured,Not captured,Not captured,Not captured,Not captured,Not captured,Not captured,Not captured,,,Not captured,Not captured,Not captured,Not captured,2150Howard Ave,,Passaic,New Jersey,07022,862-668-8551,,Not captured,Not captured,shulamisschulman@gmail.com,Not captured,701939261,,Not captured,Not captured,Not captured,Not captured,Not captured,Not captured,
Not captured,Not captured,08/05/2019,Not captured,Not captured,863949,020,00072,ARS-01-0051907,Beacon International,Not captured,Not captured,Not captured,,,,Szwaja,Jurand,,11/22/1988,male,Not captured,Not captured,Not captured,Not captured,Not captured,Not captured,Not captured,Not captured,Not captured,Not captured,Not captured,Not captured,Not captured,,,Not captured,Not captured,Not captured,Not captured,7509 Pecos st,,Denver,Colorado,80221,,,Not captured,Not captured,jurandszw@gmail.com,Not captured,701939253,,Not captured,Not captured,Not captured,Not captured,Not captured,Not captured,
Not captured,Not captured,08/04/2019,Not captured,Not captured,863949,020,00072,ARS-01-0051904,Beacon International,Not captured,Not captured,Not captured,,,,Von Sacken,Enrica,,11/28/1980,female,Not captured,Not captured,Not captured,Not captured,Not captured,Not captured,Not captured,Not captured,Not captured,Not captured,Not captured,Not captured,Not captured,,,Not captured,Not captured,Not captured,Not captured,7549 Stonebrook pkwy,,Frisco,Texas,75034,,,Not captured,Not captured,vonsacken@gmail.com,Not captured,701939250,,Not captured,Not captured,Not captured,Not captured,Not captured,Not captured,
Not captured,Not captured,08/04/2019,Not captured,Not captured,863949,020,00072,ARS-01-0051903,Beacon International,Not captured,Not captured,Not captured,,,,Von Sacken,Nathanael,,02/23/1980,male,Not captured,Not captured,Not captured,Not captured,Not captured,Not captured,Not captured,Not captured,Not captured,Not captured,Not captured,Not captured,Not captured,,,Not captured,Not captured,Not captured,Not captured,7549 Stonebrook pkwy,,Frisco,Texas,75034,,,Not captured,Not captured,vonsacken@gmail.com,Not captured,701939249,,Not captured,Not captured,Not captured,Not captured,Not captured,Not captured,
Not captured,Not captured,08/04/2019,Not captured,Not captured,863949,020,00072,ARS-02-0051901,Beacon America,Not captured,Not captured,Not captured,,,,Austin-Crawford,Darcy,M,02/27/2011,female,Not captured,Not captured,Not captured,Not captured,Not captured,Not captured,Not captured,Not captured,Not captured,Not captured,Not captured,Not captured,Not captured,,,Not captured,Not captured,Not captured,Not captured,P.O. Box 964,,Georgetown,,KY1-1503,,,Not captured,Not captured,bpa11@hotmail.com,Not captured,701939247,,Not captured,Not captured,Not captured,Not captured,Not captured,Not captured,
Not captured,Not captured,08/04/2019,Not captured,Not captured,863949,020,00072,ARS-02-0051900,Beacon America,Not captured,Not captured,Not captured,,,,Crawford,Allegra,M,10/30/1986,female,Not captured,Not captured,Not captured,Not captured,Not captured,Not captured,Not captured,Not captured,Not captured,Not captured,Not captured,Not captured,Not captured,,,Not captured,Not captured,Not captured,Not captured,P.O. Box 964,,Georgetown,,KY1-1503,,,Not captured,Not captured,bpa11@hotmail.com,Not captured,701939246,,Not captured,Not captured,Not captured,Not captured,Not captured,Not captured,
Not captured,Not captured,08/04/2019,Not captured,Not captured,863949,020,00072,ARS-02-0051899,Beacon America,Not captured,Not captured,Not captured,,,,Austin,Benjamin,P,08/14/1981,male,Not captured,Not captured,Not captured,Not captured,Not captured,Not captured,Not captured,Not captured,Not captured,Not captured,Not captured,Not captured,Not captured,,,Not captured,Not captured,Not captured,Not captured,P.O. Box 964,,Georgetown,,KY1-1503,,,Not captured,Not captured,bpa11@hotmail.com,Not captured,701939245,,Not captured,Not captured,Not captured,Not captured,Not captured,Not captured,
Not captured,Not captured,08/04/2019,Not captured,Not captured,863949,020,00072,ARS-02-0051897,Beacon America,Not captured,Not captured,Not captured,,,,Tomyn,Jacob,M,10/20/2000,male,Not captured,Not captured,Not captured,Not captured,Not captured,Not captured,Not captured,Not captured,Not captured,Not captured,Not captured,Not captured,Not captured,,,Not captured,Not captured,Not captured,Not captured,19507 67th St E,,Bonney lake,Washington,98391,,,Not captured,Not captured,oneheffer13@hotmail.com,Not captured,701939243,,Not captured,Not captured,Not captured,Not captured,Not captured,Not captured,
Not captured,Not captured,08/04/2019,Not captured,Not captured,863949,020,00072,ARS-02-0051896,Beacon America,Not captured,Not captured,Not captured,,,,Tomyn,Melissa,E,10/13/1969,female,Not captured,Not captured,Not captured,Not captured,Not captured,Not captured,Not captured,Not captured,Not captured,Not captured,Not captured,Not captured,Not captured,,,Not captured,Not captured,Not captured,Not captured,19507 67th St E,,Bonney lake,Washington,98391,,,Not captured,Not captured,oneheffer13@hotmail.com,Not captured,701939242,,Not captured,Not captured,Not captured,Not captured,Not captured,Not captured,
Not captured,Not captured,08/04/2019,Not captured,Not captured,863949,020,00072,ARS-01-0051895,Beacon International,Not captured,Not captured,Not captured,,,,Coniglio,susan,E,08/16/1992,female,Not captured,Not captured,Not captured,Not captured,Not captured,Not captured,Not captured,Not captured,Not captured,Not captured,Not captured,Not captured,Not captured,,,Not captured,Not captured,Not captured,Not captured,537 N. Orlando Ave,,Los Angeles,California,90048,,,Not captured,Not captured,vconig@gmail.com,Not captured,701939241,,Not captured,Not captured,Not captured,Not captured,Not captured,Not captured,
Not captured,Not captured,08/04/2019,Not captured,Not captured,863949,020,00072,ARS-01-0051894,Beacon International,Not captured,Not captured,Not captured,,,,Farias Velasco,Guillermo,,09/09/1988,male,Not captured,Not captured,Not captured,Not captured,Not captured,Not captured,Not captured,Not captured,Not captured,Not captured,Not captured,Not captured,Not captured,,,Not captured,Not captured,Not captured,Not captured,45 Sutton Place South,,NY,New York,10022,,,Not captured,Not captured,guillermofv@gmail.com,Not captured,701939240,,Not captured,Not captured,Not captured,Not captured,Not captured,Not captured,
Not captured,Not captured,08/04/2019,Not captured,Not captured,863949,020,00072,ARS-01-0051893,Beacon International,Not captured,Not captured,Not captured,,,,La Londe,Priya,G,08/21/1981,female,Not captured,Not captured,Not captured,Not captured,Not captured,Not captured,Not captured,Not captured,Not captured,Not captured,Not captured,Not captured,Not captured,,,Not captured,Not captured,Not captured,Not captured,The Univeristy of Hong Kong,,Hong Kong,,10000,,,Not captured,Not captured,rlalonde08@gmail.com,Not captured,701939239,,Not captured,Not captured,Not captured,Not captured,Not captured,Not captured,