EE Transaction Type,Dependent Transaction Type,Effective Date,EE Signature,EE Signature Date,Control,Suffix,Account,Plan Number,Plan Name,Claim Office,Network ID Number,Customer Code,EE SSN,Dependent SSN,Dependent Relationship,Last Name,First Name,Middle Initial,DOB,Gender,Ethnicity,PCP/PCD,PCP/PCD Current Patient,Provider Cap Office Number,COB,Dep Student Indicator,Dep OOA Indicator,EE Prior Coverage Indicator,EE Late Entrant,EE Language Indicator,Hire Date,Earnings,Earnings Frequency,Beneficiary (Last Name First Name MI),Beneficiary Relationship,Continuation of Coverage Expiration Date,Continuation of Coverage Event Date,Continuation of Coverage Length of Coverage,Work Location Zip Code,Street Address Line 1,Street Address Line 2,City,State,Zip Code,Home Phone Number,Work Phone Number,Accept Code,Evidence Code,EE Email Address,Communication Disability Code,EE Alternate ID,Dep Alternate ID,Old Control,Old Suffix,Old Account,New Control,New Suffix,New Account,
Not captured,Not captured,08/03/2019,Not captured,Not captured,863949,020,00072,ARS-01-0051891,Beacon International,Not captured,Not captured,Not captured,,,,Uppenbrink,Luke,,11/23/2004,male,Not captured,Not captured,Not captured,Not captured,Not captured,Not captured,Not captured,Not captured,Not captured,Not captured,Not captured,Not captured,Not captured,,,Not captured,Not captured,Not captured,Not captured,241 Hungry Hollow Rd,,Chestnut Ridge,New York,10977,,,Not captured,Not captured,ELIZUPP@GMAIL.COM,Not captured,701939232,,Not captured,Not captured,Not captured,Not captured,Not captured,Not captured,
Not captured,Not captured,08/03/2019,Not captured,Not captured,863949,020,00072,ARS-01-0051890,Beacon International,Not captured,Not captured,Not captured,,,,Uppenbrink,Clare,M,02/28/2001,female,Not captured,Not captured,Not captured,Not captured,Not captured,Not captured,Not captured,Not captured,Not captured,Not captured,Not captured,Not captured,Not captured,,,Not captured,Not captured,Not captured,Not captured,241 Hungry Hollow Rd,,Chestnut Ridge,New York,10977,,,Not captured,Not captured,ELIZUPP@GMAIL.COM,Not captured,701939231,,Not captured,Not captured,Not captured,Not captured,Not captured,Not captured,
Not captured,Not captured,08/03/2019,Not captured,Not captured,863949,020,00072,ARS-01-0051889,Beacon International,Not captured,Not captured,Not captured,,,,Uppenbrink,Elizabeth,,12/07/1972,female,Not captured,Not captured,Not captured,Not captured,Not captured,Not captured,Not captured,Not captured,Not captured,Not captured,Not captured,Not captured,Not captured,,,Not captured,Not captured,Not captured,Not captured,241 Hungry Hollow Rd,,Chestnut Ridge,New York,10977,,,Not captured,Not captured,ELIZUPP@GMAIL.COM,Not captured,701939230,,Not captured,Not captured,Not captured,Not captured,Not captured,Not captured,
Not captured,Not captured,08/03/2019,Not captured,Not captured,863949,020,00072,ARS-01-0051888,Beacon International,Not captured,Not captured,Not captured,,,,Uppenbrink,Matt,,04/03/1968,male,Not captured,Not captured,Not captured,Not captured,Not captured,Not captured,Not captured,Not captured,Not captured,Not captured,Not captured,Not captured,Not captured,,,Not captured,Not captured,Not captured,Not captured,241 Hungry Hollow Rd,,Chestnut Ridge,New York,10977,,,Not captured,Not captured,ELIZUPP@GMAIL.COM,Not captured,701939229,,Not captured,Not captured,Not captured,Not captured,Not captured,Not captured,
Not captured,Not captured,08/03/2019,Not captured,Not captured,863949,020,00072,OVI-28-0051887,OverseasCare Visitors Insurance Plan,Not captured,Not captured,Not captured,Passport(P6022570A),,,Macalino,Clara,M,08/18/1939,female,Not captured,Not captured,Not captured,Not captured,Not captured,Not captured,Not captured,Not captured,Not captured,Not captured,Not captured,Not captured,Not captured,Maria Vilma Sanqui,Daughter,Not captured,Not captured,Not captured,Not captured,362 Camp Rock Rd,,Boone,North Carolina,28607,8282638744,8288326221,Not captured,Not captured,jatsanqui@yahoo.com,Not captured,701939228,,Not captured,Not captured,Not captured,Not captured,Not captured,Not captured,
Not captured,Not captured,08/03/2019,Not captured,Not captured,863949,020,00072,ARS-02-0051885,Beacon America,Not captured,Not captured,Not captured,,,,Jefferies,Tauehe,,08/25/1989,male,Not captured,Not captured,Not captured,Not captured,Not captured,Not captured,Not captured,Not captured,Not captured,Not captured,Not captured,Not captured,Not captured,,,Not captured,Not captured,Not captured,Not captured,445 Marie Place,,North Vancouver,British Columbia,V7J 3P6,,,Not captured,Not captured,tauehej@hotmail.com,Not captured,701939223,,Not captured,Not captured,Not captured,Not captured,Not captured,Not captured,
Not captured,Not captured,08/03/2019,Not captured,Not captured,863949,020,00072,ARS-02-0051884,Beacon America,Not captured,Not captured,Not captured,,,,Curran,Adam,J,08/05/1986,male,Not captured,Not captured,Not captured,Not captured,Not captured,Not captured,Not captured,Not captured,Not captured,Not captured,Not captured,Not captured,Not captured,,,Not captured,Not captured,Not captured,Not captured,235 W 63rd St,,New York,New York,10023,,,Not captured,Not captured,adamcurran@outlook.com,Not captured,701939222,,Not captured,Not captured,Not captured,Not captured,Not captured,Not captured,
Not captured,Not captured,08/03/2019,Not captured,Not captured,863949,020,00072,ARS-01-0051883,Beacon International,Not captured,Not captured,Not captured,,,,Cao,Trang Minh Tu,,01/01/1980,male,Not captured,Not captured,Not captured,Not captured,Not captured,Not captured,Not captured,Not captured,Not captured,Not captured,Not captured,Not captured,Not captured,,,Not captured,Not captured,Not captured,Not captured,6595 Fleming Street,,Vancouver,British Columbia,V5P 3H3,,,Not captured,Not captured,tucaotrang@gmail.com,Not captured,701939221,,Not captured,Not captured,Not captured,Not captured,Not captured,Not captured,
Not captured,Not captured,08/02/2019,Not captured,Not captured,863949,020,00072,ARS-02-0051870,Beacon America,Not captured,Not captured,Not captured,,,,Nyvold,Megan,,11/25/1997,female,Not captured,Not captured,Not captured,Not captured,Not captured,Not captured,Not captured,Not captured,Not captured,Not captured,Not captured,Not captured,Not captured,,,Not captured,Not captured,Not captured,Not captured,6500 West Mansfield Avenue Unit 29,,Denver,Colorado,80235,,,Not captured,Not captured,kmbutler@me.com,Not captured,701939208,,Not captured,Not captured,Not captured,Not captured,Not captured,Not captured,
Not captured,Not captured,08/02/2019,Not captured,Not captured,863949,020,00072,ARS-01-0051869,Beacon International,Not captured,Not captured,Not captured,,,,Motherway,Brigid,,02/05/1940,female,Not captured,Not captured,Not captured,Not captured,Not captured,Not captured,Not captured,Not captured,Not captured,Not captured,Not captured,Not captured,Not captured,,,Not captured,Not captured,Not captured,Not captured,132 Spruce St,,Massapequa Park,New York,11762,,,Not captured,Not captured,pmotherway@hotmail.com,Not captured,701939207,,Not captured,Not captured,Not captured,Not captured,Not captured,Not captured,
Not captured,Not captured,08/02/2019,Not captured,Not captured,863949,020,00072,ARS-01-0051864,Beacon International,Not captured,Not captured,Not captured,,,,Owens,Anastasia,,04/21/1989,female,Not captured,Not captured,Not captured,Not captured,Not captured,Not captured,Not captured,Not captured,Not captured,Not captured,Not captured,Not captured,Not captured,,,Not captured,Not captured,Not captured,Not captured,393 N St SW,,Washington,Dist. of Columbia,20024,,,Not captured,Not captured,katiegentsch@gmail.com,Not captured,701939198,,Not captured,Not captured,Not captured,Not captured,Not captured,Not captured,
Not captured,Not captured,08/02/2019,Not captured,Not captured,863949,020,00072,ARS-01-0051863,Beacon International,Not captured,Not captured,Not captured,,,,Gentsch,Katherine,L,09/29/1991,female,Not captured,Not captured,Not captured,Not captured,Not captured,Not captured,Not captured,Not captured,Not captured,Not captured,Not captured,Not captured,Not captured,,,Not captured,Not captured,Not captured,Not captured,393 N St SW,,Washington,Dist. of Columbia,20024,,,Not captured,Not captured,katiegentsch@gmail.com,Not captured,701939197,,Not captured,Not captured,Not captured,Not captured,Not captured,Not captured,
Not captured,Not captured,08/03/2019,Not captured,Not captured,863949,020,00072,ARS-04-0051854,Enhanced America,Not captured,Not captured,Not captured,Passport(UN592501),,,Veesapogu,Soumya ,,05/25/1984,female,Not captured,Not captured,Not captured,Not captured,Not captured,Not captured,Not captured,Not captured,Not captured,Not captured,Not captured,Not captured,Not captured,,,Not captured,Not captured,Not captured,Not captured,14-60-11 Morrispent,,Guntur,Andhra Pradesh,522202,8479097452,,Not captured,Not captured,sundar8005@gmail.com,Not captured,701939147,,Not captured,Not captured,Not captured,Not captured,Not captured,Not captured,
Not captured,Not captured,08/03/2019,Not captured,Not captured,863949,020,00072,ARS-04-0051854,Enhanced America,Not captured,Not captured,Not captured,,Passport(UN461195),Spouse,Manikonda,Ram Sundar,,06/02/1972,male,Not captured,Not captured,Not captured,Not captured,Not captured,Not captured,Not captured,Not captured,Not captured,Not captured,Not captured,Not captured,Not captured,,,Not captured,Not captured,Not captured,Not captured,14-60-11 Morrispent,,Guntur,Andhra Pradesh,522202,8479097452,,Not captured,Not captured,sundar8005@gmail.com,Not captured,,701939148,Not captured,Not captured,Not captured,Not captured,Not captured,Not captured,
Not captured,Not captured,08/03/2019,Not captured,Not captured,863949,020,00072,ARS-04-0051854,Enhanced America,Not captured,Not captured,Not captured,,Passport(T5175621),Dependant,Manokonda,Danev Srujan,,08/29/2008,male,Not captured,Not captured,Not captured,Not captured,Not captured,Not captured,Not captured,Not captured,Not captured,Not captured,Not captured,Not captured,Not captured,,,Not captured,Not captured,Not captured,Not captured,14-60-11 Morrispent,,Guntur,Andhra Pradesh,522202,8479097452,,Not captured,Not captured,sundar8005@gmail.com,Not captured,,701939149,Not captured,Not captured,Not captured,Not captured,Not captured,Not captured,
Not captured,Not captured,08/03/2019,Not captured,Not captured,863949,020,00072,ARS-04-0051854,Enhanced America,Not captured,Not captured,Not captured,,Passport(57315467),Dependant,Manikonda,Emmanuel,,10/11/2017,male,Not captured,Not captured,Not captured,Not captured,Not captured,Not captured,Not captured,Not captured,Not captured,Not captured,Not captured,Not captured,Not captured,,,Not captured,Not captured,Not captured,Not captured,14-60-11 Morrispent,,Guntur,Andhra Pradesh,522202,8479097452,,Not captured,Not captured,sundar8005@gmail.com,Not captured,,701939150,Not captured,Not captured,Not captured,Not captured,Not captured,Not captured,
Not captured,Not captured,08/02/2019,Not captured,Not captured,863949,020,00072,ARS-01-0051856,Beacon International,Not captured,Not captured,Not captured,,,,DENIS,SAKINA,,08/31/1971,female,Not captured,Not captured,Not captured,Not captured,Not captured,Not captured,Not captured,Not captured,Not captured,Not captured,Not captured,Not captured,Not captured,,,Not captured,Not captured,Not captured,Not captured,1900 Chapman Avenue Apt 221,,Rockville,Maryland,20852,,,Not captured,Not captured,sak.a.denis@gmail.com,Not captured,701939152,,Not captured,Not captured,Not captured,Not captured,Not captured,Not captured,
Not captured,Not captured,08/02/2019,Not captured,Not captured,863949,020,00072,ARS-01-0051840,Beacon International,Not captured,Not captured,Not captured,,,,Ryan,Michael,J,05/14/1965,male,Not captured,Not captured,Not captured,Not captured,Not captured,Not captured,Not captured,Not captured,Not captured,Not captured,Not captured,Not captured,Not captured,,,Not captured,Not captured,Not captured,Not captured,11907 Dunree Lane,,Orland Park,Illinois,60467,,,Not captured,Not captured,opkguy23@gmail.com,Not captured,701939133,,Not captured,Not captured,Not captured,Not captured,Not captured,Not captured,
Not captured,Not captured,08/02/2019,Not captured,Not captured,863949,020,00072,ARS-01-0051838,Beacon International,Not captured,Not captured,Not captured,,,,Rivera Hernandez,Alicia,D,05/17/1957,female,Not captured,Not captured,Not captured,Not captured,Not captured,Not captured,Not captured,Not captured,Not captured,Not captured,Not captured,Not captured,Not captured,,,Not captured,Not captured,Not captured,Not captured,Ceres 1667,,Ciudad Juarez Chihuahua,,38210,,,Not captured,Not captured,diazsofi@gmail.com,Not captured,701939130,,Not captured,Not captured,Not captured,Not captured,Not captured,Not captured,
Not captured,Not captured,08/02/2019,Not captured,Not captured,863949,020,00072,ARS-01-0051835,Beacon International,Not captured,Not captured,Not captured,,,,Balabhadra,Svaanik,,03/21/2012,male,Not captured,Not captured,Not captured,Not captured,Not captured,Not captured,Not captured,Not captured,Not captured,Not captured,Not captured,Not captured,Not captured,,,Not captured,Not captured,Not captured,Not captured,30359 MERIDIEN CIR,,UNION CITY,California,94587,4088334016,,Not captured,Not captured,sai_patruni@yahoo.com,Not captured,701939123,,Not captured,Not captured,Not captured,Not captured,Not captured,Not captured,
Not captured,Not captured,08/02/2019,Not captured,Not captured,863949,020,00072,ARS-01-0051834,Beacon International,Not captured,Not captured,Not captured,,,,Gundamraju,Soujanya,,08/17/1976,male,Not captured,Not captured,Not captured,Not captured,Not captured,Not captured,Not captured,Not captured,Not captured,Not captured,Not captured,Not captured,Not captured,,,Not captured,Not captured,Not captured,Not captured,30359 MERIDIEN CIR,,UNION CITY,California,94587,4088334016,,Not captured,Not captured,sai_patruni@yahoo.com,Not captured,701939122,,Not captured,Not captured,Not captured,Not captured,Not captured,Not captured,
Not captured,Not captured,08/02/2019,Not captured,Not captured,863949,020,00072,ARS-01-0051833,Beacon International,Not captured,Not captured,Not captured,,,,Balabhadrapatruni,Sai,,03/01/1975,male,Not captured,Not captured,Not captured,Not captured,Not captured,Not captured,Not captured,Not captured,Not captured,Not captured,Not captured,Not captured,Not captured,,,Not captured,Not captured,Not captured,Not captured,30359 MERIDIEN CIR,,UNION CITY,California,94587,4088334016,,Not captured,Not captured,sai_patruni@yahoo.com,Not captured,701939121,,Not captured,Not captured,Not captured,Not captured,Not captured,Not captured,
Not captured,Not captured,08/01/2019,Not captured,Not captured,863949,020,00072,ARS-02-0051828,Beacon America,Not captured,Not captured,Not captured,Passport(G13202955),,,Acosta Marquez,Araceli,,04/07/1989,female,Not captured,Not captured,Not captured,Not captured,Not captured,Not captured,Not captured,Not captured,Not captured,Not captured,Not captured,Not captured,Not captured,Giuseppe Ciampa,Husband,Not captured,Not captured,Not captured,Not captured,Via Caracciolo 201a,,Meta,,80062,+393453184120,016988891665,Not captured,Not captured,Shellyam1704@gmail.com,Not captured,701939116,,Not captured,Not captured,Not captured,Not captured,Not captured,Not captured,
Not captured,Not captured,08/01/2019,Not captured,Not captured,863949,020,00072,ARS-01-0051825,Beacon International,Not captured,Not captured,Not captured,,,,shawki,sarah,,02/26/1998,female,Not captured,Not captured,Not captured,Not captured,Not captured,Not captured,Not captured,Not captured,Not captured,Not captured,Not captured,Not captured,Not captured,,,Not captured,Not captured,Not captured,Not captured,2366 wilton drive,,wilton manors,New Jersey,33305,,,Not captured,Not captured,maurice491@aol.com,Not captured,701939113,,Not captured,Not captured,Not captured,Not captured,Not captured,Not captured,
Not captured,Not captured,08/01/2019,Not captured,Not captured,863949,020,00072,ARS-01-0051824,Beacon International,Not captured,Not captured,Not captured,,,,scaglione,maurice,,08/04/1964,male,Not captured,Not captured,Not captured,Not captured,Not captured,Not captured,Not captured,Not captured,Not captured,Not captured,Not captured,Not captured,Not captured,,,Not captured,Not captured,Not captured,Not captured,2366 wilton drive,,wilton manors,New Jersey,33305,,,Not captured,Not captured,maurice491@aol.com,Not captured,701939112,,Not captured,Not captured,Not captured,Not captured,Not captured,Not captured,
Not captured,Not captured,08/02/2019,Not captured,Not captured,863949,020,00072,ARS-01-0051821,Beacon International,Not captured,Not captured,Not captured,,,,Mlotek,Sarah Alexandra,,12/12/1998,female,Not captured,Not captured,Not captured,Not captured,Not captured,Not captured,Not captured,Not captured,Not captured,Not captured,Not captured,Not captured,Not captured,Debra Cohen Mlotek,mother,Not captured,Not captured,Not captured,Not captured,953 Country Club Drive,,Teaneck,New Jersey,07666,2014030183,,Not captured,Not captured,debra.cohenmlotek@gmail.com,Not captured,701939109,,Not captured,Not captured,Not captured,Not captured,Not captured,Not captured,
Not captured,Not captured,08/02/2019,Not captured,Not captured,863949,020,00072,ARS-02-0051815,Beacon America,Not captured,Not captured,Not captured,,,,Jagannati,Lois,,01/01/1948,female,Not captured,Not captured,Not captured,Not captured,Not captured,Not captured,Not captured,Not captured,Not captured,Not captured,Not captured,Not captured,Not captured,,,Not captured,Not captured,Not captured,Not captured,43159 Gatewood St,,FREMONT,CA,94538,,,Not captured,Not captured,jhdana10@gmail.com,Not captured,701939103,,Not captured,Not captured,Not captured,Not captured,Not captured,Not captured,
Not captured,Not captured,08/01/2019,Not captured,Not captured,863949,020,00072,ARS-01-0051814,Beacon International,Not captured,Not captured,Not captured,,,,ESTRADA,MARVIN,,06/21/1969,male,Not captured,Not captured,Not captured,Not captured,Not captured,Not captured,Not captured,Not captured,Not captured,Not captured,Not captured,Not captured,Not captured,,,Not captured,Not captured,Not captured,Not captured,1812 W BURBANK BLVD # 379,,BURBANK,California,91506,,,Not captured,Not captured,MESTRADA213@HOTMAIL.COM,Not captured,701939102,,Not captured,Not captured,Not captured,Not captured,Not captured,Not captured,
Not captured,Not captured,08/01/2019,Not captured,Not captured,863949,020,00072,ARS-01-0051813,Beacon International,Not captured,Not captured,Not captured,,,,CHAVEZ,EILEEN,,04/06/1982,female,Not captured,Not captured,Not captured,Not captured,Not captured,Not captured,Not captured,Not captured,Not captured,Not captured,Not captured,Not captured,Not captured,,,Not captured,Not captured,Not captured,Not captured,1812 W BURBANK BLVD # 379,,BURBANK,California,91506,,,Not captured,Not captured,MESTRADA213@HOTMAIL.COM,Not captured,701939101,,Not captured,Not captured,Not captured,Not captured,Not captured,Not captured,
Not captured,Not captured,08/02/2019,Not captured,Not captured,863949,020,00072,ARS-02-0051809,Beacon America,Not captured,Not captured,Not captured,Passport(B04572166),,,Morales,Miguel,,01/28/1992,male,Not captured,Not captured,Not captured,Not captured,Not captured,Not captured,Not captured,Not captured,Not captured,Not captured,Not captured,Not captured,Not captured,Luis Morales,Father,Not captured,Not captured,Not captured,Not captured,Arcos de Santa Elena C. Apaneca 9C,,Antiguo Cuscatlan,La Libertad,0000,22891441,,Not captured,Not captured,miguelm_barrios@hotmail.com,Not captured,701939097,,Not captured,Not captured,Not captured,Not captured,Not captured,Not captured,
Not captured,Not captured,08/01/2019,Not captured,Not captured,863949,020,00072,OVI-28-0051807,OverseasCare Visitors Insurance Plan,Not captured,Not captured,Not captured,,,,Chourasia,Sudeshna,,02/03/1961,female,Not captured,Not captured,Not captured,Not captured,Not captured,Not captured,Not captured,Not captured,Not captured,Not captured,Not captured,Not captured,Not captured,aditya chourasia,son,Not captured,Not captured,Not captured,Not captured,340 Vallejo Dr,,Millbrae,California,94030,3152477403,,Not captured,Not captured,adit_07@yahoo.com,Not captured,701939094,,Not captured,Not captured,Not captured,Not captured,Not captured,Not captured,
Not captured,Not captured,08/01/2019,Not captured,Not captured,863949,020,00072,OVI-28-0051806,OverseasCare Visitors Insurance Plan,Not captured,Not captured,Not captured,,,,Chourasia,Praveen,,07/26/1958,male,Not captured,Not captured,Not captured,Not captured,Not captured,Not captured,Not captured,Not captured,Not captured,Not captured,Not captured,Not captured,Not captured,aditya chourasia,son,Not captured,Not captured,Not captured,Not captured,340 Vallejo Dr,,Millbrae,California,94030,3152477403,,Not captured,Not captured,adit_07@yahoo.com,Not captured,701939093,,Not captured,Not captured,Not captured,Not captured,Not captured,Not captured,
Not captured,Not captured,08/01/2019,Not captured,Not captured,863949,020,00072,ARS-02-0051805,Beacon America,Not captured,Not captured,Not captured,Passport(BH6014208),,,Kocsis,Kamilla,,11/07/1999,female,Not captured,Not captured,Not captured,Not captured,Not captured,Not captured,Not captured,Not captured,Not captured,Not captured,Not captured,Not captured,Not captured,Aniko Kocsis,mother,Not captured,Not captured,Not captured,Not captured,1361 Maple Terrace,,Rahway,New Jersey,07065,7326190837,,Not captured,Not captured,ancsapancsa2@gmail.com,Not captured,701939092,,Not captured,Not captured,Not captured,Not captured,Not captured,Not captured,
Not captured,Not captured,08/01/2019,Not captured,Not captured,863949,020,00072,ARS-02-0051790,Beacon America,Not captured,Not captured,Not captured,,,,Klapper,Ingeborg,,04/15/1961,female,Not captured,Not captured,Not captured,Not captured,Not captured,Not captured,Not captured,Not captured,Not captured,Not captured,Not captured,Not captured,Not captured,,,Not captured,Not captured,Not captured,Not captured,5 place de la Revolution,,Guyancourt,,78280,,,Not captured,Not captured,iklapper@hotmail.com,Not captured,701939053,,Not captured,Not captured,Not captured,Not captured,Not captured,Not captured,
Not captured,Not captured,08/01/2019,Not captured,Not captured,863949,020,00072,ARS-03-0051611,Essential America,Not captured,Not captured,Not captured,Passport(506994694),,,Wooding,John,David,02/07/1959,male,Not captured,Not captured,Not captured,Not captured,Not captured,Not captured,Not captured,Not captured,Not captured,Not captured,Not captured,Not captured,Not captured,,,Not captured,Not captured,Not captured,Not captured,Jacaranda,,Tortola,West End,01000,2843436993,,Not captured,Not captured,helenwightman@yahoo.co.uk,Not captured,701938697,,Not captured,Not captured,Not captured,Not captured,Not captured,Not captured,
Not captured,Not captured,08/01/2019,Not captured,Not captured,863949,020,00072,ARS-03-0051611,Essential America,Not captured,Not captured,Not captured,,Passport(500777552),Spouse,Wightman,Helen,May,11/20/1965,female,Not captured,Not captured,Not captured,Not captured,Not captured,Not captured,Not captured,Not captured,Not captured,Not captured,Not captured,Not captured,Not captured,,,Not captured,Not captured,Not captured,Not captured,Jacaranda,,Tortola,West End,01000,2843436993,,Not captured,Not captured,helenwightman@yahoo.co.uk,Not captured,,701938698,Not captured,Not captured,Not captured,Not captured,Not captured,Not captured,