EE Transaction Type,Dependent Transaction Type,Effective Date,EE Signature,EE Signature Date,Control,Suffix,Account,Plan Number,Plan Name,Claim Office,Network ID Number,Customer Code,EE SSN,Dependent SSN,Dependent Relationship,Last Name,First Name,Middle Initial,DOB,Gender,Ethnicity,PCP/PCD,PCP/PCD Current Patient,Provider Cap Office Number,COB,Dep Student Indicator,Dep OOA Indicator,EE Prior Coverage Indicator,EE Late Entrant,EE Language Indicator,Hire Date,Earnings,Earnings Frequency,Beneficiary (Last Name First Name MI),Beneficiary Relationship,Continuation of Coverage Expiration Date,Continuation of Coverage Event Date,Continuation of Coverage Length of Coverage,Work Location Zip Code,Street Address Line 1,Street Address Line 2,City,State,Zip Code,Home Phone Number,Work Phone Number,Accept Code,Evidence Code,EE Email Address,Communication Disability Code,EE Alternate ID,Dep Alternate ID,Old Control,Old Suffix,Old Account,New Control,New Suffix,New Account,
Not captured,Not captured,07/28/2019,Not captured,Not captured,863949,020,00072,ARS-01-0051749,Beacon International,Not captured,Not captured,Not captured,,,,Sabel,Leon,,05/27/1976,male,Not captured,Not captured,Not captured,Not captured,Not captured,Not captured,Not captured,Not captured,Not captured,Not captured,Not captured,Not captured,Not captured,,,Not captured,Not captured,Not captured,Not captured,2 paiken drive,,Spring valley,New York,10977,,,Not captured,Not captured,Leon@crosstownglass.com,Not captured,701938956,,Not captured,Not captured,Not captured,Not captured,Not captured,Not captured,
Not captured,Not captured,07/28/2019,Not captured,Not captured,863949,020,00072,ARS-02-0051748,Beacon America,Not captured,Not captured,Not captured,,,,Colson,Elizabeth,C,09/25/1989,female,Not captured,Not captured,Not captured,Not captured,Not captured,Not captured,Not captured,Not captured,Not captured,Not captured,Not captured,Not captured,Not captured,,,Not captured,Not captured,Not captured,Not captured,1345 S CAPITOL ST SW,,Washington,Dist. of Columbia,20003,,,Not captured,Not captured,elizabeth.c.colson@gmail.com,Not captured,701938955,,Not captured,Not captured,Not captured,Not captured,Not captured,Not captured,
Not captured,Not captured,07/27/2019,Not captured,Not captured,863949,020,00072,ARS-01-0051746,Beacon International,Not captured,Not captured,Not captured,,,,Codyer,Thomas,,10/20/1988,male,Not captured,Not captured,Not captured,Not captured,Not captured,Not captured,Not captured,Not captured,Not captured,Not captured,Not captured,Not captured,Not captured,,,Not captured,Not captured,Not captured,Not captured,PO Box 1208,,Pepperell,Massachusetts,01463,,,Not captured,Not captured,thomascodyer@gmail.com,Not captured,701938952,,Not captured,Not captured,Not captured,Not captured,Not captured,Not captured,
Not captured,Not captured,07/27/2019,Not captured,Not captured,863949,020,00072,ARS-01-0051745,Beacon International,Not captured,Not captured,Not captured,,,,LING,MARK ,,01/31/1985,male,Not captured,Not captured,Not captured,Not captured,Not captured,Not captured,Not captured,Not captured,Not captured,Not captured,Not captured,Not captured,Not captured,XINCHEN JIANG,SPOUSE,Not captured,Not captured,Not captured,Not captured,3550 169TH ST,,FRESH MEADOWS,,11358,3476015758,,Not captured,Not captured,fm.lingling@gmail.com,Not captured,701938951,,Not captured,Not captured,Not captured,Not captured,Not captured,Not captured,
Not captured,Not captured,07/28/2019,Not captured,Not captured,863949,020,00072,ARS-02-0051744,Beacon America,Not captured,Not captured,Not captured,,,,Garrels,Georgia,,09/20/2004,female,Not captured,Not captured,Not captured,Not captured,Not captured,Not captured,Not captured,Not captured,Not captured,Not captured,Not captured,Not captured,Not captured,,,Not captured,Not captured,Not captured,Not captured,519 McCrea Dr,,Peterborough,Ontario,K9K1C4,,,Not captured,Not captured,andersongarrels@mac.com,Not captured,701938950,,Not captured,Not captured,Not captured,Not captured,Not captured,Not captured,
Not captured,Not captured,07/27/2019,Not captured,Not captured,863949,020,00072,ARS-01-0051724,Beacon International,Not captured,Not captured,Not captured,Passport(565894965),,,Bennette,Tirzah ,,05/24/1990,female,Not captured,Not captured,Not captured,Not captured,Not captured,Not captured,Not captured,Not captured,Not captured,Not captured,Not captured,Not captured,Not captured,Daniel Bennette,Father,Not captured,Not captured,Not captured,Not captured,6585 W Tobi Dr,,Boise,Idaho,83714,5036799751,,Not captured,Not captured,tirziebennette@yahoo.com,Not captured,701938899,,Not captured,Not captured,Not captured,Not captured,Not captured,Not captured,
Not captured,Not captured,07/28/2019,Not captured,Not captured,863949,020,00072,ARS-02-0051708,Beacon America,Not captured,Not captured,Not captured,,,,Landsberg,Rivka,,02/04/1976,female,Not captured,Not captured,Not captured,Not captured,Not captured,Not captured,Not captured,Not captured,Not captured,Not captured,Not captured,Not captured,Not captured,,,Not captured,Not captured,Not captured,Not captured,42 Sandstown Roaf,,Lakewood,New Jersey,08701,917-589-2610,,Not captured,Not captured,rivkalandsberg@gmail.com,Not captured,701938883,,Not captured,Not captured,Not captured,Not captured,Not captured,Not captured,
Not captured,Not captured,07/28/2019,Not captured,Not captured,863949,020,00072,ARS-02-0051707,Beacon America,Not captured,Not captured,Not captured,,,,Landsberg,Shimon,,12/04/1974,male,Not captured,Not captured,Not captured,Not captured,Not captured,Not captured,Not captured,Not captured,Not captured,Not captured,Not captured,Not captured,Not captured,,,Not captured,Not captured,Not captured,Not captured,42 Sandstown Roaf,,Lakewood,New Jersey,08701,917-589-2610,,Not captured,Not captured,rivkalandsberg@gmail.com,Not captured,701938882,,Not captured,Not captured,Not captured,Not captured,Not captured,Not captured,
Not captured,Not captured,07/28/2019,Not captured,Not captured,863949,020,00072,ARS-01-0051692,Beacon International,Not captured,Not captured,Not captured,,,,Wurf,Mika,,02/17/2005,female,Not captured,Not captured,Not captured,Not captured,Not captured,Not captured,Not captured,Not captured,Not captured,Not captured,Not captured,Not captured,Not captured,,,Not captured,Not captured,Not captured,Not captured,24 Tree Top Ln,,Dobbs Ferry,New York,10522,9143931541,,Not captured,Not captured,dwurf1@gmail.com,Not captured,701938856,,Not captured,Not captured,Not captured,Not captured,Not captured,Not captured,
Not captured,Not captured,07/28/2019,Not captured,Not captured,863949,020,00072,ARS-01-0051691,Beacon International,Not captured,Not captured,Not captured,,,,Wurf,Kyler,,08/28/2001,male,Not captured,Not captured,Not captured,Not captured,Not captured,Not captured,Not captured,Not captured,Not captured,Not captured,Not captured,Not captured,Not captured,,,Not captured,Not captured,Not captured,Not captured,24 Tree Top Ln,,Dobbs Ferry,New York,10522,9143931541,,Not captured,Not captured,dwurf1@gmail.com,Not captured,701938855,,Not captured,Not captured,Not captured,Not captured,Not captured,Not captured,
Not captured,Not captured,07/28/2019,Not captured,Not captured,863949,020,00072,ARS-01-0051690,Beacon International,Not captured,Not captured,Not captured,,,,Wurf,Michelle,,10/22/1971,female,Not captured,Not captured,Not captured,Not captured,Not captured,Not captured,Not captured,Not captured,Not captured,Not captured,Not captured,Not captured,Not captured,,,Not captured,Not captured,Not captured,Not captured,24 Tree Top Ln,,Dobbs Ferry,New York,10522,9143931541,,Not captured,Not captured,dwurf1@gmail.com,Not captured,701938854,,Not captured,Not captured,Not captured,Not captured,Not captured,Not captured,
Not captured,Not captured,07/28/2019,Not captured,Not captured,863949,020,00072,ARS-01-0051689,Beacon International,Not captured,Not captured,Not captured,,,,Wurf,David,,10/13/1970,male,Not captured,Not captured,Not captured,Not captured,Not captured,Not captured,Not captured,Not captured,Not captured,Not captured,Not captured,Not captured,Not captured,,,Not captured,Not captured,Not captured,Not captured,24 Tree Top Ln,,Dobbs Ferry,New York,10522,9143931541,,Not captured,Not captured,dwurf1@gmail.com,Not captured,701938853,,Not captured,Not captured,Not captured,Not captured,Not captured,Not captured,
Not captured,Not captured,07/27/2019,Not captured,Not captured,863949,020,00072,ARS-01-0051615,Beacon International,Not captured,Not captured,Not captured,,,,Wallace,Elaine,,09/13/1953,female,Not captured,Not captured,Not captured,Not captured,Not captured,Not captured,Not captured,Not captured,Not captured,Not captured,Not captured,Not captured,Not captured,Kerry Wallace,Daughter ,Not captured,Not captured,Not captured,Not captured,8541 Red Oak Drive,,Eden Prairie,Minnesota,55347,952-949-3087,,Not captured,Not captured,hikerdave14er@gmail.com,Not captured,701938702,,Not captured,Not captured,Not captured,Not captured,Not captured,Not captured,
Not captured,Not captured,07/27/2019,Not captured,Not captured,863949,020,00072,ARS-01-0051614,Beacon International,Not captured,Not captured,Not captured,Passport(513531867),,,Wallace,David,R,11/16/1951,male,Not captured,Not captured,Not captured,Not captured,Not captured,Not captured,Not captured,Not captured,Not captured,Not captured,Not captured,Not captured,Not captured,Kerry Wallace,Daughter ,Not captured,Not captured,Not captured,Not captured,8541 Red Oak Drive,,Eden Prairie,Minnesota,55347,952-949-3087,,Not captured,Not captured,hikerdave14er@gmail.com,Not captured,701938701,,Not captured,Not captured,Not captured,Not captured,Not captured,Not captured,
Not captured,Not captured,07/27/2019,Not captured,Not captured,863949,020,00072,ARS-02-0051604,Beacon America,Not captured,Not captured,Not captured,,,,GATT,CAITLAN,,05/16/1998,female,Not captured,Not captured,Not captured,Not captured,Not captured,Not captured,Not captured,Not captured,Not captured,Not captured,Not captured,Not captured,Not captured,,,Not captured,Not captured,Not captured,Not captured,4 AKAL TRACE,,SANTA CRUZ,SANTA CRUZ,0000,1-868-724-7602,,Not captured,Not captured,GGATT@SHEPPARD.TT,Not captured,701938690,,Not captured,Not captured,Not captured,Not captured,Not captured,Not captured,
Not captured,Not captured,07/27/2019,Not captured,Not captured,863949,020,00072,ARS-02-0051603,Beacon America,Not captured,Not captured,Not captured,,,,GATT,ARIANNE,,10/10/1992,female,Not captured,Not captured,Not captured,Not captured,Not captured,Not captured,Not captured,Not captured,Not captured,Not captured,Not captured,Not captured,Not captured,,,Not captured,Not captured,Not captured,Not captured,4 AKAL TRACE,,SANTA CRUZ,SANTA CRUZ,0000,1-868-724-7602,,Not captured,Not captured,GGATT@SHEPPARD.TT,Not captured,701938689,,Not captured,Not captured,Not captured,Not captured,Not captured,Not captured,
Not captured,Not captured,07/27/2019,Not captured,Not captured,863949,020,00072,ARS-02-0051602,Beacon America,Not captured,Not captured,Not captured,,,,GATT,CINDY ANN,,08/17/1969,female,Not captured,Not captured,Not captured,Not captured,Not captured,Not captured,Not captured,Not captured,Not captured,Not captured,Not captured,Not captured,Not captured,,,Not captured,Not captured,Not captured,Not captured,4 AKAL TRACE,,SANTA CRUZ,SANTA CRUZ,0000,1-868-724-7602,,Not captured,Not captured,GGATT@SHEPPARD.TT,Not captured,701938688,,Not captured,Not captured,Not captured,Not captured,Not captured,Not captured,
Not captured,Not captured,07/27/2019,Not captured,Not captured,863949,020,00072,ARS-02-0051601,Beacon America,Not captured,Not captured,Not captured,,,,GATT,DARRIEON,,08/13/1995,male,Not captured,Not captured,Not captured,Not captured,Not captured,Not captured,Not captured,Not captured,Not captured,Not captured,Not captured,Not captured,Not captured,,,Not captured,Not captured,Not captured,Not captured,4 AKAL TRACE,,SANTA CRUZ,SANTA CRUZ,0000,1-868-724-7602,,Not captured,Not captured,GGATT@SHEPPARD.TT,Not captured,701938679,,Not captured,Not captured,Not captured,Not captured,Not captured,Not captured,
Not captured,Not captured,07/28/2019,Not captured,Not captured,863949,020,00072,ARS-01-0051551,Beacon International,Not captured,Not captured,Not captured,Passport(20001750),,,DLAMINI,VUYILE DUMISANI,,03/21/1964,male,Not captured,Not captured,Not captured,Not captured,Not captured,Not captured,Not captured,Not captured,Not captured,Not captured,Not captured,Not captured,Not captured,,,Not captured,Not captured,Not captured,Not captured,2200 SPACE PARK DRIVE,,HOUSTON,Texas,77058,2813358580,2813358580,Not captured,Not captured,LOlondo@tti-corp.com,Not captured,701938544,,Not captured,Not captured,Not captured,Not captured,Not captured,Not captured,
Not captured,Not captured,07/28/2019,Not captured,Not captured,863949,020,00072,ARS-01-0051550,Beacon International,Not captured,Not captured,Not captured,Passport(PC035869),,,Bittaye,Bai ,,01/23/1989,male,Not captured,Not captured,Not captured,Not captured,Not captured,Not captured,Not captured,Not captured,Not captured,Not captured,Not captured,Not captured,Not captured,,,Not captured,Not captured,Not captured,Not captured,2200 Space Park Drive,,Houston,Texas,77058,2813358580,,Not captured,Not captured,LOlondo@tti-corp.com,Not captured,701938543,,Not captured,Not captured,Not captured,Not captured,Not captured,Not captured,
Not captured,Not captured,07/28/2019,Not captured,Not captured,863949,020,00072,ARS-01-0051549,Beacon International,Not captured,Not captured,Not captured,Passport(60002096),,,THWALA,SANELE MAJAHONKHE,,01/25/1990,male,Not captured,Not captured,Not captured,Not captured,Not captured,Not captured,Not captured,Not captured,Not captured,Not captured,Not captured,Not captured,Not captured,,,Not captured,Not captured,Not captured,Not captured,2200 SPACE PARK DRIVE,,HOUSTON,Texas,77058,2813358580,2813358580,Not captured,Not captured,LOlondo@tti-corp.com,Not captured,701938542,,Not captured,Not captured,Not captured,Not captured,Not captured,Not captured,
Not captured,Not captured,07/28/2019,Not captured,Not captured,863949,020,00072,ARS-01-0051548,Beacon International,Not captured,Not captured,Not captured,Passport(PC074247),,,SAMATEH,Lamin BJ,,01/06/1980,male,Not captured,Not captured,Not captured,Not captured,Not captured,Not captured,Not captured,Not captured,Not captured,Not captured,Not captured,Not captured,Not captured,,,Not captured,Not captured,Not captured,Not captured,2200 Space Park Drive,,Houston,Texas,77058,2813358580,,Not captured,Not captured,LOlondo@tti-corp.com,Not captured,701938541,,Not captured,Not captured,Not captured,Not captured,Not captured,Not captured,
Not captured,Not captured,07/28/2019,Not captured,Not captured,863949,020,00072,ARS-01-0051547,Beacon International,Not captured,Not captured,Not captured,Passport(10033193),,,DLAMINI,HLOBSILE BIANCA,,03/14/1975,female,Not captured,Not captured,Not captured,Not captured,Not captured,Not captured,Not captured,Not captured,Not captured,Not captured,Not captured,Not captured,Not captured,,,Not captured,Not captured,Not captured,Not captured,2200 SPACE PARK DRIVE,,HOUSTON,Texas,77058,2813358580,2813358580,Not captured,Not captured,LOlondo@tti-corp.com,Not captured,701938540,,Not captured,Not captured,Not captured,Not captured,Not captured,Not captured,
Not captured,Not captured,07/28/2019,Not captured,Not captured,863949,020,00072,ARS-01-0051546,Beacon International,Not captured,Not captured,Not captured,Passport(S0000695),,,BADGIE,Dawda ,,10/30/1973,male,Not captured,Not captured,Not captured,Not captured,Not captured,Not captured,Not captured,Not captured,Not captured,Not captured,Not captured,Not captured,Not captured,,,Not captured,Not captured,Not captured,Not captured,2200 Space Park Drive,,Houston,Texas,77058,2813358580,,Not captured,Not captured,LOlondo@tti-corp.com,Not captured,701938539,,Not captured,Not captured,Not captured,Not captured,Not captured,Not captured,
Not captured,Not captured,07/28/2019,Not captured,Not captured,863949,020,00072,ARS-01-0051545,Beacon International,Not captured,Not captured,Not captured,Passport(10040611),,,DLAMINI,CEBSILE NIZZIE,,12/08/1993,female,Not captured,Not captured,Not captured,Not captured,Not captured,Not captured,Not captured,Not captured,Not captured,Not captured,Not captured,Not captured,Not captured,,,Not captured,Not captured,Not captured,Not captured,2200 SPACE PARK DRIVE,,HOUSTON,Texas,77058,2813358580,2813358580,Not captured,Not captured,LOlondo@tti-corp.com,Not captured,701938538,,Not captured,Not captured,Not captured,Not captured,Not captured,Not captured,
Not captured,Not captured,07/28/2019,Not captured,Not captured,863949,020,00072,ARS-01-0051544,Beacon International,Not captured,Not captured,Not captured,Passport(PC492489),,, HYDARA,Abdou Samadou,,03/07/1988,male,Not captured,Not captured,Not captured,Not captured,Not captured,Not captured,Not captured,Not captured,Not captured,Not captured,Not captured,Not captured,Not captured,,,Not captured,Not captured,Not captured,Not captured,2200 Space Park Drive,,Houston,Texas,77058,2813358580,,Not captured,Not captured,LOlondo@tti-corp.com,Not captured,701938537,,Not captured,Not captured,Not captured,Not captured,Not captured,Not captured,
Not captured,Not captured,07/28/2019,Not captured,Not captured,863949,020,00072,ARS-01-0051543,Beacon International,Not captured,Not captured,Not captured,Passport(PC264296),,,NYIRARUKUNDO,TRIPHINE,,10/05/1988,female,Not captured,Not captured,Not captured,Not captured,Not captured,Not captured,Not captured,Not captured,Not captured,Not captured,Not captured,Not captured,Not captured,,,Not captured,Not captured,Not captured,Not captured,2200 SPACE PARK DRIVE,,HOUSTON,Texas,77058,2813358580,2813358580,Not captured,Not captured,LOlondo@tti-corp.com,Not captured,701938536,,Not captured,Not captured,Not captured,Not captured,Not captured,Not captured,
Not captured,Not captured,07/28/2019,Not captured,Not captured,863949,020,00072,ARS-01-0051542,Beacon International,Not captured,Not captured,Not captured,Passport(S01977),,,Awaleh,Mohamed Osman,,08/23/1971,male,Not captured,Not captured,Not captured,Not captured,Not captured,Not captured,Not captured,Not captured,Not captured,Not captured,Not captured,Not captured,Not captured,,,Not captured,Not captured,Not captured,Not captured,2200 Space Park Drive,,Houston,Texas,77058,2813358580,,Not captured,Not captured,LOlondo@tti-corp.com,Not captured,701938535,,Not captured,Not captured,Not captured,Not captured,Not captured,Not captured,
Not captured,Not captured,07/28/2019,Not captured,Not captured,863949,020,00072,ARS-01-0051541,Beacon International,Not captured,Not captured,Not captured,Passport(16RF12905),,,Farah,Mohamed Hassan,,12/08/1983,male,Not captured,Not captured,Not captured,Not captured,Not captured,Not captured,Not captured,Not captured,Not captured,Not captured,Not captured,Not captured,Not captured,,,Not captured,Not captured,Not captured,Not captured,2200 Space Park Drive,,Houston,Texas,77058,2813358580,,Not captured,Not captured,LOlondo@tti-corp.com,Not captured,701938534,,Not captured,Not captured,Not captured,Not captured,Not captured,Not captured,
Not captured,Not captured,07/28/2019,Not captured,Not captured,863949,020,00072,ARS-01-0051540,Beacon International,Not captured,Not captured,Not captured,Passport(PC283489),,,TUYISENGE,JEAN DE DIEU,,07/15/1980,male,Not captured,Not captured,Not captured,Not captured,Not captured,Not captured,Not captured,Not captured,Not captured,Not captured,Not captured,Not captured,Not captured,,,Not captured,Not captured,Not captured,Not captured,2200 SPACE PARK DRIVE,,HOUSTON,Texas,77058,2813358580,2813358580,Not captured,Not captured,LOlondo@tti-corp.com,Not captured,701938533,,Not captured,Not captured,Not captured,Not captured,Not captured,Not captured,
Not captured,Not captured,07/28/2019,Not captured,Not captured,863949,020,00072,ARS-01-0051539,Beacon International,Not captured,Not captured,Not captured,Passport(14RE05294),,,Natalis,Marie,,02/16/1959,female,Not captured,Not captured,Not captured,Not captured,Not captured,Not captured,Not captured,Not captured,Not captured,Not captured,Not captured,Not captured,Not captured,,,Not captured,Not captured,Not captured,Not captured,2200 Space Park Drive,,Houston,Texas,77058,2813358580,,Not captured,Not captured,LOlondo@tti-corp.com,Not captured,701938532,,Not captured,Not captured,Not captured,Not captured,Not captured,Not captured,
Not captured,Not captured,07/28/2019,Not captured,Not captured,863949,020,00072,ARS-01-0051538,Beacon International,Not captured,Not captured,Not captured,Passport(PC271604),,,NKURUNZIZA,EMMANUEL,,01/01/1975,male,Not captured,Not captured,Not captured,Not captured,Not captured,Not captured,Not captured,Not captured,Not captured,Not captured,Not captured,Not captured,Not captured,,,Not captured,Not captured,Not captured,Not captured,2200 SPACE PARK DRIVE,,HOUSTON,Texas,77058,2813358580,2813358580,Not captured,Not captured,LOlondo@tti-corp.com,Not captured,701938531,,Not captured,Not captured,Not captured,Not captured,Not captured,Not captured,
Not captured,Not captured,07/28/2019,Not captured,Not captured,863949,020,00072,ARS-01-0051537,Beacon International,Not captured,Not captured,Not captured,Passport(DA0015432),,,Sodhet,Roch Bruno,,03/12/1969,male,Not captured,Not captured,Not captured,Not captured,Not captured,Not captured,Not captured,Not captured,Not captured,Not captured,Not captured,Not captured,Not captured,,,Not captured,Not captured,Not captured,Not captured,2200 Space Park Drive,,Houston,Texas,77058,2813358580,,Not captured,Not captured,LOlondo@tti-corp.com,Not captured,701938530,,Not captured,Not captured,Not captured,Not captured,Not captured,Not captured,
Not captured,Not captured,07/28/2019,Not captured,Not captured,863949,020,00072,ARS-01-0051536,Beacon International,Not captured,Not captured,Not captured,Passport(OA0034451),,,Malonda Bouanga,Carine Lucie,,12/13/1983,female,Not captured,Not captured,Not captured,Not captured,Not captured,Not captured,Not captured,Not captured,Not captured,Not captured,Not captured,Not captured,Not captured,,,Not captured,Not captured,Not captured,Not captured,2200 Space Park Drive,,Houston,Texas,77058,2813358580,,Not captured,Not captured,LOlondo@tti-corp.com,Not captured,701938529,,Not captured,Not captured,Not captured,Not captured,Not captured,Not captured,
Not captured,Not captured,07/28/2019,Not captured,Not captured,863949,020,00072,ARS-01-0051535,Beacon International,Not captured,Not captured,Not captured,Passport(PC370729),,,ABENANYE,EMMANUEL,,02/16/1988,male,Not captured,Not captured,Not captured,Not captured,Not captured,Not captured,Not captured,Not captured,Not captured,Not captured,Not captured,Not captured,Not captured,,,Not captured,Not captured,Not captured,Not captured,2200 SPACE PARK DRIVE,,HOUSTON,Texas,77058,2813358580,2813358580,Not captured,Not captured,LOlondo@tti-corp.com,Not captured,701938528,,Not captured,Not captured,Not captured,Not captured,Not captured,Not captured,
Not captured,Not captured,07/28/2019,Not captured,Not captured,863949,020,00072,ARS-01-0051534,Beacon International,Not captured,Not captured,Not captured,Passport(SA0013568),,,Kayath,Aime Christian,,10/17/1973,male,Not captured,Not captured,Not captured,Not captured,Not captured,Not captured,Not captured,Not captured,Not captured,Not captured,Not captured,Not captured,Not captured,,,Not captured,Not captured,Not captured,Not captured,2200 Space Park Drive,,Houston,Texas,77058,2813358580,,Not captured,Not captured,LOlondo@tti-corp.com,Not captured,701938527,,Not captured,Not captured,Not captured,Not captured,Not captured,Not captured,