EE Transaction Type,Dependent Transaction Type,Effective Date,EE Signature,EE Signature Date,Control,Suffix,Account,Plan Number,Plan Name,Claim Office,Network ID Number,Customer Code,EE SSN,Dependent SSN,Dependent Relationship,Last Name,First Name,Middle Initial,DOB,Gender,Ethnicity,PCP/PCD,PCP/PCD Current Patient,Provider Cap Office Number,COB,Dep Student Indicator,Dep OOA Indicator,EE Prior Coverage Indicator,EE Late Entrant,EE Language Indicator,Hire Date,Earnings,Earnings Frequency,Beneficiary (Last Name First Name MI),Beneficiary Relationship,Continuation of Coverage Expiration Date,Continuation of Coverage Event Date,Continuation of Coverage Length of Coverage,Work Location Zip Code,Street Address Line 1,Street Address Line 2,City,State,Zip Code,Home Phone Number,Work Phone Number,Accept Code,Evidence Code,EE Email Address,Communication Disability Code,EE Alternate ID,Dep Alternate ID,Old Control,Old Suffix,Old Account,New Control,New Suffix,New Account,
Not captured,Not captured,07/25/2019,Not captured,Not captured,863949,020,00072,ARS-03-0051508,Essential America,Not captured,Not captured,Not captured,Passport(n/a),,,Wilson,Lydia,,06/24/2019,female,Not captured,Not captured,Not captured,Not captured,Not captured,Not captured,Not captured,Not captured,Not captured,Not captured,Not captured,Not captured,Not captured,,,Not captured,Not captured,Not captured,Not captured,183 Thomas Rd.,,Waco,Georgia,30182,7706953782,,Not captured,Not captured,thejoyway2016@gmail.com,Not captured,701938417,,Not captured,Not captured,Not captured,Not captured,Not captured,Not captured,
Not captured,Not captured,07/28/2019,Not captured,Not captured,863949,020,00072,ARS-01-0051749,Beacon International,Not captured,Not captured,Not captured,,,,Sabel,Leon,,05/27/1976,male,Not captured,Not captured,Not captured,Not captured,Not captured,Not captured,Not captured,Not captured,Not captured,Not captured,Not captured,Not captured,Not captured,,,Not captured,Not captured,Not captured,Not captured,2 paiken drive,,Spring valley,New York,10977,,,Not captured,Not captured,Leon@crosstownglass.com,Not captured,701938956,,Not captured,Not captured,Not captured,Not captured,Not captured,Not captured,
Not captured,Not captured,07/28/2019,Not captured,Not captured,863949,020,00072,ARS-02-0051748,Beacon America,Not captured,Not captured,Not captured,,,,Colson,Elizabeth,C,09/25/1989,female,Not captured,Not captured,Not captured,Not captured,Not captured,Not captured,Not captured,Not captured,Not captured,Not captured,Not captured,Not captured,Not captured,,,Not captured,Not captured,Not captured,Not captured,1345 S CAPITOL ST SW,,Washington,Dist. of Columbia,20003,,,Not captured,Not captured,elizabeth.c.colson@gmail.com,Not captured,701938955,,Not captured,Not captured,Not captured,Not captured,Not captured,Not captured,
Not captured,Not captured,07/27/2019,Not captured,Not captured,863949,020,00072,ARS-01-0051746,Beacon International,Not captured,Not captured,Not captured,,,,Codyer,Thomas,,10/20/1988,male,Not captured,Not captured,Not captured,Not captured,Not captured,Not captured,Not captured,Not captured,Not captured,Not captured,Not captured,Not captured,Not captured,,,Not captured,Not captured,Not captured,Not captured,PO Box 1208,,Pepperell,Massachusetts,01463,,,Not captured,Not captured,thomascodyer@gmail.com,Not captured,701938952,,Not captured,Not captured,Not captured,Not captured,Not captured,Not captured,
Not captured,Not captured,07/27/2019,Not captured,Not captured,863949,020,00072,ARS-01-0051745,Beacon International,Not captured,Not captured,Not captured,,,,LING,MARK ,,01/31/1985,male,Not captured,Not captured,Not captured,Not captured,Not captured,Not captured,Not captured,Not captured,Not captured,Not captured,Not captured,Not captured,Not captured,XINCHEN JIANG,SPOUSE,Not captured,Not captured,Not captured,Not captured,3550 169TH ST,,FRESH MEADOWS,,11358,3476015758,,Not captured,Not captured,fm.lingling@gmail.com,Not captured,701938951,,Not captured,Not captured,Not captured,Not captured,Not captured,Not captured,
Not captured,Not captured,07/28/2019,Not captured,Not captured,863949,020,00072,ARS-02-0051744,Beacon America,Not captured,Not captured,Not captured,,,,Garrels,Georgia,,09/20/2004,female,Not captured,Not captured,Not captured,Not captured,Not captured,Not captured,Not captured,Not captured,Not captured,Not captured,Not captured,Not captured,Not captured,,,Not captured,Not captured,Not captured,Not captured,519 McCrea Dr,,Peterborough,Ontario,K9K1C4,,,Not captured,Not captured,andersongarrels@mac.com,Not captured,701938950,,Not captured,Not captured,Not captured,Not captured,Not captured,Not captured,
Not captured,Not captured,07/26/2019,Not captured,Not captured,863949,020,00072,OVI-28-0051742,OverseasCare Visitors Insurance Plan,Not captured,Not captured,Not captured,Passport(N8024910),,,Dedhia,Kumud,Ketan,03/03/1963,female,Not captured,Not captured,Not captured,Not captured,Not captured,Not captured,Not captured,Not captured,Not captured,Not captured,Not captured,Not captured,Not captured,KETAN DEDHIA,HUSBAND,Not captured,Not captured,Not captured,Not captured,502/3 RAHEJA HAVEN,,MUMBAI,Maharashtra,400049,9833944503,,Not captured,Not captured,KUMUD_KETAN@HOTMAIL.COM,Not captured,701938920,,Not captured,Not captured,Not captured,Not captured,Not captured,Not captured,
Not captured,Not captured,07/26/2019,Not captured,Not captured,863949,020,00072,ARS-02-0051736,Beacon America,Not captured,Not captured,Not captured,,,,meirovitz,mimi,,07/28/2018,male,Not captured,Not captured,Not captured,Not captured,Not captured,Not captured,Not captured,Not captured,Not captured,Not captured,Not captured,Not captured,Not captured,,,Not captured,Not captured,Not captured,Not captured,13 grove dr,,lakewood,New Jersey,08701,3473141701,,Not captured,Not captured,ameirovitz@gmail.com,Not captured,701938911,,Not captured,Not captured,Not captured,Not captured,Not captured,Not captured,
Not captured,Not captured,07/26/2019,Not captured,Not captured,863949,020,00072,ARS-02-0051735,Beacon America,Not captured,Not captured,Not captured,,,,meirovitz,rivky,,01/21/2016,male,Not captured,Not captured,Not captured,Not captured,Not captured,Not captured,Not captured,Not captured,Not captured,Not captured,Not captured,Not captured,Not captured,,,Not captured,Not captured,Not captured,Not captured,13 grove dr,,lakewood,New Jersey,08701,3473141701,,Not captured,Not captured,ameirovitz@gmail.com,Not captured,701938910,,Not captured,Not captured,Not captured,Not captured,Not captured,Not captured,
Not captured,Not captured,07/26/2019,Not captured,Not captured,863949,020,00072,ARS-02-0051734,Beacon America,Not captured,Not captured,Not captured,,,,meirovitz,leah,,02/03/2012,male,Not captured,Not captured,Not captured,Not captured,Not captured,Not captured,Not captured,Not captured,Not captured,Not captured,Not captured,Not captured,Not captured,,,Not captured,Not captured,Not captured,Not captured,13 grove dr,,lakewood,New Jersey,08701,3473141701,,Not captured,Not captured,ameirovitz@gmail.com,Not captured,701938909,,Not captured,Not captured,Not captured,Not captured,Not captured,Not captured,
Not captured,Not captured,07/26/2019,Not captured,Not captured,863949,020,00072,ARS-02-0051733,Beacon America,Not captured,Not captured,Not captured,,,,meirovitz,tilly,,11/24/2009,male,Not captured,Not captured,Not captured,Not captured,Not captured,Not captured,Not captured,Not captured,Not captured,Not captured,Not captured,Not captured,Not captured,,,Not captured,Not captured,Not captured,Not captured,13 grove dr,,lakewood,New Jersey,08701,3473141701,,Not captured,Not captured,ameirovitz@gmail.com,Not captured,701938908,,Not captured,Not captured,Not captured,Not captured,Not captured,Not captured,
Not captured,Not captured,07/26/2019,Not captured,Not captured,863949,020,00072,ARS-02-0051732,Beacon America,Not captured,Not captured,Not captured,,,,meirovitz,henny,,07/14/2008,male,Not captured,Not captured,Not captured,Not captured,Not captured,Not captured,Not captured,Not captured,Not captured,Not captured,Not captured,Not captured,Not captured,,,Not captured,Not captured,Not captured,Not captured,13 grove dr,,lakewood,New Jersey,08701,3473141701,,Not captured,Not captured,ameirovitz@gmail.com,Not captured,701938907,,Not captured,Not captured,Not captured,Not captured,Not captured,Not captured,
Not captured,Not captured,07/26/2019,Not captured,Not captured,863949,020,00072,ARS-02-0051731,Beacon America,Not captured,Not captured,Not captured,,,,meirovitz,chana,,10/05/1988,male,Not captured,Not captured,Not captured,Not captured,Not captured,Not captured,Not captured,Not captured,Not captured,Not captured,Not captured,Not captured,Not captured,,,Not captured,Not captured,Not captured,Not captured,13 grove dr,,lakewood,New Jersey,08701,3473141701,,Not captured,Not captured,ameirovitz@gmail.com,Not captured,701938906,,Not captured,Not captured,Not captured,Not captured,Not captured,Not captured,
Not captured,Not captured,07/26/2019,Not captured,Not captured,863949,020,00072,ARS-02-0051730,Beacon America,Not captured,Not captured,Not captured,,,,meirovitz,Abraham,,06/16/1988,male,Not captured,Not captured,Not captured,Not captured,Not captured,Not captured,Not captured,Not captured,Not captured,Not captured,Not captured,Not captured,Not captured,,,Not captured,Not captured,Not captured,Not captured,13 grove dr,,lakewood,New Jersey,08701,3473141701,,Not captured,Not captured,ameirovitz@gmail.com,Not captured,701938905,,Not captured,Not captured,Not captured,Not captured,Not captured,Not captured,
Not captured,Not captured,07/25/2019,Not captured,Not captured,863949,020,00072,ARS-02-0051726,Beacon America,Not captured,Not captured,Not captured,,,,Adler,Eliezer,,06/13/1997,male,Not captured,Not captured,Not captured,Not captured,Not captured,Not captured,Not captured,Not captured,Not captured,Not captured,Not captured,Not captured,Not captured,,,Not captured,Not captured,Not captured,Not captured,106 Washington Ave.,,New Square,New York,10977,845-362-5042,,Not captured,Not captured,devorah222@gmail.com,Not captured,701938901,,Not captured,Not captured,Not captured,Not captured,Not captured,Not captured,
Not captured,Not captured,07/25/2019,Not captured,Not captured,863949,020,00072,ARS-02-0051725,Beacon America,Not captured,Not captured,Not captured,,,,Adler ,Tzipora,,09/08/1999,female,Not captured,Not captured,Not captured,Not captured,Not captured,Not captured,Not captured,Not captured,Not captured,Not captured,Not captured,Not captured,Not captured,,,Not captured,Not captured,Not captured,Not captured,106 Washington Ave.,,New Square,New York,10977,845-362-5042,,Not captured,Not captured,devorah222@gmail.com,Not captured,701938900,,Not captured,Not captured,Not captured,Not captured,Not captured,Not captured,
Not captured,Not captured,07/27/2019,Not captured,Not captured,863949,020,00072,ARS-01-0051724,Beacon International,Not captured,Not captured,Not captured,Passport(565894965),,,Bennette,Tirzah ,,05/24/1990,female,Not captured,Not captured,Not captured,Not captured,Not captured,Not captured,Not captured,Not captured,Not captured,Not captured,Not captured,Not captured,Not captured,Daniel Bennette,Father,Not captured,Not captured,Not captured,Not captured,6585 W Tobi Dr,,Boise,Idaho,83714,5036799751,,Not captured,Not captured,tirziebennette@yahoo.com,Not captured,701938899,,Not captured,Not captured,Not captured,Not captured,Not captured,Not captured,
Not captured,Not captured,07/25/2019,Not captured,Not captured,863949,020,00072,ARS-02-0051723,Beacon America,Not captured,Not captured,Not captured,,,,Drezel,Tzvi,,06/06/2019,male,Not captured,Not captured,Not captured,Not captured,Not captured,Not captured,Not captured,Not captured,Not captured,Not captured,Not captured,Not captured,Not captured,,,Not captured,Not captured,Not captured,Not captured,6 Bartanura road,,Lakewood,New Jersey,08701,732-364-2118,,Not captured,Not captured,miriamdrezel@gmail.com,Not captured,701938898,,Not captured,Not captured,Not captured,Not captured,Not captured,Not captured,
Not captured,Not captured,07/25/2019,Not captured,Not captured,863949,020,00072,ARS-02-0051722,Beacon America,Not captured,Not captured,Not captured,,,,Drezel,Mordechai,,07/12/2017,male,Not captured,Not captured,Not captured,Not captured,Not captured,Not captured,Not captured,Not captured,Not captured,Not captured,Not captured,Not captured,Not captured,,,Not captured,Not captured,Not captured,Not captured,6 Bartanura road,,Lakewood,New Jersey,08701,732-364-2118,,Not captured,Not captured,miriamdrezel@gmail.com,Not captured,701938897,,Not captured,Not captured,Not captured,Not captured,Not captured,Not captured,
Not captured,Not captured,07/25/2019,Not captured,Not captured,863949,020,00072,ARS-02-0051721,Beacon America,Not captured,Not captured,Not captured,,,,Drezel,Simcha,,07/06/2015,male,Not captured,Not captured,Not captured,Not captured,Not captured,Not captured,Not captured,Not captured,Not captured,Not captured,Not captured,Not captured,Not captured,,,Not captured,Not captured,Not captured,Not captured,6 Bartanura road,,Lakewood,New Jersey,08701,732-364-2118,,Not captured,Not captured,miriamdrezel@gmail.com,Not captured,701938896,,Not captured,Not captured,Not captured,Not captured,Not captured,Not captured,
Not captured,Not captured,07/25/2019,Not captured,Not captured,863949,020,00072,ARS-02-0051720,Beacon America,Not captured,Not captured,Not captured,,,,Drezel,Yaakov,,08/01/1989,male,Not captured,Not captured,Not captured,Not captured,Not captured,Not captured,Not captured,Not captured,Not captured,Not captured,Not captured,Not captured,Not captured,,,Not captured,Not captured,Not captured,Not captured,6 Bartanura road,,Lakewood,New Jersey,08701,732-364-2118,,Not captured,Not captured,miriamdrezel@gmail.com,Not captured,701938895,,Not captured,Not captured,Not captured,Not captured,Not captured,Not captured,
Not captured,Not captured,07/25/2019,Not captured,Not captured,863949,020,00072,ARS-02-0051719,Beacon America,Not captured,Not captured,Not captured,,,,drezel,Shlomo,,02/05/2012,male,Not captured,Not captured,Not captured,Not captured,Not captured,Not captured,Not captured,Not captured,Not captured,Not captured,Not captured,Not captured,Not captured,,,Not captured,Not captured,Not captured,Not captured,6 Bartanura road,,Lakewood,New Jersey,08701,732-364-2118,,Not captured,Not captured,miriamdrezel@gmail.com,Not captured,701938894,,Not captured,Not captured,Not captured,Not captured,Not captured,Not captured,
Not captured,Not captured,07/25/2019,Not captured,Not captured,863949,020,00072,ARS-02-0051714,Beacon America,Not captured,Not captured,Not captured,,,,Segev Sommer,Shira,,04/03/1979,female,Not captured,Not captured,Not captured,Not captured,Not captured,Not captured,Not captured,Not captured,Not captured,Not captured,Not captured,Not captured,Not captured,,,Not captured,Not captured,Not captured,Not captured,4548 N. Dover,,Chicago,Illinois,60640,,,Not captured,Not captured,giladsom@gmail.com,Not captured,701938889,,Not captured,Not captured,Not captured,Not captured,Not captured,Not captured,
Not captured,Not captured,07/25/2019,Not captured,Not captured,863949,020,00072,ARS-02-0051713,Beacon America,Not captured,Not captured,Not captured,,,,Sommer,Gilad,,02/08/1981,male,Not captured,Not captured,Not captured,Not captured,Not captured,Not captured,Not captured,Not captured,Not captured,Not captured,Not captured,Not captured,Not captured,,,Not captured,Not captured,Not captured,Not captured,4548 N. Dover,,Chicago,Illinois,60640,,,Not captured,Not captured,giladsom@gmail.com,Not captured,701938888,,Not captured,Not captured,Not captured,Not captured,Not captured,Not captured,
Not captured,Not captured,07/25/2019,Not captured,Not captured,863949,020,00072,ARS-02-0051712,Beacon America,Not captured,Not captured,Not captured,Passport(122344154),,,SANCHEZ GARCIA,JOSE EDUARDO,,08/15/1995,male,Not captured,Not captured,Not captured,Not captured,Not captured,Not captured,Not captured,Not captured,Not captured,Not captured,Not captured,Not captured,Not captured,ANA MILENA GARCIA YANEZ,MADRE,Not captured,Not captured,Not captured,Not captured,URB. TAMAYO SUITE CASA #23 SAN CRISTOBAL,,SAN CRISTOBAL,Tachira,0000,584247665719,,Not captured,Not captured,ANA_MILE79@HOTMAIL.COM,Not captured,701938887,,Not captured,Not captured,Not captured,Not captured,Not captured,Not captured,
Not captured,Not captured,07/28/2019,Not captured,Not captured,863949,020,00072,ARS-02-0051708,Beacon America,Not captured,Not captured,Not captured,,,,Landsberg,Rivka,,02/04/1976,female,Not captured,Not captured,Not captured,Not captured,Not captured,Not captured,Not captured,Not captured,Not captured,Not captured,Not captured,Not captured,Not captured,,,Not captured,Not captured,Not captured,Not captured,42 Sandstown Roaf,,Lakewood,New Jersey,08701,917-589-2610,,Not captured,Not captured,rivkalandsberg@gmail.com,Not captured,701938883,,Not captured,Not captured,Not captured,Not captured,Not captured,Not captured,
Not captured,Not captured,07/28/2019,Not captured,Not captured,863949,020,00072,ARS-02-0051707,Beacon America,Not captured,Not captured,Not captured,,,,Landsberg,Shimon,,12/04/1974,male,Not captured,Not captured,Not captured,Not captured,Not captured,Not captured,Not captured,Not captured,Not captured,Not captured,Not captured,Not captured,Not captured,,,Not captured,Not captured,Not captured,Not captured,42 Sandstown Roaf,,Lakewood,New Jersey,08701,917-589-2610,,Not captured,Not captured,rivkalandsberg@gmail.com,Not captured,701938882,,Not captured,Not captured,Not captured,Not captured,Not captured,Not captured,
Not captured,Not captured,07/25/2019,Not captured,Not captured,863949,020,00072,ARS-01-0051706,Beacon International,Not captured,Not captured,Not captured,,,,Pereira de Sousa,Eric,R,10/27/1987,male,Not captured,Not captured,Not captured,Not captured,Not captured,Not captured,Not captured,Not captured,Not captured,Not captured,Not captured,Not captured,Not captured,,,Not captured,Not captured,Not captured,Not captured,3615 38th St NW,,Washington,Dist. of Columbia,20016,,,Not captured,Not captured,eng.teacher.kev@gmail.com,Not captured,701938881,,Not captured,Not captured,Not captured,Not captured,Not captured,Not captured,
Not captured,Not captured,07/25/2019,Not captured,Not captured,863949,020,00072,ARS-01-0051705,Beacon International,Not captured,Not captured,Not captured,,,,Murphy,Kevin,M,07/28/1989,male,Not captured,Not captured,Not captured,Not captured,Not captured,Not captured,Not captured,Not captured,Not captured,Not captured,Not captured,Not captured,Not captured,,,Not captured,Not captured,Not captured,Not captured,3615 38th St NW,,Washington,Dist. of Columbia,20016,,,Not captured,Not captured,eng.teacher.kev@gmail.com,Not captured,701938880,,Not captured,Not captured,Not captured,Not captured,Not captured,Not captured,
Not captured,Not captured,07/25/2019,Not captured,Not captured,863949,020,00072,ARS-01-0051704,Beacon International,Not captured,Not captured,Not captured,,,,Hatton,Carol,J,12/28/1943,female,Not captured,Not captured,Not captured,Not captured,Not captured,Not captured,Not captured,Not captured,Not captured,Not captured,Not captured,Not captured,Not captured,,,Not captured,Not captured,Not captured,Not captured,8049 Tysons Oaks Ct,,Gainesville,Virginia,20155,,,Not captured,Not captured,eng.teacher.kev@gmail.com,Not captured,701938879,,Not captured,Not captured,Not captured,Not captured,Not captured,Not captured,
Not captured,Not captured,07/25/2019,Not captured,Not captured,863949,020,00072,ARS-01-0051703,Beacon International,Not captured,Not captured,Not captured,,,,Murphy,Cindy,S,10/20/1969,female,Not captured,Not captured,Not captured,Not captured,Not captured,Not captured,Not captured,Not captured,Not captured,Not captured,Not captured,Not captured,Not captured,,,Not captured,Not captured,Not captured,Not captured,8049 Tysons Oaks Ct,,Gainesville,Virginia,20155,,,Not captured,Not captured,eng.teacher.kev@gmail.com,Not captured,701938878,,Not captured,Not captured,Not captured,Not captured,Not captured,Not captured,
Not captured,Not captured,07/25/2019,Not captured,Not captured,863949,020,00072,ARS-02-0051702,Beacon America,Not captured,Not captured,Not captured,,,,Swaney,Charles,,03/18/1953,male,Not captured,Not captured,Not captured,Not captured,Not captured,Not captured,Not captured,Not captured,Not captured,Not captured,Not captured,Not captured,Not captured,,,Not captured,Not captured,Not captured,Not captured,4008 Curt Drive Columbia,,Columbus,Missouri,65203,,,Not captured,Not captured,jjswan56@gmail.com,Not captured,701938877,,Not captured,Not captured,Not captured,Not captured,Not captured,Not captured,
Not captured,Not captured,07/25/2019,Not captured,Not captured,863949,020,00072,ARS-02-0051701,Beacon America,Not captured,Not captured,Not captured,,,,Swaney,Rebecca,,12/11/1956,female,Not captured,Not captured,Not captured,Not captured,Not captured,Not captured,Not captured,Not captured,Not captured,Not captured,Not captured,Not captured,Not captured,,,Not captured,Not captured,Not captured,Not captured,4008 Curt Drive Columbia,,Columbus,Missouri,65203,,,Not captured,Not captured,jjswan56@gmail.com,Not captured,701938876,,Not captured,Not captured,Not captured,Not captured,Not captured,Not captured,
Not captured,Not captured,07/25/2019,Not captured,Not captured,863949,020,00072,ARS-04-0051637,Enhanced America,Not captured,Not captured,Not captured,Passport(Bc0594056),,,Golts,Attila,,08/12/1971,male,Not captured,Not captured,Not captured,Not captured,Not captured,Not captured,Not captured,Not captured,Not captured,Not captured,Not captured,Not captured,Not captured,,,Not captured,Not captured,Not captured,Not captured,12551 feline drive,,Venice,Florida,34293,941-227-7228,,Not captured,Not captured,Marlaxusa@gmail.com,Not captured,701938726,,Not captured,Not captured,Not captured,Not captured,Not captured,Not captured,
Not captured,Not captured,07/25/2019,Not captured,Not captured,863949,020,00072,ARS-04-0051637,Enhanced America,Not captured,Not captured,Not captured,,Passport(Bj6882226),Dependant,Golts,Balint,,08/02/2005,male,Not captured,Not captured,Not captured,Not captured,Not captured,Not captured,Not captured,Not captured,Not captured,Not captured,Not captured,Not captured,Not captured,,,Not captured,Not captured,Not captured,Not captured,12551 feline drive,,Venice,Florida,34293,941-227-7228,,Not captured,Not captured,Marlaxusa@gmail.com,Not captured,,701938727,Not captured,Not captured,Not captured,Not captured,Not captured,Not captured,
Not captured,Not captured,07/26/2019,Not captured,Not captured,863949,020,00072,ARS-01-0051698,Beacon International,Not captured,Not captured,Not captured,,,,Ross,Michael,,11/15/1952,male,Not captured,Not captured,Not captured,Not captured,Not captured,Not captured,Not captured,Not captured,Not captured,Not captured,Not captured,Not captured,Not captured,,,Not captured,Not captured,Not captured,Not captured,1240 Roxas Blvd ,,Manila,,1000,,,Not captured,Not captured,mrossllhphil@gmail.com,Not captured,701938862,,Not captured,Not captured,Not captured,Not captured,Not captured,Not captured,
Not captured,Not captured,07/26/2019,Not captured,Not captured,863949,020,00072,ARS-01-0051697,Beacon International,Not captured,Not captured,Not captured,,,,Ross,Portia,,10/29/1976,female,Not captured,Not captured,Not captured,Not captured,Not captured,Not captured,Not captured,Not captured,Not captured,Not captured,Not captured,Not captured,Not captured,,,Not captured,Not captured,Not captured,Not captured,1240 Roxas Blvd ,,Manila,,1000,,,Not captured,Not captured,mrossllhphil@gmail.com,Not captured,701938861,,Not captured,Not captured,Not captured,Not captured,Not captured,Not captured,