EE Transaction Type,Dependent Transaction Type,Effective Date,EE Signature,EE Signature Date,Control,Suffix,Account,Plan Number,Plan Name,Claim Office,Network ID Number,Customer Code,EE SSN,Dependent SSN,Dependent Relationship,Last Name,First Name,Middle Initial,DOB,Gender,Ethnicity,PCP/PCD,PCP/PCD Current Patient,Provider Cap Office Number,COB,Dep Student Indicator,Dep OOA Indicator,EE Prior Coverage Indicator,EE Late Entrant,EE Language Indicator,Hire Date,Earnings,Earnings Frequency,Beneficiary (Last Name First Name MI),Beneficiary Relationship,Continuation of Coverage Expiration Date,Continuation of Coverage Event Date,Continuation of Coverage Length of Coverage,Work Location Zip Code,Street Address Line 1,Street Address Line 2,City,State,Zip Code,Home Phone Number,Work Phone Number,Accept Code,Evidence Code,EE Email Address,Communication Disability Code,EE Alternate ID,Dep Alternate ID,Old Control,Old Suffix,Old Account,New Control,New Suffix,New Account,
Not captured,Not captured,07/23/2019,Not captured,Not captured,863949,020,00072,ARS-03-0051628,Essential America,Not captured,Not captured,Not captured,Passport(254871467),,,Maloney,Cailen,,05/21/1993,female,Not captured,Not captured,Not captured,Not captured,Not captured,Not captured,Not captured,Not captured,Not captured,Not captured,Not captured,Not captured,Not captured,,,Not captured,Not captured,Not captured,Not captured,1670 Rising Mist Lane,,Cumming,Georgia,30041,6785922072,,Not captured,Not captured,maloneycailen@gmail.com,Not captured,701938715,,Not captured,Not captured,Not captured,Not captured,Not captured,Not captured,
Not captured,Not captured,07/23/2019,Not captured,Not captured,863949,020,00072,ARS-01-0051680,Beacon International,Not captured,Not captured,Not captured,,,,Keating,Natalie,,11/14/1986,female,Not captured,Not captured,Not captured,Not captured,Not captured,Not captured,Not captured,Not captured,Not captured,Not captured,Not captured,Not captured,Not captured,,,Not captured,Not captured,Not captured,Not captured,6314 Opaekaa Rd,,Kapaa,Hawaii,96746-9441,,,Not captured,Not captured,letters4natalie@yahoo.com,Not captured,701938795,,Not captured,Not captured,Not captured,Not captured,Not captured,Not captured,
Not captured,Not captured,07/23/2019,Not captured,Not captured,863949,020,00072,ARS-01-0051666,Beacon International,Not captured,Not captured,Not captured,,,,Chen,Ginger,,09/03/1985,female,Not captured,Not captured,Not captured,Not captured,Not captured,Not captured,Not captured,Not captured,Not captured,Not captured,Not captured,Not captured,Not captured,,,Not captured,Not captured,Not captured,Not captured,2510 Bancroft Way Apt 202,,Berkeley,California,94704,,,Not captured,Not captured,gingerccc93719@hotmail.com,Not captured,701938772,,Not captured,Not captured,Not captured,Not captured,Not captured,Not captured,
Not captured,Not captured,07/23/2019,Not captured,Not captured,863949,020,00072,ARS-01-0051664,Beacon International,Not captured,Not captured,Not captured,,,,McConnell,David,,08/18/1956,male,Not captured,Not captured,Not captured,Not captured,Not captured,Not captured,Not captured,Not captured,Not captured,Not captured,Not captured,Not captured,Not captured,,,Not captured,Not captured,Not captured,Not captured,5602 Delido Ct.,,Cape Coral,Florida,33904,5618597899,,Not captured,Not captured,mainstreetins@msn.com,Not captured,701938770,,Not captured,Not captured,Not captured,Not captured,Not captured,Not captured,
Not captured,Not captured,07/23/2019,Not captured,Not captured,863949,020,00072,ARS-01-0051663,Beacon International,Not captured,Not captured,Not captured,Passport(047808432),,,McConnell,Jodi,,08/11/1969,female,Not captured,Not captured,Not captured,Not captured,Not captured,Not captured,Not captured,Not captured,Not captured,Not captured,Not captured,Not captured,Not captured,,,Not captured,Not captured,Not captured,Not captured,5602 Delido Ct.,,Cape Coral,Florida,33904,5618597899,,Not captured,Not captured,mainstreetins@msn.com,Not captured,701938769,,Not captured,Not captured,Not captured,Not captured,Not captured,Not captured,
Not captured,Not captured,07/23/2019,Not captured,Not captured,863949,020,00072,ARS-02-0051661,Beacon America,Not captured,Not captured,Not captured,,,,Cao,Trang Minh Tu,,01/01/1980,male,Not captured,Not captured,Not captured,Not captured,Not captured,Not captured,Not captured,Not captured,Not captured,Not captured,Not captured,Not captured,Not captured,,,Not captured,Not captured,Not captured,Not captured,6595 Fleming Street,,Vancouver,British Columbia,V5P 3H3,,,Not captured,Not captured,tucaotrang@gmail.com,Not captured,701938767,,Not captured,Not captured,Not captured,Not captured,Not captured,Not captured,
Not captured,Not captured,07/23/2019,Not captured,Not captured,863949,020,00072,ARS-02-0051655,Beacon America,Not captured,Not captured,Not captured,,,,NEUFELD,ANGELIQUE,,07/09/2012,female,Not captured,Not captured,Not captured,Not captured,Not captured,Not captured,Not captured,Not captured,Not captured,Not captured,Not captured,Not captured,Not captured,,,Not captured,Not captured,Not captured,Not captured,1643 S JACKSON PL,,SEATTLE,Washington,98144,,,Not captured,Not captured,garthwneufeld@gmail.com,Not captured,701938759,,Not captured,Not captured,Not captured,Not captured,Not captured,Not captured,
Not captured,Not captured,07/23/2019,Not captured,Not captured,863949,020,00072,ARS-01-0051647,Beacon International,Not captured,Not captured,Not captured,,,,Hernandez,Bianca,D,01/28/1997,female,Not captured,Not captured,Not captured,Not captured,Not captured,Not captured,Not captured,Not captured,Not captured,Not captured,Not captured,Not captured,Not captured,,,Not captured,Not captured,Not captured,Not captured,2715 Catalina Drive,,Davis,California,95616,,,Not captured,Not captured,Izzydelp@gmail.com,Not captured,701938738,,Not captured,Not captured,Not captured,Not captured,Not captured,Not captured,
Not captured,Not captured,07/22/2019,Not captured,Not captured,863949,020,00072,ARS-02-0051644,Beacon America,Not captured,Not captured,Not captured,Passport(EB8183052),,,Zhang,Hengrui,,06/26/2007,male,Not captured,Not captured,Not captured,Not captured,Not captured,Not captured,Not captured,Not captured,Not captured,Not captured,Not captured,Not captured,Not captured,Li Li,Mother,Not captured,Not captured,Not captured,Not captured,4615 133RD ST NW,,GIG Harbor,,98332,2535458113,,Not captured,Not captured,Lili.219@outlook.com,Not captured,701938734,,Not captured,Not captured,Not captured,Not captured,Not captured,Not captured,
Not captured,Not captured,07/22/2019,Not captured,Not captured,863949,020,00072,ARS-01-0051642,Beacon International,Not captured,Not captured,Not captured,,,,Nicozisis,Magdalena,S,03/10/1981,female,Not captured,Not captured,Not captured,Not captured,Not captured,Not captured,Not captured,Not captured,Not captured,Not captured,Not captured,Not captured,Not captured,James Nicozisis,Husband,Not captured,Not captured,Not captured,Not captured,145 Park Avenue,,West Harrison,New York,10604,9145252537,,Not captured,Not captured,JNICOZISIS@aol.com,Not captured,701938732,,Not captured,Not captured,Not captured,Not captured,Not captured,Not captured,
Not captured,Not captured,07/22/2019,Not captured,Not captured,863949,020,00072,ARS-01-0051641,Beacon International,Not captured,Not captured,Not captured,Passport(529279230),,,Nicozisis,Victoria,,11/30/2009,female,Not captured,Not captured,Not captured,Not captured,Not captured,Not captured,Not captured,Not captured,Not captured,Not captured,Not captured,Not captured,Not captured,James Nicozisis,Father,Not captured,Not captured,Not captured,Not captured,145 Park Avenue,,West Harrison,New York,10604,9145252537,,Not captured,Not captured,JNICOZISIS@aol.com,Not captured,701938731,,Not captured,Not captured,Not captured,Not captured,Not captured,Not captured,
Not captured,Not captured,07/22/2019,Not captured,Not captured,863949,020,00072,ARS-01-0051640,Beacon International,Not captured,Not captured,Not captured,Passport(560343148),,,Nicozisis,Olivia,S,06/21/2006,female,Not captured,Not captured,Not captured,Not captured,Not captured,Not captured,Not captured,Not captured,Not captured,Not captured,Not captured,Not captured,Not captured,James Nicozisis,Father,Not captured,Not captured,Not captured,Not captured,145 Park Avenue,,West Harrison,New York,10604,9145252537,,Not captured,Not captured,JNICOZISIS@aol.com,Not captured,701938730,,Not captured,Not captured,Not captured,Not captured,Not captured,Not captured,
Not captured,Not captured,07/22/2019,Not captured,Not captured,863949,020,00072,ARS-01-0051639,Beacon International,Not captured,Not captured,Not captured,,,,Bakhash,Diana,,11/30/1969,female,Not captured,Not captured,Not captured,Not captured,Not captured,Not captured,Not captured,Not captured,Not captured,Not captured,Not captured,Not captured,Not captured,,,Not captured,Not captured,Not captured,Not captured,50 longfellow Rd.,,Great Neck,New York,11023,,,Not captured,Not captured,2440777@gmail.com,Not captured,701938729,,Not captured,Not captured,Not captured,Not captured,Not captured,Not captured,
Not captured,Not captured,07/22/2019,Not captured,Not captured,863949,020,00072,ARS-01-0051638,Beacon International,Not captured,Not captured,Not captured,,,,Sheena,Hasson,,07/24/1962,male,Not captured,Not captured,Not captured,Not captured,Not captured,Not captured,Not captured,Not captured,Not captured,Not captured,Not captured,Not captured,Not captured,,,Not captured,Not captured,Not captured,Not captured,50 longfellow Rd.,,Great Neck,New York,11023,,,Not captured,Not captured,2440777@gmail.com,Not captured,701938728,,Not captured,Not captured,Not captured,Not captured,Not captured,Not captured,
Not captured,Not captured,07/22/2019,Not captured,Not captured,863949,020,00072,ARS-02-0051636,Beacon America,Not captured,Not captured,Not captured,,,,Keebler,Benjamin,E,07/28/2012,male,Not captured,Not captured,Not captured,Not captured,Not captured,Not captured,Not captured,Not captured,Not captured,Not captured,Not captured,Not captured,Not captured,,,Not captured,Not captured,Not captured,Not captured,162 W. Plant St.,,Winter Garden,,34787,,,Not captured,Not captured,glennb@birket.com,Not captured,701938725,,Not captured,Not captured,Not captured,Not captured,Not captured,Not captured,
Not captured,Not captured,07/22/2019,Not captured,Not captured,863949,020,00072,ARS-01-0051632,Beacon International,Not captured,Not captured,Not captured,,,,Goel,Poonam,,09/23/1955,female,Not captured,Not captured,Not captured,Not captured,Not captured,Not captured,Not captured,Not captured,Not captured,Not captured,Not captured,Not captured,Not captured,Priyanka Goel,Daughter,Not captured,Not captured,Not captured,Not captured,98 Ridgeview Drive,,Atherton,,94027,650-854-6749,650-868-9667,Not captured,Not captured,priyanka.goel@gmail.com,Not captured,701938719,,Not captured,Not captured,Not captured,Not captured,Not captured,Not captured,
Not captured,Not captured,07/23/2019,Not captured,Not captured,863949,020,00072,ARS-01-0051631,Beacon International,Not captured,Not captured,Not captured,Passport(516619462),,,Gitto,Tyler,,03/03/1994,male,Not captured,Not captured,Not captured,Not captured,Not captured,Not captured,Not captured,Not captured,Not captured,Not captured,Not captured,Not captured,Not captured,,,Not captured,Not captured,Not captured,Not captured,11768 lake Baldwin dr,,Bristow,Virginia,20136,6313759475,,Not captured,Not captured,tg357pscr@hotmail.com,Not captured,701938718,,Not captured,Not captured,Not captured,Not captured,Not captured,Not captured,
Not captured,Not captured,07/22/2019,Not captured,Not captured,863949,020,00072,ARS-01-0051630,Beacon International,Not captured,Not captured,Not captured,,,,Goel,Prabhakar,,01/16/1949,male,Not captured,Not captured,Not captured,Not captured,Not captured,Not captured,Not captured,Not captured,Not captured,Not captured,Not captured,Not captured,Not captured,Priyanka Goel,Daughter,Not captured,Not captured,Not captured,Not captured,98 Ridgeview Drive,,Atherton,California,94027,650-224-7729,,Not captured,Not captured,prabhugoel@gmail.com,Not captured,701938717,,Not captured,Not captured,Not captured,Not captured,Not captured,Not captured,
Not captured,Not captured,07/21/2019,Not captured,Not captured,863949,020,00072,ARS-01-0051626,Beacon International,Not captured,Not captured,Not captured,,,,Farrant,Darrin,S,04/23/1974,male,Not captured,Not captured,Not captured,Not captured,Not captured,Not captured,Not captured,Not captured,Not captured,Not captured,Not captured,Not captured,Not captured,,,Not captured,Not captured,Not captured,Not captured,4545 Center Boulevard,,LONG ISLAND CITY,New York,11109,,,Not captured,Not captured,darrinfarrant@hotmail.com,Not captured,701938713,,Not captured,Not captured,Not captured,Not captured,Not captured,Not captured,
Not captured,Not captured,07/21/2019,Not captured,Not captured,863949,020,00072,ARS-01-0051625,Beacon International,Not captured,Not captured,Not captured,,,,Robinson,Neil,D,04/27/1969,male,Not captured,Not captured,Not captured,Not captured,Not captured,Not captured,Not captured,Not captured,Not captured,Not captured,Not captured,Not captured,Not captured,,,Not captured,Not captured,Not captured,Not captured,4545 Center Boulevard,,LONG ISLAND CITY,New York,11109,,,Not captured,Not captured,darrinfarrant@hotmail.com,Not captured,701938712,,Not captured,Not captured,Not captured,Not captured,Not captured,Not captured,
Not captured,Not captured,07/21/2019,Not captured,Not captured,863949,020,00072,ARS-01-0051622,Beacon International,Not captured,Not captured,Not captured,,,,Abrosimov,Victor,,07/27/1984,male,Not captured,Not captured,Not captured,Not captured,Not captured,Not captured,Not captured,Not captured,Not captured,Not captured,Not captured,Not captured,Not captured,,,Not captured,Not captured,Not captured,Not captured,2645 W. Bay Isle Dr SE,,St-Peterburg,Florida,33705,,,Not captured,Not captured,oabrosimova@yahoo.com,Not captured,701938709,,Not captured,Not captured,Not captured,Not captured,Not captured,Not captured,
Not captured,Not captured,07/21/2019,Not captured,Not captured,863949,020,00072,ARS-01-0051621,Beacon International,Not captured,Not captured,Not captured,,,,Gala,Alison,,09/30/1993,female,Not captured,Not captured,Not captured,Not captured,Not captured,Not captured,Not captured,Not captured,Not captured,Not captured,Not captured,Not captured,Not captured,,,Not captured,Not captured,Not captured,Not captured,22 Helmsford Way,,Penfield,New York,14526,,,Not captured,Not captured,aegala@syr.edu,Not captured,701938708,,Not captured,Not captured,Not captured,Not captured,Not captured,Not captured,
Not captured,Not captured,07/21/2019,Not captured,Not captured,863949,020,00072,ARS-01-0051620,Beacon International,Not captured,Not captured,Not captured,,,,Katz,Harley,,10/02/1990,male,Not captured,Not captured,Not captured,Not captured,Not captured,Not captured,Not captured,Not captured,Not captured,Not captured,Not captured,Not captured,Not captured,,,Not captured,Not captured,Not captured,Not captured,274 Collingwood Street,,San Fransisco,California,94114,,,Not captured,Not captured,harley@probablygenetic.com,Not captured,701938707,,Not captured,Not captured,Not captured,Not captured,Not captured,Not captured,
Not captured,Not captured,07/22/2019,Not captured,Not captured,863949,020,00072,ARS-02-0051616,Beacon America,Not captured,Not captured,Not captured,,,,Garrels,Georiga,,09/20/2004,female,Not captured,Not captured,Not captured,Not captured,Not captured,Not captured,Not captured,Not captured,Not captured,Not captured,Not captured,Not captured,Not captured,,,Not captured,Not captured,Not captured,Not captured,519 McCrea Dr,,Peterborough,Ontario,K9K1C4,,,Not captured,Not captured,andersongarrels@mac.com,Not captured,701938703,,Not captured,Not captured,Not captured,Not captured,Not captured,Not captured,
Not captured,Not captured,07/23/2019,Not captured,Not captured,863949,020,00072,ARS-01-0051613,Beacon International,Not captured,Not captured,Not captured,,,,RONDLA,ARJUN,R,03/29/2001,male,Not captured,Not captured,Not captured,Not captured,Not captured,Not captured,Not captured,Not captured,Not captured,Not captured,Not captured,Not captured,Not captured,RAJENDAR RONDLA,SPOUSE,Not captured,Not captured,Not captured,Not captured,18807 VALLEY COVE DR,,CYPRESS,Texas,77433,8323024986,3464069018,Not captured,Not captured,RAJKUMAR07@GMAIL.COM,Not captured,701938700,,Not captured,Not captured,Not captured,Not captured,Not captured,Not captured,
Not captured,Not captured,07/23/2019,Not captured,Not captured,863949,020,00072,ARS-01-0051612,Beacon International,Not captured,Not captured,Not captured,Passport(502472355),,,GANDRA,SUSHMA,R,06/14/1974,female,Not captured,Not captured,Not captured,Not captured,Not captured,Not captured,Not captured,Not captured,Not captured,Not captured,Not captured,Not captured,Not captured,RAJENDAR RONDLA,SPOUSE,Not captured,Not captured,Not captured,Not captured,18807 VALLEY COVE DR,,CYPRESS,Texas,77433,8323024986,3464069018,Not captured,Not captured,RAJKUMAR07@GMAIL.COM,Not captured,701938699,,Not captured,Not captured,Not captured,Not captured,Not captured,Not captured,
Not captured,Not captured,07/22/2019,Not captured,Not captured,863949,020,00072,ARS-01-0051609,Beacon International,Not captured,Not captured,Not captured,Passport(543408648),,,Kandell,Jacqueline,H,03/15/1995,female,Not captured,Not captured,Not captured,Not captured,Not captured,Not captured,Not captured,Not captured,Not captured,Not captured,Not captured,Not captured,Not captured,Robert N. Kandell,Father,Not captured,Not captured,Not captured,Not captured,5 Amys Path,,East Quogue,New York,11942,6316533911,,Not captured,Not captured,jacquikayy@aim.com,Not captured,701938695,,Not captured,Not captured,Not captured,Not captured,Not captured,Not captured,
Not captured,Not captured,07/21/2019,Not captured,Not captured,863949,020,00072,ARS-01-0051583,Beacon International,Not captured,Not captured,Not captured,Passport(F788625),,,Llobet Rodriguez,Javier,,05/04/1959,male,Not captured,Not captured,Not captured,Not captured,Not captured,Not captured,Not captured,Not captured,Not captured,Not captured,Not captured,Not captured,Not captured,,,Not captured,Not captured,Not captured,Not captured,2425 Wilson Blvd,,Arlington,Virginia,22201,7038415641,,Not captured,Not captured,pamruthkumar@ncsc.org,Not captured,701938630,,Not captured,Not captured,Not captured,Not captured,Not captured,Not captured,
Not captured,Not captured,07/22/2019,Not captured,Not captured,863949,020,00072,ARS-02-0051582,Beacon America,Not captured,Not captured,Not captured,,,,Garrels,Georgia,,09/20/2004,female,Not captured,Not captured,Not captured,Not captured,Not captured,Not captured,Not captured,Not captured,Not captured,Not captured,Not captured,Not captured,Not captured,,,Not captured,Not captured,Not captured,Not captured,519 McCrea Dr,,Peterborough,Ontario,K9K1C4,,,Not captured,Not captured,andersongarrels@mac.com,Not captured,701938629,,Not captured,Not captured,Not captured,Not captured,Not captured,Not captured,
Not captured,Not captured,07/21/2019,Not captured,Not captured,863949,020,00072,ARS-01-0051575,Beacon International,Not captured,Not captured,Not captured,,,,Munoz Acosta,Elias,M,04/30/1980,male,Not captured,Not captured,Not captured,Not captured,Not captured,Not captured,Not captured,Not captured,Not captured,Not captured,Not captured,Not captured,Not captured,Elias M Munoz,Father,Not captured,Not captured,Not captured,Not captured,7225 Northwest 25th Street,,Miami,Florida,33122,7866024187,,Not captured,Not captured,eliahwood@gmail.com,Not captured,701938622,,Not captured,Not captured,Not captured,Not captured,Not captured,Not captured,
Not captured,Not captured,07/21/2019,Not captured,Not captured,863949,020,00072,ARS-01-0051504,Beacon International,Not captured,Not captured,Not captured,,,,Grunbaum,Ed,,08/20/1975,male,Not captured,Not captured,Not captured,Not captured,Not captured,Not captured,Not captured,Not captured,Not captured,Not captured,Not captured,Not captured,Not captured,,,Not captured,Not captured,Not captured,Not captured,2 Hawghorne street,,Lakewood,New Jersey,08701,908-910-8753,,Not captured,Not captured,edgrunbaum@gmail.xom,Not captured,701938412,,Not captured,Not captured,Not captured,Not captured,Not captured,Not captured,
Not captured,Not captured,07/21/2019,Not captured,Not captured,863949,020,00072,ARS-03-0051228,Essential America,Not captured,Not captured,Not captured,Passport(576269608),,,Raboin,Natalie,Jeanne,01/26/1989,female,Not captured,Not captured,Not captured,Not captured,Not captured,Not captured,Not captured,Not captured,Not captured,Not captured,Not captured,Not captured,Not captured,,,Not captured,Not captured,Not captured,Not captured,4303 Michican Ave,,Chattanooga,Tennessee,37409,5732533054,,Not captured,Not captured,natalieraboin@gmail.com,Not captured,701937930,,Not captured,Not captured,Not captured,Not captured,Not captured,Not captured,
Not captured,Not captured,07/22/2019,Not captured,Not captured,863949,020,00072,ARS-02-0051406,Beacon America,Not captured,Not captured,Not captured,,,,Zuckerman,Aliza,,03/13/2019,female,Not captured,Not captured,Not captured,Not captured,Not captured,Not captured,Not captured,Not captured,Not captured,Not captured,Not captured,Not captured,Not captured,,,Not captured,Not captured,Not captured,Not captured,439 North Lake drive,,Lakeowwod,New Jersey,08701,848-525-1372,,Not captured,Not captured,yzuckerman@gmail.com,Not captured,701938269,,Not captured,Not captured,Not captured,Not captured,Not captured,Not captured,
Not captured,Not captured,07/21/2019,Not captured,Not captured,863949,020,00072,ARS-03-0051051,Essential America,Not captured,Not captured,Not captured,Passport(536601594),,,Winston,Jessica,Renee,09/02/1989,female,Not captured,Not captured,Not captured,Not captured,Not captured,Not captured,Not captured,Not captured,Not captured,Not captured,Not captured,Not captured,Not captured,,,Not captured,Not captured,Not captured,Not captured,309 Grant 439,,Sheridan,Arkansas,72150,8709178343,,Not captured,Not captured,jessicarwinston@gmail.com,Not captured,701937528,,Not captured,Not captured,Not captured,Not captured,Not captured,Not captured,
Not captured,Not captured,07/23/2019,Not captured,Not captured,863949,020,00072,ARS-02-0051321,Beacon America,Not captured,Not captured,Not captured,Passport(na),,,Padilla Estrada,Edward Camilo,,06/14/1987,male,Not captured,Not captured,Not captured,Not captured,Not captured,Not captured,Not captured,Not captured,Not captured,Not captured,Not captured,Not captured,Not captured,estate,na,Not captured,Not captured,Not captured,Not captured,National Center for State Courts,,Bogota,Distrito Capltal de Santa Fe de Bogot&atilde;,na,5714898640 114,,Not captured,Not captured,yrodriguez@ncsc.co,Not captured,701938084,,Not captured,Not captured,Not captured,Not captured,Not captured,Not captured,
Not captured,Not captured,07/23/2019,Not captured,Not captured,863949,020,00072,ARS-02-0051320,Beacon America,Not captured,Not captured,Not captured,Passport(na),,,Corrales Moreno,Jhon Carlos,,03/22/1985,male,Not captured,Not captured,Not captured,Not captured,Not captured,Not captured,Not captured,Not captured,Not captured,Not captured,Not captured,Not captured,Not captured,estate,na,Not captured,Not captured,Not captured,Not captured,National Center for State Courts,,Bogota,Distrito Capltal de Santa Fe de Bogot&atilde;,na,5714898640 114,,Not captured,Not captured,yrodriguez@ncsc.co,Not captured,701938083,,Not captured,Not captured,Not captured,Not captured,Not captured,Not captured,