EE Transaction Type,Dependent Transaction Type,Effective Date,EE Signature,EE Signature Date,Control,Suffix,Account,Plan Number,Plan Name,Claim Office,Network ID Number,Customer Code,EE SSN,Dependent SSN,Dependent Relationship,Last Name,First Name,Middle Initial,DOB,Gender,Ethnicity,PCP/PCD,PCP/PCD Current Patient,Provider Cap Office Number,COB,Dep Student Indicator,Dep OOA Indicator,EE Prior Coverage Indicator,EE Late Entrant,EE Language Indicator,Hire Date,Earnings,Earnings Frequency,Beneficiary (Last Name First Name MI),Beneficiary Relationship,Continuation of Coverage Expiration Date,Continuation of Coverage Event Date,Continuation of Coverage Length of Coverage,Work Location Zip Code,Street Address Line 1,Street Address Line 2,City,State,Zip Code,Home Phone Number,Work Phone Number,Accept Code,Evidence Code,EE Email Address,Communication Disability Code,EE Alternate ID,Dep Alternate ID,Old Control,Old Suffix,Old Account,New Control,New Suffix,New Account,
Not captured,Not captured,07/20/2019,Not captured,Not captured,863949,020,00072,ARS-02-0051600,Beacon America,Not captured,Not captured,Not captured,,,,GATT,GORDON,,05/20/1969,male,Not captured,Not captured,Not captured,Not captured,Not captured,Not captured,Not captured,Not captured,Not captured,Not captured,Not captured,Not captured,Not captured,,,Not captured,Not captured,Not captured,Not captured,4 AKAL TRACE,,SANTA CRUZ,SANTA CRUZ,000000,1-868-724-7602,,Not captured,Not captured,GGATT@SHEPPARD.TT,Not captured,701938678,,Not captured,Not captured,Not captured,Not captured,Not captured,Not captured,
Not captured,Not captured,07/19/2019,Not captured,Not captured,863949,020,00072,ARS-01-0051598,Beacon International,Not captured,Not captured,Not captured,,,,Sachon,Logan,,05/19/1984,female,Not captured,Not captured,Not captured,Not captured,Not captured,Not captured,Not captured,Not captured,Not captured,Not captured,Not captured,Not captured,Not captured,,,Not captured,Not captured,Not captured,Not captured,226 W 4th St,,NEW YORK,New York,10014-3166,,,Not captured,Not captured,logan.sachon@gmail.com,Not captured,701938664,,Not captured,Not captured,Not captured,Not captured,Not captured,Not captured,
Not captured,Not captured,07/19/2019,Not captured,Not captured,863949,020,00072,ARS-01-0051597,Beacon International,Not captured,Not captured,Not captured,,,,Lehrer,Barnet,,02/12/1950,male,Not captured,Not captured,Not captured,Not captured,Not captured,Not captured,Not captured,Not captured,Not captured,Not captured,Not captured,Not captured,Not captured,,,Not captured,Not captured,Not captured,Not captured,421 East 2nd St,,Brooklyn,New York,11218,,,Not captured,Not captured,blehrer@intlecom.com,Not captured,701938663,,Not captured,Not captured,Not captured,Not captured,Not captured,Not captured,
Not captured,Not captured,07/19/2019,Not captured,Not captured,863949,020,00072,ARS-01-0051581,Beacon International,Not captured,Not captured,Not captured,,,,Bennoune,Karima,,06/25/1967,female,Not captured,Not captured,Not captured,Not captured,Not captured,Not captured,Not captured,Not captured,Not captured,Not captured,Not captured,Not captured,Not captured,,,Not captured,Not captured,Not captured,Not captured,4042 Robina,,Berkley,Michigan,48072,,,Not captured,Not captured,kebennoune@ucdavis.edu,Not captured,701938628,,Not captured,Not captured,Not captured,Not captured,Not captured,Not captured,
Not captured,Not captured,07/19/2019,Not captured,Not captured,863949,020,00072,ARS-01-0051580,Beacon International,Not captured,Not captured,Not captured,,,,Brook,Kayla,N,04/27/1989,female,Not captured,Not captured,Not captured,Not captured,Not captured,Not captured,Not captured,Not captured,Not captured,Not captured,Not captured,Not captured,Not captured,,,Not captured,Not captured,Not captured,Not captured,217 Buck Circle,,Clanton,Alabama,35045,,,Not captured,Not captured,kaylabrook1@gmail.com,Not captured,701938627,,Not captured,Not captured,Not captured,Not captured,Not captured,Not captured,
Not captured,Not captured,07/19/2019,Not captured,Not captured,863949,020,00072,ARS-02-0051579,Beacon America,Not captured,Not captured,Not captured,,,,Stanton,Zachary,,03/29/1994,male,Not captured,Not captured,Not captured,Not captured,Not captured,Not captured,Not captured,Not captured,Not captured,Not captured,Not captured,Not captured,Not captured,,,Not captured,Not captured,Not captured,Not captured,1900 Little Raven St. #405,,Denver,Colorado,80202,,,Not captured,Not captured,zmomma94@yahoo.com,Not captured,701938626,,Not captured,Not captured,Not captured,Not captured,Not captured,Not captured,
Not captured,Not captured,07/19/2019,Not captured,Not captured,863949,020,00072,ARS-02-0051578,Beacon America,Not captured,Not captured,Not captured,,,,Stanton,Joanne,,10/22/1960,female,Not captured,Not captured,Not captured,Not captured,Not captured,Not captured,Not captured,Not captured,Not captured,Not captured,Not captured,Not captured,Not captured,,,Not captured,Not captured,Not captured,Not captured,1900 Little Raven St. #405,,Denver,Colorado,80202,,,Not captured,Not captured,zmomma94@yahoo.com,Not captured,701938625,,Not captured,Not captured,Not captured,Not captured,Not captured,Not captured,
Not captured,Not captured,07/19/2019,Not captured,Not captured,863949,020,00072,ARS-01-0051577,Beacon International,Not captured,Not captured,Not captured,,,,Alden,Cora,,06/04/2002,female,Not captured,Not captured,Not captured,Not captured,Not captured,Not captured,Not captured,Not captured,Not captured,Not captured,Not captured,Not captured,Not captured,,,Not captured,Not captured,Not captured,Not captured,7018 MEADOWBROOK DRIVE,,MANDEVILLE,Louisiana,70471,,,Not captured,Not captured,ashjsteele@aol.com,Not captured,701938624,,Not captured,Not captured,Not captured,Not captured,Not captured,Not captured,
Not captured,Not captured,07/19/2019,Not captured,Not captured,863949,020,00072,ARS-01-0051576,Beacon International,Not captured,Not captured,Not captured,,,,Alden,William,,06/04/1959,male,Not captured,Not captured,Not captured,Not captured,Not captured,Not captured,Not captured,Not captured,Not captured,Not captured,Not captured,Not captured,Not captured,,,Not captured,Not captured,Not captured,Not captured,7018 MEADOWBROOK DRIVE,,MANDEVILLE,Louisiana,70471,,,Not captured,Not captured,ashjsteele@aol.com,Not captured,701938623,,Not captured,Not captured,Not captured,Not captured,Not captured,Not captured,
Not captured,Not captured,07/20/2019,Not captured,Not captured,863949,020,00072,ARS-01-0051573,Beacon International,Not captured,Not captured,Not captured,,,,Hindle,Holly,,10/03/2010,female,Not captured,Not captured,Not captured,Not captured,Not captured,Not captured,Not captured,Not captured,Not captured,Not captured,Not captured,Not captured,Not captured,,,Not captured,Not captured,Not captured,Not captured,1128 Gambelli Drive,,York Town Heights,New York,10598,,,Not captured,Not captured,veronikahindle@gmail.com,Not captured,701938620,,Not captured,Not captured,Not captured,Not captured,Not captured,Not captured,
Not captured,Not captured,07/20/2019,Not captured,Not captured,863949,020,00072,ARS-01-0051572,Beacon International,Not captured,Not captured,Not captured,,,,Hindle,Keith,,08/29/1969,male,Not captured,Not captured,Not captured,Not captured,Not captured,Not captured,Not captured,Not captured,Not captured,Not captured,Not captured,Not captured,Not captured,,,Not captured,Not captured,Not captured,Not captured,1128 Gambelli Drive,,York Town Heights,New York,10598,,,Not captured,Not captured,veronikahindle@gmail.com,Not captured,701938619,,Not captured,Not captured,Not captured,Not captured,Not captured,Not captured,
Not captured,Not captured,07/20/2019,Not captured,Not captured,863949,020,00072,ARS-01-0051571,Beacon International,Not captured,Not captured,Not captured,,,,Hindle,Veronika,,08/12/1976,female,Not captured,Not captured,Not captured,Not captured,Not captured,Not captured,Not captured,Not captured,Not captured,Not captured,Not captured,Not captured,Not captured,,,Not captured,Not captured,Not captured,Not captured,1128 Gambelli Drive,,York Town Heights,New York,10598,,,Not captured,Not captured,veronikahindle@gmail.com,Not captured,701938618,,Not captured,Not captured,Not captured,Not captured,Not captured,Not captured,
Not captured,Not captured,07/18/2019,Not captured,Not captured,863949,020,00072,ARS-02-0051570,Beacon America,Not captured,Not captured,Not captured,,,,Weig,Aharon ,,07/23/1950,male,Not captured,Not captured,Not captured,Not captured,Not captured,Not captured,Not captured,Not captured,Not captured,Not captured,Not captured,Not captured,Not captured,,,Not captured,Not captured,Not captured,Not captured,34 Rebbe Akiva Street,,Modin Elit,HaZafon,901002,402-460-0968,,Not captured,Not captured,bavabasra@gmail.com,Not captured,701938617,,Not captured,Not captured,Not captured,Not captured,Not captured,Not captured,
Not captured,Not captured,07/20/2019,Not captured,Not captured,863949,020,00072,ARS-01-0051569,Beacon International,Not captured,Not captured,Not captured,,,,Twerski,Shaindel,,09/24/2003,female,Not captured,Not captured,Not captured,Not captured,Not captured,Not captured,Not captured,Not captured,Not captured,Not captured,Not captured,Not captured,Not captured,,,Not captured,Not captured,Not captured,Not captured,286 Coles Way,,Lakewood,New Jersey,08701,732-8863221,,Not captured,Not captured,twerski675@gmail.com,Not captured,701938616,,Not captured,Not captured,Not captured,Not captured,Not captured,Not captured,
Not captured,Not captured,07/19/2019,Not captured,Not captured,863949,020,00072,ARS-01-0051568,Beacon International,Not captured,Not captured,Not captured,,,,Wilkie,Simeon,D,05/30/1990,male,Not captured,Not captured,Not captured,Not captured,Not captured,Not captured,Not captured,Not captured,Not captured,Not captured,Not captured,Not captured,Not captured,,,Not captured,Not captured,Not captured,Not captured,3610 Westwood Boulevard,,Los Angeles,California,90034,,,Not captured,Not captured,rach.zovi@gmail.com,Not captured,701938615,,Not captured,Not captured,Not captured,Not captured,Not captured,Not captured,
Not captured,Not captured,07/19/2019,Not captured,Not captured,863949,020,00072,ARS-01-0051567,Beacon International,Not captured,Not captured,Not captured,,,,Wilkie,Rachel,Z,12/27/1990,female,Not captured,Not captured,Not captured,Not captured,Not captured,Not captured,Not captured,Not captured,Not captured,Not captured,Not captured,Not captured,Not captured,,,Not captured,Not captured,Not captured,Not captured,3610 Westwood Boulevard,,Los Angeles,California,90034,,,Not captured,Not captured,rach.zovi@gmail.com,Not captured,701938614,,Not captured,Not captured,Not captured,Not captured,Not captured,Not captured,
Not captured,Not captured,07/18/2019,Not captured,Not captured,863949,020,00072,ARS-02-0051561,Beacon America,Not captured,Not captured,Not captured,Passport(063182399),,,Hazeli,Soheila,,07/23/1964,female,Not captured,Not captured,Not captured,Not captured,Not captured,Not captured,Not captured,Not captured,Not captured,Not captured,Not captured,Not captured,Not captured,,,Not captured,Not captured,Not captured,Not captured,3430 Galt Ocean Drive,,Fort Lauderdale,Florida,33308,7543887010,,Not captured,Not captured,mainstreetins@msn.com,Not captured,701938602,,Not captured,Not captured,Not captured,Not captured,Not captured,Not captured,
Not captured,Not captured,07/19/2019,Not captured,Not captured,863949,020,00072,ARS-01-0051559,Beacon International,Not captured,Not captured,Not captured,,,,Neslusan,Alexander,H,06/19/1987,male,Not captured,Not captured,Not captured,Not captured,Not captured,Not captured,Not captured,Not captured,Not captured,Not captured,Not captured,Not captured,Not captured,,,Not captured,Not captured,Not captured,Not captured,Yangguangli Apartment B2914 73 Nanguang Road,,Shenzhen,,5800000,,,Not captured,Not captured,deadfoxygrandpa@gmail.com,Not captured,701938559,,Not captured,Not captured,Not captured,Not captured,Not captured,Not captured,
Not captured,Not captured,07/18/2019,Not captured,Not captured,863949,020,00072,ARS-02-0051558,Beacon America,Not captured,Not captured,Not captured,,,,Krimus,Rita,,01/13/1965,female,Not captured,Not captured,Not captured,Not captured,Not captured,Not captured,Not captured,Not captured,Not captured,Not captured,Not captured,Not captured,Not captured,,,Not captured,Not captured,Not captured,Not captured,600 NE 191 Street,,Miami,Florida,33179,,,Not captured,Not captured,rita.krimus@gmail.com,Not captured,701938558,,Not captured,Not captured,Not captured,Not captured,Not captured,Not captured,
Not captured,Not captured,07/18/2019,Not captured,Not captured,863949,020,00072,ARS-02-0051557,Beacon America,Not captured,Not captured,Not captured,Passport(J9436182),,,Sarma,Savithri,,08/11/1946,female,Not captured,Not captured,Not captured,Not captured,Not captured,Not captured,Not captured,Not captured,Not captured,Not captured,Not captured,Not captured,Not captured,Adi L Narayan,Son,Not captured,Not captured,Not captured,Not captured,890 Bergen Street,,Brooklyn,New York,11238,9173452014,,Not captured,Not captured,aln.onlineorders@gmail.com,Not captured,701938557,,Not captured,Not captured,Not captured,Not captured,Not captured,Not captured,
Not captured,Not captured,07/19/2019,Not captured,Not captured,863949,020,00072,ARS-01-0051556,Beacon International,Not captured,Not captured,Not captured,Passport(505403230),,,Garrison,Joel,K,12/10/1960,male,Not captured,Not captured,Not captured,Not captured,Not captured,Not captured,Not captured,Not captured,Not captured,Not captured,Not captured,Not captured,Not captured,Suzanne M. Garrison,Spouse,Not captured,Not captured,Not captured,Not captured,5205 N Argonne Ln #4,,Spokane,,99212,4254185688,4254185686,Not captured,Not captured,joelsue.garrison@outlook.com,Not captured,701938556,,Not captured,Not captured,Not captured,Not captured,Not captured,Not captured,
Not captured,Not captured,07/17/2019,Not captured,Not captured,863949,020,00072,ARS-02-0051555,Beacon America,Not captured,Not captured,Not captured,,,,Selikhov,Andrei,,09/11/2004,male,Not captured,Not captured,Not captured,Not captured,Not captured,Not captured,Not captured,Not captured,Not captured,Not captured,Not captured,Not captured,Not captured,,,Not captured,Not captured,Not captured,Not captured,1981 E Aspen Grove Ct,,Draper,,84020,,,Not captured,Not captured,mdmitry1973@gmail.com,Not captured,701938555,,Not captured,Not captured,Not captured,Not captured,Not captured,Not captured,
Not captured,Not captured,07/18/2019,Not captured,Not captured,863949,020,00072,OVI-28-0051554,OverseasCare Visitors Insurance Plan,Not captured,Not captured,Not captured,Passport(J2221405),,,Avuthu,Roja Ramani,,03/18/1968,female,Not captured,Not captured,Not captured,Not captured,Not captured,Not captured,Not captured,Not captured,Not captured,Not captured,Not captured,Not captured,Not captured,,,Not captured,Not captured,Not captured,Not captured,4336 lacebark ln,,Naperville,Illinois,60564,6304417643,,Not captured,Not captured,venu.mukkala@gmail.com,Not captured,701938547,,Not captured,Not captured,Not captured,Not captured,Not captured,Not captured,
Not captured,Not captured,07/18/2019,Not captured,Not captured,863949,020,00072,OVI-28-0051553,OverseasCare Visitors Insurance Plan,Not captured,Not captured,Not captured,Passport(J2221405),,,Avuthu,Mohan Reddy,,05/10/1959,male,Not captured,Not captured,Not captured,Not captured,Not captured,Not captured,Not captured,Not captured,Not captured,Not captured,Not captured,Not captured,Not captured,,,Not captured,Not captured,Not captured,Not captured,4336 lacebark ln,,Naperville,Illinois,60564,6304417643,,Not captured,Not captured,venu.mukkala@gmail.com,Not captured,701938546,,Not captured,Not captured,Not captured,Not captured,Not captured,Not captured,
Not captured,Not captured,07/17/2019,Not captured,Not captured,863949,020,00072,ARS-02-0051552,Beacon America,Not captured,Not captured,Not captured,,,,broe,dennis,j,01/31/1953,male,Not captured,Not captured,Not captured,Not captured,Not captured,Not captured,Not captured,Not captured,Not captured,Not captured,Not captured,Not captured,Not captured,,,Not captured,Not captured,Not captured,Not captured,32 rue des fosses saint bernard,,Paris,,75005,,,Not captured,Not captured,dennis.broe@liu.edu,Not captured,701938545,,Not captured,Not captured,Not captured,Not captured,Not captured,Not captured,
Not captured,Not captured,07/18/2019,Not captured,Not captured,863949,020,00072,ARS-01-0051520,Beacon International,Not captured,Not captured,Not captured,,,,Zimova,Sarka,,09/18/1974,female,Not captured,Not captured,Not captured,Not captured,Not captured,Not captured,Not captured,Not captured,Not captured,Not captured,Not captured,Not captured,Not captured,,,Not captured,Not captured,Not captured,Not captured,Damac Park Central,,Dubai,,92502,,,Not captured,Not captured,scharka.z@seznam.cz,Not captured,701938498,,Not captured,Not captured,Not captured,Not captured,Not captured,Not captured,
Not captured,Not captured,07/17/2019,Not captured,Not captured,863949,020,00072,ARS-01-0051519,Beacon International,Not captured,Not captured,Not captured,,,,Azoulay,Judy,,06/28/2007,female,Not captured,Not captured,Not captured,Not captured,Not captured,Not captured,Not captured,Not captured,Not captured,Not captured,Not captured,Not captured,Not captured,,,Not captured,Not captured,Not captured,Not captured,14 Gevures Ari,,Lakewood,New Jersey,08701,732-995-4097,,Not captured,Not captured,jakyazoulay@gmail.com,Not captured,701938485,,Not captured,Not captured,Not captured,Not captured,Not captured,Not captured,
Not captured,Not captured,07/17/2019,Not captured,Not captured,863949,020,00072,ARS-01-0051511,Beacon International,Not captured,Not captured,Not captured,,,,Thobe,Marissa,A,12/03/1998,female,Not captured,Not captured,Not captured,Not captured,Not captured,Not captured,Not captured,Not captured,Not captured,Not captured,Not captured,Not captured,Not captured,,,Not captured,Not captured,Not captured,Not captured,515 Goucher Blvd,,Towson,Maryland,21286,,,Not captured,Not captured,acheimlich@hotmail.com,Not captured,701938440,,Not captured,Not captured,Not captured,Not captured,Not captured,Not captured,
Not captured,Not captured,07/17/2019,Not captured,Not captured,863949,020,00072,ARS-01-0051510,Beacon International,Not captured,Not captured,Not captured,,,,Thobe,Alexandra,N,01/31/1988,female,Not captured,Not captured,Not captured,Not captured,Not captured,Not captured,Not captured,Not captured,Not captured,Not captured,Not captured,Not captured,Not captured,,,Not captured,Not captured,Not captured,Not captured,515 Goucher Blvd,,Towson,Maryland,21286,,,Not captured,Not captured,acheimlich@hotmail.com,Not captured,701938429,,Not captured,Not captured,Not captured,Not captured,Not captured,Not captured,
Not captured,Not captured,07/18/2019,Not captured,Not captured,863949,020,00072,ARS-02-0051509,Beacon America,Not captured,Not captured,Not captured,,,,EINSTADTER,ELYAHU,B,12/30/2004,male,Not captured,Not captured,Not captured,Not captured,Not captured,Not captured,Not captured,Not captured,Not captured,Not captured,Not captured,Not captured,Not captured,,,Not captured,Not captured,Not captured,Not captured,6935 WILDORTON,,MONTREAL,Quebec,H3F2M4,,,Not captured,Not captured,geinstadter@gmail.com,Not captured,701938428,,Not captured,Not captured,Not captured,Not captured,Not captured,Not captured,
Not captured,Not captured,07/17/2019,Not captured,Not captured,863949,020,00072,ARS-01-0051507,Beacon International,Not captured,Not captured,Not captured,,,,Xie,Nathan,,10/22/2006,male,Not captured,Not captured,Not captured,Not captured,Not captured,Not captured,Not captured,Not captured,Not captured,Not captured,Not captured,Not captured,Not captured,,,Not captured,Not captured,Not captured,Not captured,12241 Caminito Mira Del Mar,,San Diego,California,92130,,,Not captured,Not captured,mianzhi@gmail.com,Not captured,701938416,,Not captured,Not captured,Not captured,Not captured,Not captured,Not captured,
Not captured,Not captured,07/17/2019,Not captured,Not captured,863949,020,00072,ARS-01-0051506,Beacon International,Not captured,Not captured,Not captured,,,,Takeuchi,Miho,,11/08/1968,female,Not captured,Not captured,Not captured,Not captured,Not captured,Not captured,Not captured,Not captured,Not captured,Not captured,Not captured,Not captured,Not captured,,,Not captured,Not captured,Not captured,Not captured,457 West 57th Street Apt 307,,New York,New York,10019,,,Not captured,Not captured,nornsny@gmail.com,Not captured,701938415,,Not captured,Not captured,Not captured,Not captured,Not captured,Not captured,
Not captured,Not captured,07/17/2019,Not captured,Not captured,863949,020,00072,ARS-01-0051505,Beacon International,Not captured,Not captured,Not captured,,,,Dyer,Michael,L,10/12/1993,male,Not captured,Not captured,Not captured,Not captured,Not captured,Not captured,Not captured,Not captured,Not captured,Not captured,Not captured,Not captured,Not captured,,,Not captured,Not captured,Not captured,Not captured,2100 Delgany,,Denver,Colorado,80202,,,Not captured,Not captured,michaellouisdyer@gmail.com,Not captured,701938414,,Not captured,Not captured,Not captured,Not captured,Not captured,Not captured,
Not captured,Not captured,07/18/2019,Not captured,Not captured,863949,020,00072,ARS-01-0051499,Beacon International,Not captured,Not captured,Not captured,,,,Raibley,Luca,L,08/08/2012,male,Not captured,Not captured,Not captured,Not captured,Not captured,Not captured,Not captured,Not captured,Not captured,Not captured,Not captured,Not captured,Not captured,Thaddeus K. Raibley,husband,Not captured,Not captured,Not captured,Not captured,6078 Ashley Plcae,,Goleta,California,93117,3173668752,,Not captured,Not captured,silke.m.werth@gmail.com,Not captured,701938405,,Not captured,Not captured,Not captured,Not captured,Not captured,Not captured,
Not captured,Not captured,07/18/2019,Not captured,Not captured,863949,020,00072,ARS-01-0051498,Beacon International,Not captured,Not captured,Not captured,,,,Raibley,Raphael,L,01/05/2010,male,Not captured,Not captured,Not captured,Not captured,Not captured,Not captured,Not captured,Not captured,Not captured,Not captured,Not captured,Not captured,Not captured,Thaddeus K. Raibley,husband,Not captured,Not captured,Not captured,Not captured,6078 Ashley Plcae,,Goleta,California,93117,3173668752,,Not captured,Not captured,silke.m.werth@gmail.com,Not captured,701938404,,Not captured,Not captured,Not captured,Not captured,Not captured,Not captured,
Not captured,Not captured,07/18/2019,Not captured,Not captured,863949,020,00072,ARS-01-0051497,Beacon International,Not captured,Not captured,Not captured,,,,Werth,Silke,,01/29/1982,female,Not captured,Not captured,Not captured,Not captured,Not captured,Not captured,Not captured,Not captured,Not captured,Not captured,Not captured,Not captured,Not captured,Thaddeus K. Raibley,husband,Not captured,Not captured,Not captured,Not captured,6078 Ashley Plcae,,Goleta,California,93117,3173668752,,Not captured,Not captured,silke.m.werth@gmail.com,Not captured,701938403,,Not captured,Not captured,Not captured,Not captured,Not captured,Not captured,