EE Transaction Type,Dependent Transaction Type,Effective Date,EE Signature,EE Signature Date,Control,Suffix,Account,Plan Number,Plan Name,Claim Office,Network ID Number,Customer Code,EE SSN,Dependent SSN,Dependent Relationship,Last Name,First Name,Middle Initial,DOB,Gender,Ethnicity,PCP/PCD,PCP/PCD Current Patient,Provider Cap Office Number,COB,Dep Student Indicator,Dep OOA Indicator,EE Prior Coverage Indicator,EE Late Entrant,EE Language Indicator,Hire Date,Earnings,Earnings Frequency,Beneficiary (Last Name First Name MI),Beneficiary Relationship,Continuation of Coverage Expiration Date,Continuation of Coverage Event Date,Continuation of Coverage Length of Coverage,Work Location Zip Code,Street Address Line 1,Street Address Line 2,City,State,Zip Code,Home Phone Number,Work Phone Number,Accept Code,Evidence Code,EE Email Address,Communication Disability Code,EE Alternate ID,Dep Alternate ID,Old Control,Old Suffix,Old Account,New Control,New Suffix,New Account,
Not captured,Not captured,07/21/2019,Not captured,Not captured,863949,020,00072,ARS-01-0051626,Beacon International,Not captured,Not captured,Not captured,,,,Farrant,Darrin,S,04/23/1974,male,Not captured,Not captured,Not captured,Not captured,Not captured,Not captured,Not captured,Not captured,Not captured,Not captured,Not captured,Not captured,Not captured,,,Not captured,Not captured,Not captured,Not captured,4545 Center Boulevard,,LONG ISLAND CITY,New York,11109,,,Not captured,Not captured,darrinfarrant@hotmail.com,Not captured,701938713,,Not captured,Not captured,Not captured,Not captured,Not captured,Not captured,
Not captured,Not captured,07/21/2019,Not captured,Not captured,863949,020,00072,ARS-01-0051625,Beacon International,Not captured,Not captured,Not captured,,,,Robinson,Neil,D,04/27/1969,male,Not captured,Not captured,Not captured,Not captured,Not captured,Not captured,Not captured,Not captured,Not captured,Not captured,Not captured,Not captured,Not captured,,,Not captured,Not captured,Not captured,Not captured,4545 Center Boulevard,,LONG ISLAND CITY,New York,11109,,,Not captured,Not captured,darrinfarrant@hotmail.com,Not captured,701938712,,Not captured,Not captured,Not captured,Not captured,Not captured,Not captured,
Not captured,Not captured,07/21/2019,Not captured,Not captured,863949,020,00072,ARS-01-0051622,Beacon International,Not captured,Not captured,Not captured,,,,Abrosimov,Victor,,07/27/1984,male,Not captured,Not captured,Not captured,Not captured,Not captured,Not captured,Not captured,Not captured,Not captured,Not captured,Not captured,Not captured,Not captured,,,Not captured,Not captured,Not captured,Not captured,2645 W. Bay Isle Dr SE,,St-Peterburg,Florida,33705,,,Not captured,Not captured,oabrosimova@yahoo.com,Not captured,701938709,,Not captured,Not captured,Not captured,Not captured,Not captured,Not captured,
Not captured,Not captured,07/21/2019,Not captured,Not captured,863949,020,00072,ARS-01-0051621,Beacon International,Not captured,Not captured,Not captured,,,,Gala,Alison,,09/30/1993,female,Not captured,Not captured,Not captured,Not captured,Not captured,Not captured,Not captured,Not captured,Not captured,Not captured,Not captured,Not captured,Not captured,,,Not captured,Not captured,Not captured,Not captured,22 Helmsford Way,,Penfield,New York,14526,,,Not captured,Not captured,aegala@syr.edu,Not captured,701938708,,Not captured,Not captured,Not captured,Not captured,Not captured,Not captured,
Not captured,Not captured,07/21/2019,Not captured,Not captured,863949,020,00072,ARS-01-0051620,Beacon International,Not captured,Not captured,Not captured,,,,Katz,Harley,,10/02/1990,male,Not captured,Not captured,Not captured,Not captured,Not captured,Not captured,Not captured,Not captured,Not captured,Not captured,Not captured,Not captured,Not captured,,,Not captured,Not captured,Not captured,Not captured,274 Collingwood Street,,San Fransisco,California,94114,,,Not captured,Not captured,harley@probablygenetic.com,Not captured,701938707,,Not captured,Not captured,Not captured,Not captured,Not captured,Not captured,
Not captured,Not captured,07/20/2019,Not captured,Not captured,863949,020,00072,ARS-02-0051600,Beacon America,Not captured,Not captured,Not captured,,,,GATT,GORDON,,05/20/1969,male,Not captured,Not captured,Not captured,Not captured,Not captured,Not captured,Not captured,Not captured,Not captured,Not captured,Not captured,Not captured,Not captured,,,Not captured,Not captured,Not captured,Not captured,4 AKAL TRACE,,SANTA CRUZ,SANTA CRUZ,000000,1-868-724-7602,,Not captured,Not captured,GGATT@SHEPPARD.TT,Not captured,701938678,,Not captured,Not captured,Not captured,Not captured,Not captured,Not captured,
Not captured,Not captured,07/21/2019,Not captured,Not captured,863949,020,00072,ARS-01-0051583,Beacon International,Not captured,Not captured,Not captured,Passport(F788625),,,Llobet Rodriguez,Javier,,05/04/1959,male,Not captured,Not captured,Not captured,Not captured,Not captured,Not captured,Not captured,Not captured,Not captured,Not captured,Not captured,Not captured,Not captured,,,Not captured,Not captured,Not captured,Not captured,2425 Wilson Blvd,,Arlington,Virginia,22201,7038415641,,Not captured,Not captured,pamruthkumar@ncsc.org,Not captured,701938630,,Not captured,Not captured,Not captured,Not captured,Not captured,Not captured,
Not captured,Not captured,07/21/2019,Not captured,Not captured,863949,020,00072,ARS-01-0051575,Beacon International,Not captured,Not captured,Not captured,,,,Munoz Acosta,Elias,M,04/30/1980,male,Not captured,Not captured,Not captured,Not captured,Not captured,Not captured,Not captured,Not captured,Not captured,Not captured,Not captured,Not captured,Not captured,Elias M Munoz,Father,Not captured,Not captured,Not captured,Not captured,7225 Northwest 25th Street,,Miami,Florida,33122,7866024187,,Not captured,Not captured,eliahwood@gmail.com,Not captured,701938622,,Not captured,Not captured,Not captured,Not captured,Not captured,Not captured,
Not captured,Not captured,07/20/2019,Not captured,Not captured,863949,020,00072,ARS-01-0051573,Beacon International,Not captured,Not captured,Not captured,,,,Hindle,Holly,,10/03/2010,female,Not captured,Not captured,Not captured,Not captured,Not captured,Not captured,Not captured,Not captured,Not captured,Not captured,Not captured,Not captured,Not captured,,,Not captured,Not captured,Not captured,Not captured,1128 Gambelli Drive,,York Town Heights,New York,10598,,,Not captured,Not captured,veronikahindle@gmail.com,Not captured,701938620,,Not captured,Not captured,Not captured,Not captured,Not captured,Not captured,
Not captured,Not captured,07/20/2019,Not captured,Not captured,863949,020,00072,ARS-01-0051572,Beacon International,Not captured,Not captured,Not captured,,,,Hindle,Keith,,08/29/1969,male,Not captured,Not captured,Not captured,Not captured,Not captured,Not captured,Not captured,Not captured,Not captured,Not captured,Not captured,Not captured,Not captured,,,Not captured,Not captured,Not captured,Not captured,1128 Gambelli Drive,,York Town Heights,New York,10598,,,Not captured,Not captured,veronikahindle@gmail.com,Not captured,701938619,,Not captured,Not captured,Not captured,Not captured,Not captured,Not captured,
Not captured,Not captured,07/20/2019,Not captured,Not captured,863949,020,00072,ARS-01-0051571,Beacon International,Not captured,Not captured,Not captured,,,,Hindle,Veronika,,08/12/1976,female,Not captured,Not captured,Not captured,Not captured,Not captured,Not captured,Not captured,Not captured,Not captured,Not captured,Not captured,Not captured,Not captured,,,Not captured,Not captured,Not captured,Not captured,1128 Gambelli Drive,,York Town Heights,New York,10598,,,Not captured,Not captured,veronikahindle@gmail.com,Not captured,701938618,,Not captured,Not captured,Not captured,Not captured,Not captured,Not captured,
Not captured,Not captured,07/20/2019,Not captured,Not captured,863949,020,00072,ARS-01-0051569,Beacon International,Not captured,Not captured,Not captured,,,,Twerski,Shaindel,,09/24/2003,female,Not captured,Not captured,Not captured,Not captured,Not captured,Not captured,Not captured,Not captured,Not captured,Not captured,Not captured,Not captured,Not captured,,,Not captured,Not captured,Not captured,Not captured,286 Coles Way,,Lakewood,New Jersey,08701,732-8863221,,Not captured,Not captured,twerski675@gmail.com,Not captured,701938616,,Not captured,Not captured,Not captured,Not captured,Not captured,Not captured,
Not captured,Not captured,07/21/2019,Not captured,Not captured,863949,020,00072,ARS-01-0051504,Beacon International,Not captured,Not captured,Not captured,,,,Grunbaum,Ed,,08/20/1975,male,Not captured,Not captured,Not captured,Not captured,Not captured,Not captured,Not captured,Not captured,Not captured,Not captured,Not captured,Not captured,Not captured,,,Not captured,Not captured,Not captured,Not captured,2 Hawghorne street,,Lakewood,New Jersey,08701,908-910-8753,,Not captured,Not captured,edgrunbaum@gmail.xom,Not captured,701938412,,Not captured,Not captured,Not captured,Not captured,Not captured,Not captured,
Not captured,Not captured,07/20/2019,Not captured,Not captured,863949,020,00072,ARS-02-0051487,Beacon America,Not captured,Not captured,Not captured,Passport(TB127380),,,FAJGENBAUM,PAUL,,04/06/1947,male,Not captured,Not captured,Not captured,Not captured,Not captured,Not captured,Not captured,Not captured,Not captured,Not captured,Not captured,Not captured,Not captured,,,Not captured,Not captured,Not captured,Not captured,NO 15 PERSEVERANCE ROAD,,MARAVAL,MARAVAL,0000,1-868-629-2511,,Not captured,Not captured,PAUL.FAJGENBAUM@GMAIL.COM,Not captured,701938393,,Not captured,Not captured,Not captured,Not captured,Not captured,Not captured,
Not captured,Not captured,07/21/2019,Not captured,Not captured,863949,020,00072,ARS-03-0051228,Essential America,Not captured,Not captured,Not captured,Passport(576269608),,,Raboin,Natalie,Jeanne,01/26/1989,female,Not captured,Not captured,Not captured,Not captured,Not captured,Not captured,Not captured,Not captured,Not captured,Not captured,Not captured,Not captured,Not captured,,,Not captured,Not captured,Not captured,Not captured,4303 Michican Ave,,Chattanooga,Tennessee,37409,5732533054,,Not captured,Not captured,natalieraboin@gmail.com,Not captured,701937930,,Not captured,Not captured,Not captured,Not captured,Not captured,Not captured,
Not captured,Not captured,07/21/2019,Not captured,Not captured,863949,020,00072,ARS-03-0051051,Essential America,Not captured,Not captured,Not captured,Passport(536601594),,,Winston,Jessica,Renee,09/02/1989,female,Not captured,Not captured,Not captured,Not captured,Not captured,Not captured,Not captured,Not captured,Not captured,Not captured,Not captured,Not captured,Not captured,,,Not captured,Not captured,Not captured,Not captured,309 Grant 439,,Sheridan,Arkansas,72150,8709178343,,Not captured,Not captured,jessicarwinston@gmail.com,Not captured,701937528,,Not captured,Not captured,Not captured,Not captured,Not captured,Not captured,
Not captured,Not captured,07/20/2019,Not captured,Not captured,863949,020,00072,ARS-01-0051296,Beacon International,Not captured,Not captured,Not captured,Passport(K0295295),,,SIUM,YOHANA,ASMELASH,01/01/1992,female,Not captured,Not captured,Not captured,Not captured,Not captured,Not captured,Not captured,Not captured,Not captured,Not captured,Not captured,Not captured,Not captured,,,Not captured,Not captured,Not captured,Not captured,denicapi12@gmail.com,,ASMARA,Central (Maekel),5896,5434140785,5434140785,Not captured,Not captured,denicapi12@gmail.com,Not captured,701938059,,Not captured,Not captured,Not captured,Not captured,Not captured,Not captured,
Not captured,Not captured,07/20/2019,Not captured,Not captured,863949,020,00072,ARS-01-0051104,Beacon International,Not captured,Not captured,Not captured,Passport(K0336875),,,GHEBREGZABIHER,GRMAY,TESFAY,11/26/1993,male,Not captured,Not captured,Not captured,Not captured,Not captured,Not captured,Not captured,Not captured,Not captured,Not captured,Not captured,Not captured,Not captured,,,Not captured,Not captured,Not captured,Not captured,denicapi12@gmail.com,,ASMARA,Central (Maekel),5896,5434140785,5434140785,Not captured,Not captured,denicapi12@gmail.com,Not captured,701937613,,Not captured,Not captured,Not captured,Not captured,Not captured,Not captured,
Not captured,Not captured,07/20/2019,Not captured,Not captured,863949,020,00072,ARS-01-0050713,Beacon International,Not captured,Not captured,Not captured,,,,Sanders,Jolene,J,04/03/1987,female,Not captured,Not captured,Not captured,Not captured,Not captured,Not captured,Not captured,Not captured,Not captured,Not captured,Not captured,Not captured,Not captured,Pieter Voskamp,Father of Jolene Sanders,Not captured,Not captured,Not captured,Not captured,69 East 23rd St.,,Hamilton,Ontario,L8V 2W7,905-387-0437,905-529-0166,Not captured,Not captured,jo.jo.vo@gmail.com,Not captured,701936633,,Not captured,Not captured,Not captured,Not captured,Not captured,Not captured,
Not captured,Not captured,07/20/2019,Not captured,Not captured,863949,020,00072,ARS-01-0050712,Beacon International,Not captured,Not captured,Not captured,,,,Sanders,Michael,S,01/31/1986,male,Not captured,Not captured,Not captured,Not captured,Not captured,Not captured,Not captured,Not captured,Not captured,Not captured,Not captured,Not captured,Not captured,Pieter Voskamp,Father of Jolene Sanders,Not captured,Not captured,Not captured,Not captured,69 East 23rd St.,,Hamilton,Ontario,L8V 2W7,905-387-0437,905-529-0166,Not captured,Not captured,jo.jo.vo@gmail.com,Not captured,701936632,,Not captured,Not captured,Not captured,Not captured,Not captured,Not captured