EE Transaction Type,Dependent Transaction Type,Effective Date,EE Signature,EE Signature Date,Control,Suffix,Account,Plan Number,Plan Name,Claim Office,Network ID Number,Customer Code,EE SSN,Dependent SSN,Dependent Relationship,Last Name,First Name,Middle Initial,DOB,Gender,Ethnicity,PCP/PCD,PCP/PCD Current Patient,Provider Cap Office Number,COB,Dep Student Indicator,Dep OOA Indicator,EE Prior Coverage Indicator,EE Late Entrant,EE Language Indicator,Hire Date,Earnings,Earnings Frequency,Beneficiary (Last Name First Name MI),Beneficiary Relationship,Continuation of Coverage Expiration Date,Continuation of Coverage Event Date,Continuation of Coverage Length of Coverage,Work Location Zip Code,Street Address Line 1,Street Address Line 2,City,State,Zip Code,Home Phone Number,Work Phone Number,Accept Code,Evidence Code,EE Email Address,Communication Disability Code,EE Alternate ID,Dep Alternate ID,Old Control,Old Suffix,Old Account,New Control,New Suffix,New Account,
Not captured,Not captured,07/16/2019,Not captured,Not captured,863949,020,00072,ARS-01-0051502,Beacon International,Not captured,Not captured,Not captured,,,,Feldbrand,Rivky,,08/08/1999,female,Not captured,Not captured,Not captured,Not captured,Not captured,Not captured,Not captured,Not captured,Not captured,Not captured,Not captured,Not captured,Not captured,,,Not captured,Not captured,Not captured,Not captured,624 east county Line road,,Lakewood,New Jersey,08701,732-552-9663,,Not captured,Not captured,cfeldbrand@yeshiva.com,Not captured,701938408,,Not captured,Not captured,Not captured,Not captured,Not captured,Not captured,
Not captured,Not captured,07/16/2019,Not captured,Not captured,863949,020,00072,ARS-01-0051501,Beacon International,Not captured,Not captured,Not captured,,,,Feldbrand,Cheye,,02/28/2003,female,Not captured,Not captured,Not captured,Not captured,Not captured,Not captured,Not captured,Not captured,Not captured,Not captured,Not captured,Not captured,Not captured,,,Not captured,Not captured,Not captured,Not captured,624 east county Line road,,Lakewood,New Jersey,08701,732-552-9663,,Not captured,Not captured,cfeldbrand@yeshiva.com,Not captured,701938407,,Not captured,Not captured,Not captured,Not captured,Not captured,Not captured,
Not captured,Not captured,07/16/2019,Not captured,Not captured,863949,020,00072,ARS-01-0051500,Beacon International,Not captured,Not captured,Not captured,,,,Gulseth,Randi,L,07/04/1956,female,Not captured,Not captured,Not captured,Not captured,Not captured,Not captured,Not captured,Not captured,Not captured,Not captured,Not captured,Not captured,Not captured,,,Not captured,Not captured,Not captured,Not captured,92098 Alderwood Rd,,Coos Bay,Oregon,97420,,,Not captured,Not captured,idnar56@gmail.com,Not captured,701938406,,Not captured,Not captured,Not captured,Not captured,Not captured,Not captured,
Not captured,Not captured,07/16/2019,Not captured,Not captured,863949,020,00072,ARS-01-0051496,Beacon International,Not captured,Not captured,Not captured,,,,Maxwell,Megan,,08/19/2000,female,Not captured,Not captured,Not captured,Not captured,Not captured,Not captured,Not captured,Not captured,Not captured,Not captured,Not captured,Not captured,Not captured,,,Not captured,Not captured,Not captured,Not captured,1845 Purdue Ave #4,,Los Angeles,California,90025,,,Not captured,Not captured,kirakira_bows@yahoo.co.jp,Not captured,701938402,,Not captured,Not captured,Not captured,Not captured,Not captured,Not captured,
Not captured,Not captured,07/16/2019,Not captured,Not captured,863949,020,00072,ARS-01-0051486,Beacon International,Not captured,Not captured,Not captured,,,,Krivograd,Keri,A,02/25/2004,female,Not captured,Not captured,Not captured,Not captured,Not captured,Not captured,Not captured,Not captured,Not captured,Not captured,Not captured,Not captured,Not captured,,,Not captured,Not captured,Not captured,Not captured,878 Columbia Cir,,North Aurora,Illinois,60542,6306498547,,Not captured,Not captured,allyson878@comcast.net,Not captured,701938392,,Not captured,Not captured,Not captured,Not captured,Not captured,Not captured,
Not captured,Not captured,07/16/2019,Not captured,Not captured,863949,020,00072,ARS-01-0051485,Beacon International,Not captured,Not captured,Not captured,,,,Krivograd,Allyson,A,11/15/1968,female,Not captured,Not captured,Not captured,Not captured,Not captured,Not captured,Not captured,Not captured,Not captured,Not captured,Not captured,Not captured,Not captured,,,Not captured,Not captured,Not captured,Not captured,878 Columbia Cir,,North Aurora,Illinois,60542,6306498547,,Not captured,Not captured,allyson878@comcast.net,Not captured,701938391,,Not captured,Not captured,Not captured,Not captured,Not captured,Not captured,
Not captured,Not captured,07/16/2019,Not captured,Not captured,863949,020,00072,ARS-01-0051484,Beacon International,Not captured,Not captured,Not captured,Passport(596421599),,,Krivograd,Andrew ,F,12/28/1965,male,Not captured,Not captured,Not captured,Not captured,Not captured,Not captured,Not captured,Not captured,Not captured,Not captured,Not captured,Not captured,Not captured,,,Not captured,Not captured,Not captured,Not captured,878 Columbia Cir,,North Aurora,Illinois,60542,6306498547,,Not captured,Not captured,allyson878@comcast.net,Not captured,701938390,,Not captured,Not captured,Not captured,Not captured,Not captured,Not captured,
Not captured,Not captured,07/15/2019,Not captured,Not captured,863949,020,00072,ARS-01-0051483,Beacon International,Not captured,Not captured,Not captured,,,,Schreiber,Barry,,12/27/2006,male,Not captured,Not captured,Not captured,Not captured,Not captured,Not captured,Not captured,Not captured,Not captured,Not captured,Not captured,Not captured,Not captured,,,Not captured,Not captured,Not captured,Not captured,1454 canter Bury rd,,Lakewood,New Jersey,08701,732-998-7315,,Not captured,Not captured,aks@firstrehab.com,Not captured,701938389,,Not captured,Not captured,Not captured,Not captured,Not captured,Not captured,
Not captured,Not captured,07/15/2019,Not captured,Not captured,863949,020,00072,ARS-01-0051482,Beacon International,Not captured,Not captured,Not captured,,,,Schreiber,Racher ,,03/30/1985,female,Not captured,Not captured,Not captured,Not captured,Not captured,Not captured,Not captured,Not captured,Not captured,Not captured,Not captured,Not captured,Not captured,,,Not captured,Not captured,Not captured,Not captured,1454 canter Bury rd,,Lakewood,New Jersey,08701,732-998-7315,,Not captured,Not captured,aks@firstrehab.com,Not captured,701938388,,Not captured,Not captured,Not captured,Not captured,Not captured,Not captured,
Not captured,Not captured,07/15/2019,Not captured,Not captured,863949,020,00072,ARS-01-0051481,Beacon International,Not captured,Not captured,Not captured,,,,Schreiber,Abraham K,,07/17/1981,male,Not captured,Not captured,Not captured,Not captured,Not captured,Not captured,Not captured,Not captured,Not captured,Not captured,Not captured,Not captured,Not captured,,,Not captured,Not captured,Not captured,Not captured,1454 canter Bury rd,,Lakewood,New Jersey,08701,732-998-7315,,Not captured,Not captured,aks@firstrehab.com,Not captured,701938387,,Not captured,Not captured,Not captured,Not captured,Not captured,Not captured,
Not captured,Not captured,07/15/2019,Not captured,Not captured,863949,020,00072,ARS-01-0051476,Beacon International,Not captured,Not captured,Not captured,,,,Nguyen,Christopher,K,06/06/1989,male,Not captured,Not captured,Not captured,Not captured,Not captured,Not captured,Not captured,Not captured,Not captured,Not captured,Not captured,Not captured,Not captured,,,Not captured,Not captured,Not captured,Not captured,11121 Lavender Lane,,Garden Grove,California,92840,,,Not captured,Not captured,ngaphan3221@yahoo.com,Not captured,701938364,,Not captured,Not captured,Not captured,Not captured,Not captured,Not captured,
Not captured,Not captured,07/15/2019,Not captured,Not captured,863949,020,00072,ARS-01-0051475,Beacon International,Not captured,Not captured,Not captured,,,,Hornig,Yossi,,09/16/2006,male,Not captured,Not captured,Not captured,Not captured,Not captured,Not captured,Not captured,Not captured,Not captured,Not captured,Not captured,Not captured,Not captured,,,Not captured,Not captured,Not captured,Not captured,9 Crossmere,,Lakewood,New Jersey,08701,732-886-5751,,Not captured,Not captured,mhornig3@gmail.com,Not captured,701938363,,Not captured,Not captured,Not captured,Not captured,Not captured,Not captured,
Not captured,Not captured,07/15/2019,Not captured,Not captured,863949,020,00072,ARS-01-0051474,Beacon International,Not captured,Not captured,Not captured,,,,Hornig,Meyer,,06/29/1977,male,Not captured,Not captured,Not captured,Not captured,Not captured,Not captured,Not captured,Not captured,Not captured,Not captured,Not captured,Not captured,Not captured,,,Not captured,Not captured,Not captured,Not captured,9 Crossmere,,Lakewood,New Jersey,08701,732-886-5751,,Not captured,Not captured,mhornig3@gmail.com,Not captured,701938362,,Not captured,Not captured,Not captured,Not captured,Not captured,Not captured,
Not captured,Not captured,07/15/2019,Not captured,Not captured,863949,020,00072,ARS-01-0051473,Beacon International,Not captured,Not captured,Not captured,,,,Belfield,Conor,J,04/08/1996,male,Not captured,Not captured,Not captured,Not captured,Not captured,Not captured,Not captured,Not captured,Not captured,Not captured,Not captured,Not captured,Not captured,,,Not captured,Not captured,Not captured,Not captured,510 1/2 Fernleaf Ave,,Corona Del Mar,California,92625,,,Not captured,Not captured,cbelfield@roadrunner.com,Not captured,701938361,,Not captured,Not captured,Not captured,Not captured,Not captured,Not captured,
Not captured,Not captured,07/15/2019,Not captured,Not captured,863949,020,00072,ARS-01-0051463,Beacon International,Not captured,Not captured,Not captured,,,,Fishbein,Bella,,11/27/1963,female,Not captured,Not captured,Not captured,Not captured,Not captured,Not captured,Not captured,Not captured,Not captured,Not captured,Not captured,Not captured,Not captured,,,Not captured,Not captured,Not captured,Not captured,1626 Upland Ave,,Jenkintown,Pennsylvania,19123,,,Not captured,Not captured,fishbein.family@gmail.com,Not captured,701938350,,Not captured,Not captured,Not captured,Not captured,Not captured,Not captured,
Not captured,Not captured,07/14/2019,Not captured,Not captured,863949,020,00072,ARS-01-0051459,Beacon International,Not captured,Not captured,Not captured,,,,Godinez,Roberto,C,12/21/1975,male,Not captured,Not captured,Not captured,Not captured,Not captured,Not captured,Not captured,Not captured,Not captured,Not captured,Not captured,Not captured,Not captured,,,Not captured,Not captured,Not captured,Not captured,Callej&oacute;n Miguel Guerrero 248,,Tijuana,,22400,,,Not captured,Not captured,roberto_godinez@hotmail.com,Not captured,701938343,,Not captured,Not captured,Not captured,Not captured,Not captured,Not captured,
Not captured,Not captured,07/15/2019,Not captured,Not captured,863949,020,00072,ARS-01-0051458,Beacon International,Not captured,Not captured,Not captured,Passport(555209733),,,Osborn,Lucas,J,07/11/2001,male,Not captured,Not captured,Not captured,Not captured,Not captured,Not captured,Not captured,Not captured,Not captured,Not captured,Not captured,Not captured,Not captured,Randall Osborn,Father,Not captured,Not captured,Not captured,Not captured,1334 Louray Drive,,Baton Rouge,Louisiana,70808,2256148707,2256148707,Not captured,Not captured,2001ljo@gmail.com,Not captured,701938342,,Not captured,Not captured,Not captured,Not captured,Not captured,Not captured,
Not captured,Not captured,07/14/2019,Not captured,Not captured,863949,020,00072,ARS-01-0051446,Beacon International,Not captured,Not captured,Not captured,,,,Hales,Simon,,02/26/1980,male,Not captured,Not captured,Not captured,Not captured,Not captured,Not captured,Not captured,Not captured,Not captured,Not captured,Not captured,Not captured,Not captured,,,Not captured,Not captured,Not captured,Not captured,PO Box 254,,White Salmon,Washington,98672,,,Not captured,Not captured,simon.a.hales@gmail.com,Not captured,701938330,,Not captured,Not captured,Not captured,Not captured,Not captured,Not captured,
Not captured,Not captured,07/15/2019,Not captured,Not captured,863949,020,00072,ARS-01-0051445,Beacon International,Not captured,Not captured,Not captured,Passport(148545818),,,CHACON MENESES,JULIETH CAROLINA,,08/06/1998,female,Not captured,Not captured,Not captured,Not captured,Not captured,Not captured,Not captured,Not captured,Not captured,Not captured,Not captured,Not captured,Not captured,JULIETH CAROLINA CHACON MENESES,MADRE,Not captured,Not captured,Not captured,Not captured,CALLE 16 ENTRE CARRERAS 11 Y 12 CASA NRO 11-6 LA ROMERA,,SAN CRISTOBAL,Tachira,5001,02763413694,04147085876,Not captured,Not captured,OFICINAFG2011@HOTMAIL.COM,Not captured,701938329,,Not captured,Not captured,Not captured,Not captured,Not captured,Not captured,
Not captured,Not captured,07/13/2019,Not captured,Not captured,863949,020,00072,ARS-01-0051438,Beacon International,Not captured,Not captured,Not captured,Passport(478415496),,,Walker,Rachel,A,10/17/1994,female,Not captured,Not captured,Not captured,Not captured,Not captured,Not captured,Not captured,Not captured,Not captured,Not captured,Not captured,Not captured,Not captured,,,Not captured,Not captured,Not captured,Not captured,717 E Meadows Dr.,,Mt Juliet,Tennessee,37122,6152180795,,Not captured,Not captured,rachelamanda13@gmail.com,Not captured,701938322,,Not captured,Not captured,Not captured,Not captured,Not captured,Not captured,
Not captured,Not captured,07/13/2019,Not captured,Not captured,863949,020,00072,ARS-01-0051437,Beacon International,Not captured,Not captured,Not captured,,,,Flagg,Cory,E,06/23/1982,female,Not captured,Not captured,Not captured,Not captured,Not captured,Not captured,Not captured,Not captured,Not captured,Not captured,Not captured,Not captured,Not captured,Cory Flagg,Wife,Not captured,Not captured,Not captured,Not captured,20868 W Elm Way,,Buckeye,Arizona,85396,6238502951,,Not captured,Not captured,flaggma@gmail.com,Not captured,701938321,,Not captured,Not captured,Not captured,Not captured,Not captured,Not captured,
Not captured,Not captured,07/13/2019,Not captured,Not captured,863949,020,00072,ARS-01-0051436,Beacon International,Not captured,Not captured,Not captured,,,,Flagg,Matthew,P,08/06/1982,male,Not captured,Not captured,Not captured,Not captured,Not captured,Not captured,Not captured,Not captured,Not captured,Not captured,Not captured,Not captured,Not captured,Cory Flagg,Wife,Not captured,Not captured,Not captured,Not captured,20868 W Elm Way,,Buckeye,Arizona,85396,6238502951,,Not captured,Not captured,flaggma@gmail.com,Not captured,701938320,,Not captured,Not captured,Not captured,Not captured,Not captured,Not captured,
Not captured,Not captured,07/15/2019,Not captured,Not captured,863949,020,00072,ARS-01-0051427,Beacon International,Not captured,Not captured,Not captured,Passport(593330857),,,Otterman,Jacob,D,04/22/1995,male,Not captured,Not captured,Not captured,Not captured,Not captured,Not captured,Not captured,Not captured,Not captured,Not captured,Not captured,Not captured,Not captured,Kathryn S Otterman,Wife,Not captured,Not captured,Not captured,Not captured,7078 Mountain Spring Trail,,Roanoke,Virginia,24018,5405898063,,Not captured,Not captured,jacobotterman04@gmail.com,Not captured,701938311,,Not captured,Not captured,Not captured,Not captured,Not captured,Not captured,
Not captured,Not captured,07/15/2019,Not captured,Not captured,863949,020,00072,ARS-01-0051423,Beacon International,Not captured,Not captured,Not captured,Passport(550102626),,,Olaizola Rosenblat,Mariana,,10/06/1990,female,Not captured,Not captured,Not captured,Not captured,Not captured,Not captured,Not captured,Not captured,Not captured,Not captured,Not captured,Not captured,Not captured,Maria Luisa Rosenblat de Olaizola,Mother,Not captured,Not captured,Not captured,Not captured,70 Howe Street Apt. 311,,New Haven,Connecticut,06511,3019155744,,Not captured,Not captured,olaizola.mariana@gmail.com,Not captured,701938301,,Not captured,Not captured,Not captured,Not captured,Not captured,Not captured,
Not captured,Not captured,07/15/2019,Not captured,Not captured,863949,020,00072,ARS-01-0051408,Beacon International,Not captured,Not captured,Not captured,Passport(498733904),,,Casalduc,Isis,,04/03/1981,female,Not captured,Not captured,Not captured,Not captured,Not captured,Not captured,Not captured,Not captured,Not captured,Not captured,Not captured,Not captured,Not captured,Markus Neuert,Spouse,Not captured,Not captured,Not captured,Not captured,Rappolz 6A,,Sulzberg,Bavaria,87477,+4915207505527,,Not captured,Not captured,isiscasalduc@gmail.com,Not captured,701938271,,Not captured,Not captured,Not captured,Not captured,Not captured,Not captured,
Not captured,Not captured,07/16/2019,Not captured,Not captured,863949,020,00072,ARS-01-0051392,Beacon International,Not captured,Not captured,Not captured,,,,Thompson,Arissa,G,06/29/2001,female,Not captured,Not captured,Not captured,Not captured,Not captured,Not captured,Not captured,Not captured,Not captured,Not captured,Not captured,Not captured,Not captured,Patrick Alan Thompson,self,Not captured,Not captured,Not captured,Not captured,336 Short St.,,Bishop,California,93514,9515292855,,Not captured,Not captured,patrick.alan.thompson@gmail.com,Not captured,701938251,,Not captured,Not captured,Not captured,Not captured,Not captured,Not captured,
Not captured,Not captured,07/16/2019,Not captured,Not captured,863949,020,00072,ARS-01-0051391,Beacon International,Not captured,Not captured,Not captured,,,,Thompson,Greta,L,02/18/1971,female,Not captured,Not captured,Not captured,Not captured,Not captured,Not captured,Not captured,Not captured,Not captured,Not captured,Not captured,Not captured,Not captured,Patrick Alan Thompson,self,Not captured,Not captured,Not captured,Not captured,336 Short St.,,Bishop,California,93514,9515292855,,Not captured,Not captured,patrick.alan.thompson@gmail.com,Not captured,701938250,,Not captured,Not captured,Not captured,Not captured,Not captured,Not captured,
Not captured,Not captured,07/16/2019,Not captured,Not captured,863949,020,00072,ARS-01-0051390,Beacon International,Not captured,Not captured,Not captured,Passport(467720532),,,Thompson,Patrick,A,05/19/1970,male,Not captured,Not captured,Not captured,Not captured,Not captured,Not captured,Not captured,Not captured,Not captured,Not captured,Not captured,Not captured,Not captured,Patrick Alan Thompson,self,Not captured,Not captured,Not captured,Not captured,336 Short St.,,Bishop,California,93514,9515292855,,Not captured,Not captured,patrick.alan.thompson@gmail.com,Not captured,701938249,,Not captured,Not captured,Not captured,Not captured,Not captured,Not captured,
Not captured,Not captured,07/15/2019,Not captured,Not captured,863949,020,00072,ARS-02-0051388,Beacon America,Not captured,Not captured,Not captured,,,,Katz,Eliyah,,05/22/2017,male,Not captured,Not captured,Not captured,Not captured,Not captured,Not captured,Not captured,Not captured,Not captured,Not captured,Not captured,Not captured,Not captured,,,Not captured,Not captured,Not captured,Not captured,214/1 Tomer Devorah St.,,Talmon,Yerushalayim,7193700,50 623 5620,,Not captured,Not captured,znk499@gmail.com,Not captured,701938247,,Not captured,Not captured,Not captured,Not captured,Not captured,Not captured,
Not captured,Not captured,07/15/2019,Not captured,Not captured,863949,020,00072,ARS-02-0051387,Beacon America,Not captured,Not captured,Not captured,,,,Katz,Amiad,,02/22/2015,male,Not captured,Not captured,Not captured,Not captured,Not captured,Not captured,Not captured,Not captured,Not captured,Not captured,Not captured,Not captured,Not captured,,,Not captured,Not captured,Not captured,Not captured,214/1 Tomer Devorah St.,,Talmon,Yerushalayim,7193700,50 623 5620,,Not captured,Not captured,znk499@gmail.com,Not captured,701938246,,Not captured,Not captured,Not captured,Not captured,Not captured,Not captured,
Not captured,Not captured,07/15/2019,Not captured,Not captured,863949,020,00072,ARS-02-0051386,Beacon America,Not captured,Not captured,Not captured,,,,Katz,Itai,,02/19/2013,male,Not captured,Not captured,Not captured,Not captured,Not captured,Not captured,Not captured,Not captured,Not captured,Not captured,Not captured,Not captured,Not captured,,,Not captured,Not captured,Not captured,Not captured,214/1 Tomer Devorah St.,,Talmon,Yerushalayim,7193700,50 623 5620,,Not captured,Not captured,znk499@gmail.com,Not captured,701938245,,Not captured,Not captured,Not captured,Not captured,Not captured,Not captured,
Not captured,Not captured,07/15/2019,Not captured,Not captured,863949,020,00072,ARS-02-0051385,Beacon America,Not captured,Not captured,Not captured,,,,Katz,Ayelet,,07/25/2011,female,Not captured,Not captured,Not captured,Not captured,Not captured,Not captured,Not captured,Not captured,Not captured,Not captured,Not captured,Not captured,Not captured,,,Not captured,Not captured,Not captured,Not captured,214/1 Tomer Devorah St.,,Talmon,Yerushalayim,7193700,50 623 5620,,Not captured,Not captured,znk499@gmail.com,Not captured,701938244,,Not captured,Not captured,Not captured,Not captured,Not captured,Not captured,
Not captured,Not captured,07/15/2019,Not captured,Not captured,863949,020,00072,ARS-02-0051384,Beacon America,Not captured,Not captured,Not captured,,,,Katz,Binyamin,,06/12/2009,male,Not captured,Not captured,Not captured,Not captured,Not captured,Not captured,Not captured,Not captured,Not captured,Not captured,Not captured,Not captured,Not captured,,,Not captured,Not captured,Not captured,Not captured,214/1 Tomer Devorah St.,,Talmon,Yerushalayim,7193700,50 623 5620,,Not captured,Not captured,znk499@gmail.com,Not captured,701938243,,Not captured,Not captured,Not captured,Not captured,Not captured,Not captured,
Not captured,Not captured,07/15/2019,Not captured,Not captured,863949,020,00072,ARS-02-0051383,Beacon America,Not captured,Not captured,Not captured,,,,Katz,Hallel,,12/09/2007,female,Not captured,Not captured,Not captured,Not captured,Not captured,Not captured,Not captured,Not captured,Not captured,Not captured,Not captured,Not captured,Not captured,,,Not captured,Not captured,Not captured,Not captured,214/1 Tomer Devorah St.,,Talmon,Yerushalayim,7193700,50 623 5620,,Not captured,Not captured,znk499@gmail.com,Not captured,701938242,,Not captured,Not captured,Not captured,Not captured,Not captured,Not captured,
Not captured,Not captured,07/15/2019,Not captured,Not captured,863949,020,00072,ARS-02-0051382,Beacon America,Not captured,Not captured,Not captured,,,,Katz,Miriam ,,01/24/1984,female,Not captured,Not captured,Not captured,Not captured,Not captured,Not captured,Not captured,Not captured,Not captured,Not captured,Not captured,Not captured,Not captured,,,Not captured,Not captured,Not captured,Not captured,214/1 Tomer Devorah St.,,Talmon,Yerushalayim,7193700,50 623 5620,,Not captured,Not captured,znk499@gmail.com,Not captured,701938241,,Not captured,Not captured,Not captured,Not captured,Not captured,Not captured,
Not captured,Not captured,07/15/2019,Not captured,Not captured,863949,020,00072,ARS-01-0051380,Beacon International,Not captured,Not captured,Not captured,,,,Epstein,Miriam E,,06/22/1974,female,Not captured,Not captured,Not captured,Not captured,Not captured,Not captured,Not captured,Not captured,Not captured,Not captured,Not captured,Not captured,Not captured,,,Not captured,Not captured,Not captured,Not captured,132 East 8th Street,,Lakewood,New Jersey,08701,732-575-8258,,Not captured,Not captured,butchep@yahoo.com,Not captured,701938239,,Not captured,Not captured,Not captured,Not captured,Not captured,Not captured,