EE Transaction Type,Dependent Transaction Type,Effective Date,EE Signature,EE Signature Date,Control,Suffix,Account,Plan Number,Plan Name,Claim Office,Network ID Number,Customer Code,EE SSN,Dependent SSN,Dependent Relationship,Last Name,First Name,Middle Initial,DOB,Gender,Ethnicity,PCP/PCD,PCP/PCD Current Patient,Provider Cap Office Number,COB,Dep Student Indicator,Dep OOA Indicator,EE Prior Coverage Indicator,EE Late Entrant,EE Language Indicator,Hire Date,Earnings,Earnings Frequency,Beneficiary (Last Name First Name MI),Beneficiary Relationship,Continuation of Coverage Expiration Date,Continuation of Coverage Event Date,Continuation of Coverage Length of Coverage,Work Location Zip Code,Street Address Line 1,Street Address Line 2,City,State,Zip Code,Home Phone Number,Work Phone Number,Accept Code,Evidence Code,EE Email Address,Communication Disability Code,EE Alternate ID,Dep Alternate ID,Old Control,Old Suffix,Old Account,New Control,New Suffix,New Account,
Not captured,Not captured,07/12/2019,Not captured,Not captured,863949,020,00072,ARS-01-0051430,Beacon International,Not captured,Not captured,Not captured,,,,Iacovino,Jewel,L,12/16/1998,female,Not captured,Not captured,Not captured,Not captured,Not captured,Not captured,Not captured,Not captured,Not captured,Not captured,Not captured,Not captured,Not captured,,,Not captured,Not captured,Not captured,Not captured,4813 Foster Way,,Arcade,California,95608,,,Not captured,Not captured,jeweli16@hotmail.com,Not captured,701938314,,Not captured,Not captured,Not captured,Not captured,Not captured,Not captured,
Not captured,Not captured,07/12/2019,Not captured,Not captured,863949,020,00072,ARS-01-0051426,Beacon International,Not captured,Not captured,Not captured,,,,Hiscock,Hamish,G,06/06/1992,male,Not captured,Not captured,Not captured,Not captured,Not captured,Not captured,Not captured,Not captured,Not captured,Not captured,Not captured,Not captured,Not captured,,,Not captured,Not captured,Not captured,Not captured,43 Highland Rd,,Somerville,Massachusetts,02144,,,Not captured,Not captured,hamishhiscock@gmail.com,Not captured,701938310,,Not captured,Not captured,Not captured,Not captured,Not captured,Not captured,
Not captured,Not captured,07/12/2019,Not captured,Not captured,863949,020,00072,ARS-01-0051425,Beacon International,Not captured,Not captured,Not captured,,,,Gang,Mika,,06/16/1988,female,Not captured,Not captured,Not captured,Not captured,Not captured,Not captured,Not captured,Not captured,Not captured,Not captured,Not captured,Not captured,Not captured,,,Not captured,Not captured,Not captured,Not captured,632 Gladstone Avenue,,Toronto,Ontario,m6h3j4,,,Not captured,Not captured,erosenblume@gmail.com,Not captured,701938303,,Not captured,Not captured,Not captured,Not captured,Not captured,Not captured,
Not captured,Not captured,07/12/2019,Not captured,Not captured,863949,020,00072,ARS-01-0051424,Beacon International,Not captured,Not captured,Not captured,,,,Rosenblum,Eyal,,09/09/1987,male,Not captured,Not captured,Not captured,Not captured,Not captured,Not captured,Not captured,Not captured,Not captured,Not captured,Not captured,Not captured,Not captured,,,Not captured,Not captured,Not captured,Not captured,632 Gladstone Avenue,,Toronto,Ontario,m6h3j4,,,Not captured,Not captured,erosenblume@gmail.com,Not captured,701938302,,Not captured,Not captured,Not captured,Not captured,Not captured,Not captured,
Not captured,Not captured,07/12/2019,Not captured,Not captured,863949,020,00072,ARS-01-0051422,Beacon International,Not captured,Not captured,Not captured,,,,Nicolaou,Aris,S,10/29/2014,male,Not captured,Not captured,Not captured,Not captured,Not captured,Not captured,Not captured,Not captured,Not captured,Not captured,Not captured,Not captured,Not captured,,,Not captured,Not captured,Not captured,Not captured,407 Washington Avenue Apt. 1C,,BROOKLYN,New York,11238-1853,,,Not captured,Not captured,jnicolaou@me.com,Not captured,701938300,,Not captured,Not captured,Not captured,Not captured,Not captured,Not captured,
Not captured,Not captured,07/12/2019,Not captured,Not captured,863949,020,00072,ARS-01-0051421,Beacon International,Not captured,Not captured,Not captured,,,,Dunlop,Megan,A,01/04/1976,female,Not captured,Not captured,Not captured,Not captured,Not captured,Not captured,Not captured,Not captured,Not captured,Not captured,Not captured,Not captured,Not captured,,,Not captured,Not captured,Not captured,Not captured,407 Washington Avenue Apt. 1C,,BROOKLYN,New York,11238-1853,,,Not captured,Not captured,jnicolaou@me.com,Not captured,701938299,,Not captured,Not captured,Not captured,Not captured,Not captured,Not captured,
Not captured,Not captured,07/12/2019,Not captured,Not captured,863949,020,00072,ARS-01-0051420,Beacon International,Not captured,Not captured,Not captured,,,,Nicolaou,Jerry,,10/08/1965,male,Not captured,Not captured,Not captured,Not captured,Not captured,Not captured,Not captured,Not captured,Not captured,Not captured,Not captured,Not captured,Not captured,,,Not captured,Not captured,Not captured,Not captured,407 Washington Avenue Apt. 1C,,BROOKLYN,New York,11238-1853,,,Not captured,Not captured,jnicolaou@me.com,Not captured,701938298,,Not captured,Not captured,Not captured,Not captured,Not captured,Not captured,
Not captured,Not captured,07/12/2019,Not captured,Not captured,863949,020,00072,ARS-01-0051419,Beacon International,Not captured,Not captured,Not captured,,,,Kolomiiets,Kateryna ,,12/04/2001,female,Not captured,Not captured,Not captured,Not captured,Not captured,Not captured,Not captured,Not captured,Not captured,Not captured,Not captured,Not captured,Not captured,,,Not captured,Not captured,Not captured,Not captured,435 HYLAN BLVD,,STATEN ISLAND,New York,10305,9173782078,,Not captured,Not captured,katykolomiiets@gmail.com,Not captured,701938297,,Not captured,Not captured,Not captured,Not captured,Not captured,Not captured,
Not captured,Not captured,07/12/2019,Not captured,Not captured,863949,020,00072,ARS-01-0051418,Beacon International,Not captured,Not captured,Not captured,Passport(FN556695),,,Kolomiiets,Nataliia,,11/04/1967,female,Not captured,Not captured,Not captured,Not captured,Not captured,Not captured,Not captured,Not captured,Not captured,Not captured,Not captured,Not captured,Not captured,,,Not captured,Not captured,Not captured,Not captured,435 HYLAN BLVD,,STATEN ISLAND,New York,10305,9173782078,,Not captured,Not captured,katykolomiiets@gmail.com,Not captured,701938296,,Not captured,Not captured,Not captured,Not captured,Not captured,Not captured,
Not captured,Not captured,07/12/2019,Not captured,Not captured,863949,020,00072,ARS-01-0051417,Beacon International,Not captured,Not captured,Not captured,,,,perez,yadna,,09/24/1968,female,Not captured,Not captured,Not captured,Not captured,Not captured,Not captured,Not captured,Not captured,Not captured,Not captured,Not captured,Not captured,Not captured,,,Not captured,Not captured,Not captured,Not captured,7501 sw 79 court,,miami,Florida,33143,,,Not captured,Not captured,oprzmurguia@yahoo.com,Not captured,701938295,,Not captured,Not captured,Not captured,Not captured,Not captured,Not captured,
Not captured,Not captured,07/12/2019,Not captured,Not captured,863949,020,00072,ARS-01-0051416,Beacon International,Not captured,Not captured,Not captured,,,,perez,omar,,07/26/1965,male,Not captured,Not captured,Not captured,Not captured,Not captured,Not captured,Not captured,Not captured,Not captured,Not captured,Not captured,Not captured,Not captured,,,Not captured,Not captured,Not captured,Not captured,7501 sw 79 court,,miami,Florida,33143,,,Not captured,Not captured,oprzmurguia@yahoo.com,Not captured,701938294,,Not captured,Not captured,Not captured,Not captured,Not captured,Not captured,
Not captured,Not captured,07/12/2019,Not captured,Not captured,863949,020,00072,ARS-01-0051413,Beacon International,Not captured,Not captured,Not captured,,,,Gerber,Suzanne,,09/23/1982,female,Not captured,Not captured,Not captured,Not captured,Not captured,Not captured,Not captured,Not captured,Not captured,Not captured,Not captured,Not captured,Not captured,,,Not captured,Not captured,Not captured,Not captured,621 Elm Pl,,Edmonds,Washington,98020,,,Not captured,Not captured,cinemasuz@gmail.com,Not captured,701938291,,Not captured,Not captured,Not captured,Not captured,Not captured,Not captured,
Not captured,Not captured,07/11/2019,Not captured,Not captured,863949,020,00072,ARS-02-0051407,Beacon America,Not captured,Not captured,Not captured,,,,Kohn,Shmuel,,02/02/1990,male,Not captured,Not captured,Not captured,Not captured,Not captured,Not captured,Not captured,Not captured,Not captured,Not captured,Not captured,Not captured,Not captured,,,Not captured,Not captured,Not captured,Not captured,187 Gail Crest Circle,,Toronto,Ontario,00000,437-216-8455,,Not captured,Not captured,rivkylamberger@gmail.com,Not captured,701938270,,Not captured,Not captured,Not captured,Not captured,Not captured,Not captured,
Not captured,Not captured,07/11/2019,Not captured,Not captured,863949,020,00072,OVI-28-0051403,OverseasCare Visitors Insurance Plan,Not captured,Not captured,Not captured,,,,Pydi,Prameelamma,,07/28/1962,female,Not captured,Not captured,Not captured,Not captured,Not captured,Not captured,Not captured,Not captured,Not captured,Not captured,Not captured,Not captured,Not captured,,,Not captured,Not captured,Not captured,Not captured,2412 Christiana Mdws,,Bear,Delaware,19701,4042877489,,Not captured,Not captured,Murali1217@gmail.com,Not captured,701938266,,Not captured,Not captured,Not captured,Not captured,Not captured,Not captured,
Not captured,Not captured,07/11/2019,Not captured,Not captured,863949,020,00072,ARS-01-0051402,Beacon International,Not captured,Not captured,Not captured,,,,Lawless,Nicole,,08/29/1976,female,Not captured,Not captured,Not captured,Not captured,Not captured,Not captured,Not captured,Not captured,Not captured,Not captured,Not captured,Not captured,Not captured,,,Not captured,Not captured,Not captured,Not captured,1043 Cape May Drive,,Pittsburg,California,94565,,,Not captured,Not captured,kalmuqtadir@yahoo.com,Not captured,701938265,,Not captured,Not captured,Not captured,Not captured,Not captured,Not captured,
Not captured,Not captured,07/11/2019,Not captured,Not captured,863949,020,00072,ARS-01-0051401,Beacon International,Not captured,Not captured,Not captured,,,,Lawless,Karriem,,06/13/1972,male,Not captured,Not captured,Not captured,Not captured,Not captured,Not captured,Not captured,Not captured,Not captured,Not captured,Not captured,Not captured,Not captured,,,Not captured,Not captured,Not captured,Not captured,1043 Cape May Drive,,Pittsburg,California,94565,,,Not captured,Not captured,kalmuqtadir@yahoo.com,Not captured,701938264,,Not captured,Not captured,Not captured,Not captured,Not captured,Not captured,
Not captured,Not captured,07/11/2019,Not captured,Not captured,863949,020,00072,ARS-01-0051399,Beacon International,Not captured,Not captured,Not captured,,,,Kosterlitz,Morgan,A,02/05/1991,female,Not captured,Not captured,Not captured,Not captured,Not captured,Not captured,Not captured,Not captured,Not captured,Not captured,Not captured,Not captured,Not captured,,,Not captured,Not captured,Not captured,Not captured,28 Saturn Way,,Topton,North Carolina,28781,,,Not captured,Not captured,mkosterlitz@gmail.com,Not captured,701938262,,Not captured,Not captured,Not captured,Not captured,Not captured,Not captured,
Not captured,Not captured,07/10/2019,Not captured,Not captured,863949,020,00072,ARS-02-0051397,Beacon America,Not captured,Not captured,Not captured,,,,winny,antonia,k,10/11/2000,female,Not captured,Not captured,Not captured,Not captured,Not captured,Not captured,Not captured,Not captured,Not captured,Not captured,Not captured,Not captured,Not captured,,,Not captured,Not captured,Not captured,Not captured,PO Box 7478,,Boulder,,80306,,,Not captured,Not captured,mariah@bdanced.com,Not captured,701938260,,Not captured,Not captured,Not captured,Not captured,Not captured,Not captured,
Not captured,Not captured,07/10/2019,Not captured,Not captured,863949,020,00072,ARS-02-0051396,Beacon America,Not captured,Not captured,Not captured,,,,Ferreira,Ytalloyan,D,05/26/2016,male,Not captured,Not captured,Not captured,Not captured,Not captured,Not captured,Not captured,Not captured,Not captured,Not captured,Not captured,Not captured,Not captured,,,Not captured,Not captured,Not captured,Not captured,PO Box 7488,,Boulder,,80306,,,Not captured,Not captured,mariah@bdanced.com,Not captured,701938259,,Not captured,Not captured,Not captured,Not captured,Not captured,Not captured,
Not captured,Not captured,07/10/2019,Not captured,Not captured,863949,020,00072,ARS-01-0051393,Beacon International,Not captured,Not captured,Not captured,,,,mendelow,levi,,03/07/1980,male,Not captured,Not captured,Not captured,Not captured,Not captured,Not captured,Not captured,Not captured,Not captured,Not captured,Not captured,Not captured,Not captured,,,Not captured,Not captured,Not captured,Not captured,137 Putnam Road,,New Canaan,Connecticut,06840,,,Not captured,Not captured,levimen@gmail.com,Not captured,701938255,,Not captured,Not captured,Not captured,Not captured,Not captured,Not captured,
Not captured,Not captured,07/10/2019,Not captured,Not captured,863949,020,00072,ARS-02-0051389,Beacon America,Not captured,Not captured,Not captured,Passport(G25040448),,,barraza velasco,Ricardo ,Javier,11/21/1963,male,Not captured,Not captured,Not captured,Not captured,Not captured,Not captured,Not captured,Not captured,Not captured,Not captured,Not captured,Not captured,Not captured, ,,Not captured,Not captured,Not captured,Not captured,sm 15 mz 11 lote 16,,cancun,Quintana Roo,77505,+529985771779,+529988840434,Not captured,Not captured,ricardojbarraza@gmail.com,Not captured,701938248,,Not captured,Not captured,Not captured,Not captured,Not captured,Not captured,
Not captured,Not captured,07/10/2019,Not captured,Not captured,863949,020,00072,ARS-01-0051381,Beacon International,Not captured,Not captured,Not captured,,,,Lesha,Hadassah,,02/26/2004,female,Not captured,Not captured,Not captured,Not captured,Not captured,Not captured,Not captured,Not captured,Not captured,Not captured,Not captured,Not captured,Not captured,,,Not captured,Not captured,Not captured,Not captured,132 East 8th street,,Lakewood,New Jersey,08701,732-575-8258,,Not captured,Not captured,butchep@yahoo.com,Not captured,701938240,,Not captured,Not captured,Not captured,Not captured,Not captured,Not captured,
Not captured,Not captured,07/11/2019,Not captured,Not captured,863949,020,00072,ARS-03-0051336,Essential America,Not captured,Not captured,Not captured,Passport(L3141452),,,Vaddepalli,Balaji,,10/02/1980,male,Not captured,Not captured,Not captured,Not captured,Not captured,Not captured,Not captured,Not captured,Not captured,Not captured,Not captured,Not captured,Not captured,,,Not captured,Not captured,Not captured,Not captured,Sriy 9 Sedan Marinasuda,,Hyderabad,Haryana,500049,6788002676,,Not captured,Not captured,bharati@vistorsinsurance.com,Not captured,701938100,,Not captured,Not captured,Not captured,Not captured,Not captured,Not captured,
Not captured,Not captured,07/10/2019,Not captured,Not captured,863949,020,00072,ARS-01-0051375,Beacon International,Not captured,Not captured,Not captured,,,,bar-el,tsofia,,09/09/1964,female,Not captured,Not captured,Not captured,Not captured,Not captured,Not captured,Not captured,Not captured,Not captured,Not captured,Not captured,Not captured,Not captured,,,Not captured,Not captured,Not captured,Not captured,p o box 232174,,encinitas,California,92023,,,Not captured,Not captured,tsofia99@hotmail.com,Not captured,701938234,,Not captured,Not captured,Not captured,Not captured,Not captured,Not captured,
Not captured,Not captured,07/10/2019,Not captured,Not captured,863949,020,00072,ARS-01-0051374,Beacon International,Not captured,Not captured,Not captured,,,,gal,nirel,,06/28/2002,male,Not captured,Not captured,Not captured,Not captured,Not captured,Not captured,Not captured,Not captured,Not captured,Not captured,Not captured,Not captured,Not captured,,,Not captured,Not captured,Not captured,Not captured,p o box 232174,,encinitas,California,92023,,,Not captured,Not captured,tsofia99@hotmail.com,Not captured,701938233,,Not captured,Not captured,Not captured,Not captured,Not captured,Not captured,
Not captured,Not captured,07/10/2019,Not captured,Not captured,863949,020,00072,ARS-01-0051373,Beacon International,Not captured,Not captured,Not captured,,,,Sydavar,Helen,A,04/16/1965,female,Not captured,Not captured,Not captured,Not captured,Not captured,Not captured,Not captured,Not captured,Not captured,Not captured,Not captured,Not captured,Not captured,,,Not captured,Not captured,Not captured,Not captured,16-V Ridge Road,,Greenbelt,Maryland,20770,,,Not captured,Not captured,hsydavar@rcn.com,Not captured,701938232,,Not captured,Not captured,Not captured,Not captured,Not captured,Not captured,
Not captured,Not captured,07/10/2019,Not captured,Not captured,863949,020,00072,ARS-03-0051341,Essential America,Not captured,Not captured,Not captured,Passport(499312561),,,Uhl,Melinda,Christine,12/13/1982,female,Not captured,Not captured,Not captured,Not captured,Not captured,Not captured,Not captured,Not captured,Not captured,Not captured,Not captured,Not captured,Not captured,,,Not captured,Not captured,Not captured,Not captured,Km 11.2 Carr Vieja a Leon,,Managua,Managua,,50578730641,,Not captured,Not captured,uhlboys@gmail.com,Not captured,701938108,,Not captured,Not captured,Not captured,Not captured,Not captured,Not captured,
Not captured,Not captured,07/10/2019,Not captured,Not captured,863949,020,00072,ARS-03-0051341,Essential America,Not captured,Not captured,Not captured,,Passport(473272855),Spouse,Uhl,Christopher,Glen,03/17/1977,male,Not captured,Not captured,Not captured,Not captured,Not captured,Not captured,Not captured,Not captured,Not captured,Not captured,Not captured,Not captured,Not captured,,,Not captured,Not captured,Not captured,Not captured,Km 11.2 Carr Vieja a Leon,,Managua,Managua,,50578730641,,Not captured,Not captured,uhlboys@gmail.com,Not captured,,701938109,Not captured,Not captured,Not captured,Not captured,Not captured,Not captured,
Not captured,Not captured,07/10/2019,Not captured,Not captured,863949,020,00072,ARS-03-0051341,Essential America,Not captured,Not captured,Not captured,,Passport(514160417),Dependant,Uhl,Kaden,Elijah,02/22/2004,male,Not captured,Not captured,Not captured,Not captured,Not captured,Not captured,Not captured,Not captured,Not captured,Not captured,Not captured,Not captured,Not captured,,,Not captured,Not captured,Not captured,Not captured,Km 11.2 Carr Vieja a Leon,,Managua,Managua,,50578730641,,Not captured,Not captured,uhlboys@gmail.com,Not captured,,701938110,Not captured,Not captured,Not captured,Not captured,Not captured,Not captured,
Not captured,Not captured,07/10/2019,Not captured,Not captured,863949,020,00072,ARS-03-0051341,Essential America,Not captured,Not captured,Not captured,,Passport(514160426),Dependant,Uhl,Micah,Evan,01/30/2007,male,Not captured,Not captured,Not captured,Not captured,Not captured,Not captured,Not captured,Not captured,Not captured,Not captured,Not captured,Not captured,Not captured,,,Not captured,Not captured,Not captured,Not captured,Km 11.2 Carr Vieja a Leon,,Managua,Managua,,50578730641,,Not captured,Not captured,uhlboys@gmail.com,Not captured,,701938111,Not captured,Not captured,Not captured,Not captured,Not captured,Not captured,
Not captured,Not captured,07/10/2019,Not captured,Not captured,863949,020,00072,ARS-03-0051341,Essential America,Not captured,Not captured,Not captured,,Passport(514160418),Dependant,Uhl,Jansen,Emery,09/15/2009,male,Not captured,Not captured,Not captured,Not captured,Not captured,Not captured,Not captured,Not captured,Not captured,Not captured,Not captured,Not captured,Not captured,,,Not captured,Not captured,Not captured,Not captured,Km 11.2 Carr Vieja a Leon,,Managua,Managua,,50578730641,,Not captured,Not captured,uhlboys@gmail.com,Not captured,,701938112,Not captured,Not captured,Not captured,Not captured,Not captured,Not captured,
Not captured,Not captured,07/10/2019,Not captured,Not captured,863949,020,00072,ARS-03-0051341,Essential America,Not captured,Not captured,Not captured,,Passport(514160424),Dependant,Uhl,Lucas,Everett,07/03/2011,male,Not captured,Not captured,Not captured,Not captured,Not captured,Not captured,Not captured,Not captured,Not captured,Not captured,Not captured,Not captured,Not captured,,,Not captured,Not captured,Not captured,Not captured,Km 11.2 Carr Vieja a Leon,,Managua,Managua,,50578730641,,Not captured,Not captured,uhlboys@gmail.com,Not captured,,701938113,Not captured,Not captured,Not captured,Not captured,Not captured,Not captured,
Not captured,Not captured,07/10/2019,Not captured,Not captured,863949,020,00072,OVI-28-0051369,OverseasCare Visitors Insurance Plan,Not captured,Not captured,Not captured,Passport(S9618666),,,KRISHNASAMY KUNJAMMAL,JEYANTHI,,06/18/1961,male,Not captured,Not captured,Not captured,Not captured,Not captured,Not captured,Not captured,Not captured,Not captured,Not captured,Not captured,Not captured,Not captured,SARANYAA DHAYANITHI,DAUGHTER,Not captured,Not captured,Not captured,Not captured,899 POWERS FERRY RD SE APT K10,,MARIETTA,Georgia,30067,4048190812,,Not captured,Not captured,shyampsgtech@gmail.com,Not captured,701938146,,Not captured,Not captured,Not captured,Not captured,Not captured,Not captured,
Not captured,Not captured,07/10/2019,Not captured,Not captured,863949,020,00072,ARS-02-0051368,Beacon America,Not captured,Not captured,Not captured,Passport(S9618131),,,THAMMA NAICKER,DHAYANITHI,,05/02/1961,male,Not captured,Not captured,Not captured,Not captured,Not captured,Not captured,Not captured,Not captured,Not captured,Not captured,Not captured,Not captured,Not captured,SARANYAA DHAYANITHI,DAUGHTER,Not captured,Not captured,Not captured,Not captured,899 POWERS FERRY RD SE APT K10,,Marietta,Georgia,30067,4048190812,,Not captured,Not captured,shyampsgtech@gmail.com,Not captured,701938145,,Not captured,Not captured,Not captured,Not captured,Not captured,Not captured,
Not captured,Not captured,07/09/2019,Not captured,Not captured,863949,020,00072,ARS-01-0051367,Beacon International,Not captured,Not captured,Not captured,,,,Inoue,Kuniaki,,03/15/1987,male,Not captured,Not captured,Not captured,Not captured,Not captured,Not captured,Not captured,Not captured,Not captured,Not captured,Not captured,Not captured,Not captured,,,Not captured,Not captured,Not captured,Not captured,231 W 136th St Apt303,,New York,New York,10030,,,Not captured,Not captured,kuniinoue2@gmail.com,Not captured,701938140,,Not captured,Not captured,Not captured,Not captured,Not captured,Not captured,
Not captured,Not captured,07/09/2019,Not captured,Not captured,863949,020,00072,ARS-02-0051355,Beacon America,Not captured,Not captured,Not captured,Passport(E97899034),,,Lu,Yufei,,03/20/2011,female,Not captured,Not captured,Not captured,Not captured,Not captured,Not captured,Not captured,Not captured,Not captured,Not captured,Not captured,Not captured,Not captured,Jacob Huang,Agent,Not captured,Not captured,Not captured,Not captured,108 Austree Dr,,Columbia,South Carolina,29229,8034044015,,Not captured,Not captured,xbhuang4@gmail.com,Not captured,701938127,,Not captured,Not captured,Not captured,Not captured,Not captured,Not captured,